[Swift CI] Build Failure: 0. OSS - Swift Incremental RA - Ubuntu 16.10 (master) #2664


(Erik Eckstein) #1

Mishal, can you please clean the workspace?
Another missing build dependency.

Thanks

···

On Mar 27, 2017, at 11:25 AM, no-reply@swift.org wrote:

[FAILURE] oss-swift-incremental-RA-linux-ubuntu-16_10 [#2664]

Build URL: https://ci.swift.org/job/oss-swift-incremental-RA-linux-ubuntu-16_10/2664/
Project: oss-swift-incremental-RA-linux-ubuntu-16_10
Date of build: Mon, 27 Mar 2017 11:16:27 -0700
Build duration: 8 min 57 sec
Identified problems:

Compile Error: This build failed because of a compile error. Below is a list of all errors in the build log:
Indication 1 <https://ci.swift.org//job/oss-swift-incremental-RA-linux-ubuntu-16_10/2664/consoleFull#903511154ee1a197b-acac-4b17-83cf-a53b95139a76>
Regression test failed: This build failed because a regression test in the test suite FAILed. Below is a list of all errors:
Indication 1 <https://ci.swift.org//job/oss-swift-incremental-RA-linux-ubuntu-16_10/2664/consoleFull#724491979fca400bf-2f4a-462e-b517-e058d770b2d7>
Tests:

Name: Swift(linux-x86_64)
Failed: 1 test(s), Passed: 9102 test(s), Total: 9103 test(s)
Failed: Swift(linux-x86_64).Reflection.typeref_decoding.swift <https://ci.swift.org/job/oss-swift-incremental-RA-linux-ubuntu-16_10/2664/testReport/junit/Swift(linux-x86_64)/Reflection/typeref_decoding_swift>
Name: Swift-Unit
Failed: 0 test(s), Passed: 416 test(s), Total: 416 test(s)

Changes

Commit cd3da4a218924db9af70d6e68b0cb79c89e1ea57 by Erik Eckstein:
Demangling: Print varargs correctly.

edit: test/Demangle/Inputs/manglings.txt
edit: lib/Demangling/NodePrinter.cpp
edit: test/Reflection/typeref_decoding.swift


(Mishal Shah) #2

Please file a bug for missing dependency.

Workspace deleted.

Thanks,
Mishal Sha

···

On Mar 27, 2017, at 11:43 AM, Erik Eckstein <eeckstein@apple.com> wrote:

Mishal, can you please clean the workspace?
Another missing build dependency.

Thanks

On Mar 27, 2017, at 11:25 AM, no-reply@swift.org <mailto:no-reply@swift.org> wrote:

[FAILURE] oss-swift-incremental-RA-linux-ubuntu-16_10 [#2664]

Build URL: https://ci.swift.org/job/oss-swift-incremental-RA-linux-ubuntu-16_10/2664/
Project: oss-swift-incremental-RA-linux-ubuntu-16_10
Date of build: Mon, 27 Mar 2017 11:16:27 -0700
Build duration: 8 min 57 sec
Identified problems:

Compile Error: This build failed because of a compile error. Below is a list of all errors in the build log:
Indication 1 <https://ci.swift.org//job/oss-swift-incremental-RA-linux-ubuntu-16_10/2664/consoleFull#903511154ee1a197b-acac-4b17-83cf-a53b95139a76>
Regression test failed: This build failed because a regression test in the test suite FAILed. Below is a list of all errors:
Indication 1 <https://ci.swift.org//job/oss-swift-incremental-RA-linux-ubuntu-16_10/2664/consoleFull#724491979fca400bf-2f4a-462e-b517-e058d770b2d7>
Tests:

Name: Swift(linux-x86_64)
Failed: 1 test(s), Passed: 9102 test(s), Total: 9103 test(s)
Failed: Swift(linux-x86_64).Reflection.typeref_decoding.swift <https://ci.swift.org/job/oss-swift-incremental-RA-linux-ubuntu-16_10/2664/testReport/junit/Swift(linux-x86_64)/Reflection/typeref_decoding_swift>
Name: Swift-Unit
Failed: 0 test(s), Passed: 416 test(s), Total: 416 test(s)

Changes

Commit cd3da4a218924db9af70d6e68b0cb79c89e1ea57 by Erik Eckstein:
Demangling: Print varargs correctly.

edit: test/Demangle/Inputs/manglings.txt
edit: lib/Demangling/NodePrinter.cpp
edit: test/Reflection/typeref_decoding.swift


(Erik Eckstein) #3

Please file a bug for missing dependency.

I already did 2 month ago: rdar://problem/30315400 <rdar://problem/30315400>

···

On Mar 27, 2017, at 12:20 PM, Mishal Shah <mishal_shah@apple.com> wrote:

Workspace deleted.

Thanks,
Mishal Sha

On Mar 27, 2017, at 11:43 AM, Erik Eckstein <eeckstein@apple.com <mailto:eeckstein@apple.com>> wrote:

Mishal, can you please clean the workspace?
Another missing build dependency.

Thanks

On Mar 27, 2017, at 11:25 AM, no-reply@swift.org <mailto:no-reply@swift.org> wrote:

[FAILURE] oss-swift-incremental-RA-linux-ubuntu-16_10 [#2664]

Build URL: https://ci.swift.org/job/oss-swift-incremental-RA-linux-ubuntu-16_10/2664/
Project: oss-swift-incremental-RA-linux-ubuntu-16_10
Date of build: Mon, 27 Mar 2017 11:16:27 -0700
Build duration: 8 min 57 sec
Identified problems:

Compile Error: This build failed because of a compile error. Below is a list of all errors in the build log:
Indication 1 <https://ci.swift.org//job/oss-swift-incremental-RA-linux-ubuntu-16_10/2664/consoleFull#903511154ee1a197b-acac-4b17-83cf-a53b95139a76>
Regression test failed: This build failed because a regression test in the test suite FAILed. Below is a list of all errors:
Indication 1 <https://ci.swift.org//job/oss-swift-incremental-RA-linux-ubuntu-16_10/2664/consoleFull#724491979fca400bf-2f4a-462e-b517-e058d770b2d7>
Tests:

Name: Swift(linux-x86_64)
Failed: 1 test(s), Passed: 9102 test(s), Total: 9103 test(s)
Failed: Swift(linux-x86_64).Reflection.typeref_decoding.swift <https://ci.swift.org/job/oss-swift-incremental-RA-linux-ubuntu-16_10/2664/testReport/junit/Swift(linux-x86_64)/Reflection/typeref_decoding_swift>
Name: Swift-Unit
Failed: 0 test(s), Passed: 416 test(s), Total: 416 test(s)

Changes

Commit cd3da4a218924db9af70d6e68b0cb79c89e1ea57 by Erik Eckstein:
Demangling: Print varargs correctly.

edit: test/Demangle/Inputs/manglings.txt
edit: lib/Demangling/NodePrinter.cpp
edit: test/Reflection/typeref_decoding.swift


(Mishal Shah) #4

Thanks!

···

On Mar 27, 2017, at 12:23 PM, Erik Eckstein <eeckstein@apple.com> wrote:

On Mar 27, 2017, at 12:20 PM, Mishal Shah <mishal_shah@apple.com <mailto:mishal_shah@apple.com>> wrote:

Please file a bug for missing dependency.

I already did 2 month ago: rdar://problem/30315400 <rdar://problem/30315400>

Workspace deleted.

Thanks,
Mishal Sha

On Mar 27, 2017, at 11:43 AM, Erik Eckstein <eeckstein@apple.com <mailto:eeckstein@apple.com>> wrote:

Mishal, can you please clean the workspace?
Another missing build dependency.

Thanks

On Mar 27, 2017, at 11:25 AM, no-reply@swift.org <mailto:no-reply@swift.org> wrote:

[FAILURE] oss-swift-incremental-RA-linux-ubuntu-16_10 [#2664]

Build URL: https://ci.swift.org/job/oss-swift-incremental-RA-linux-ubuntu-16_10/2664/
Project: oss-swift-incremental-RA-linux-ubuntu-16_10
Date of build: Mon, 27 Mar 2017 11:16:27 -0700
Build duration: 8 min 57 sec
Identified problems:

Compile Error: This build failed because of a compile error. Below is a list of all errors in the build log:
Indication 1 <https://ci.swift.org//job/oss-swift-incremental-RA-linux-ubuntu-16_10/2664/consoleFull#903511154ee1a197b-acac-4b17-83cf-a53b95139a76>
Regression test failed: This build failed because a regression test in the test suite FAILed. Below is a list of all errors:
Indication 1 <https://ci.swift.org//job/oss-swift-incremental-RA-linux-ubuntu-16_10/2664/consoleFull#724491979fca400bf-2f4a-462e-b517-e058d770b2d7>
Tests:

Name: Swift(linux-x86_64)
Failed: 1 test(s), Passed: 9102 test(s), Total: 9103 test(s)
Failed: Swift(linux-x86_64).Reflection.typeref_decoding.swift <https://ci.swift.org/job/oss-swift-incremental-RA-linux-ubuntu-16_10/2664/testReport/junit/Swift(linux-x86_64)/Reflection/typeref_decoding_swift>
Name: Swift-Unit
Failed: 0 test(s), Passed: 416 test(s), Total: 416 test(s)

Changes

Commit cd3da4a218924db9af70d6e68b0cb79c89e1ea57 by Erik Eckstein:
Demangling: Print varargs correctly.

edit: test/Demangle/Inputs/manglings.txt
edit: lib/Demangling/NodePrinter.cpp
edit: test/Reflection/typeref_decoding.swift