[Swift CI] Build Failure: 0. OSS - Swift Incremental RA - Ubuntu 16.10 (master) #1789

16_10/buildbot_incremental/libdispatch-linux-x86_64/src/swiftDispatch.o
<><unknown>:0: error: cannot open file '/home/buildnode/jenkins/workspace/oss-swift-incremental-RA-linux-ubuntu-16_10/swift-corelibs-libdispatch/private/module.modulemap': No such file or directory

They come and go ...

···

On Dec 1, 2017, at 11:49 AM, no-reply@swift.org wrote:

[FAILURE] oss-swift-incremental-RA-linux-ubuntu-16_10 [#1789]

Build URL: https://ci.swift.org/job/oss-swift-incremental-RA-linux-ubuntu-16_10/1789/
Project: oss-swift-incremental-RA-linux-ubuntu-16_10
Date of build: Fri, 01 Dec 2017 13:44:19 -0600
Build duration: 4 min 52 sec
Identified problems:

Compile Error: This build failed because of a compile error. Below is a list of all errors in the build log:
Indication 1 <https://ci.swift.org//job/oss-swift-incremental-RA-linux-ubuntu-16_10/1789/consoleFull#-4702510123122a513-f36a-4c87-8ed7-cbc36a1ec144>
Tests:

Name: Swift(linux-x86_64)
Failed: 0 test(s), Passed: 10088 test(s), Total: 10088 test(s)
Name: Swift-Unit
Failed: 0 test(s), Passed: 486 test(s), Total: 486 test(s)

Changes

Commit 5edbefcc6978efb35d92b1107f131a43a5aae651 by github:
[ClangImporter] Break circularity when importing macros (#13099)

edit: test/ClangImporter/macros.swift
edit: test/Inputs/clang-importer-sdk/usr/include/macros.h
edit: lib/ClangImporter/ImportMacro.cpp

16_10/buildbot_incremental/libdispatch-linux-x86_64/src/swiftDispatch.o<unknown>:0: error: cannot open file '/home/buildnode/jenkins/workspace/oss-swift-incremental-RA-linux-ubuntu-16_10/swift-corelibs-libdispatch/private/module.modulemap': No such file or directory

They come and go ...

Yeah, I believe I've tracked down this intermittent issue. However, AIUI,
libdispatch has some tagging process that I do not know, so I have not
committed PR#324 for swift-corelibs-libdispatch which should fix this issue.

···

On Fri, Dec 1, 2017 at 11:53 AM, Arnold Schwaighofer via swift-dev < swift-dev@swift.org> wrote:

On Dec 1, 2017, at 11:49 AM, no-reply@swift.org wrote:

[FAILURE] oss-swift-incremental-RA-linux-ubuntu-16_10 [#1789]
Build URL: https://ci.swift.org/job/oss-swift-incremental-RA-linux-
ubuntu-16_10/1789/
Project: oss-swift-incremental-RA-linux-ubuntu-16_10
Date of build: Fri, 01 Dec 2017 13:44:19 -0600
Build duration: 4 min 52 secIdentified problems:

   - Compile Error: This build failed because of a compile error. Below
   is a list of all errors in the build log:
      - Indication 1
      <https://ci.swift.org//job/oss-swift-incremental-RA-linux-ubuntu-16_10/1789/consoleFull#-4702510123122a513-f36a-4c87-8ed7-cbc36a1ec144>

Tests:
Name: *Swift(linux-x86_64)*
Failed: 0 test(s), Passed: 10088 test(s), Total: 10088 test(s)
Name: *Swift-Unit*
Failed: 0 test(s), Passed: 486 test(s), Total: 486 test(s)

Changes

   - Commit *5edbefcc6978efb35d92b1107f131a43a5aae651* by *github:*

   [ClangImporter] Break circularity when importing macros (#13099)
   - *edit*: test/ClangImporter/macros.swift
      - *edit*: test/Inputs/clang-importer-sdk/usr/include/macros.h
      - *edit*: lib/ClangImporter/ImportMacro.cpp

_______________________________________________
swift-dev mailing list
swift-dev@swift.org
https://lists.swift.org/mailman/listinfo/swift-dev

--
Saleem Abdulrasool
compnerd (at) compnerd (dot) org