[Swift CI] Build Failure: 0. OSS - Swift Incremental RA - Ubuntu 16.10 (master) #1693


(Douglas Gregor) #1

/home/buildnode/jenkins/workspace/oss-swift-incremental-RA-linux-ubuntu-16_10/buildbot_incremental/foundation-linux-x86_64/TestFoundation/TestFoundation: symbol lookup error: /home/buildnode/jenkins/workspace/oss-swift-incremental-RA-linux-ubuntu-16_10/buildbot_incremental/foundation-linux-x86_64/TestFoundation/TestFoundation: undefined symbol: _TFesRxs17MutableCollectionWx8Iterator7Element_s10ComparablerS_6sortedfT_GSaWxS0_S1___
/home/buildnode/jenkins/workspace/oss-swift-incremental-RA-linux-ubuntu-16_10/swift/utils/build-script: fatal error: command terminated with a non-zero exit status 127, aborting

Foundation doesn’t seem to have rebuilt… do we need to clear the workspace?

  - Doug

···

On Feb 2, 2017, at 9:59 PM, no-reply@swift.org wrote:

[FAILURE] oss-swift-incremental-RA-linux-ubuntu-16_10 [#1693]

Build URL: https://ci.swift.org/job/oss-swift-incremental-RA-linux-ubuntu-16_10/1693/
Project: oss-swift-incremental-RA-linux-ubuntu-16_10
Date of build: Thu, 02 Feb 2017 21:46:26 -0800
Build duration: 12 min
Tests:

Name: Swift(linux-x86_64)
Failed: 0 test(s), Passed: 8907 test(s), Total: 8907 test(s)
Name: Swift-Unit
Failed: 0 test(s), Passed: 305 test(s), Total: 305 test(s)

Changes

Commit 25017f0a8eaac55c5dfe5435a287eedce5774099 by dgregor:
[Archetype builder] Remove weird concrete-same-type assignment.

edit: lib/AST/ArchetypeBuilder.cpp

Commit 2dcf6f0e278b34f5654ca2c1f6601095631ce990 by dgregor:
[Archetype builder] Look up nested types on the requested parent.

edit: test/Generics/associated_type_typo.swift
edit: lib/AST/ArchetypeBuilder.cpp

Commit ded7e83aaba05c297262e66553e35d1d456036f9 by dgregor:
[Archetype builder] Make canonicalization of dependent types

edit: test/Generics/requirement_inference.swift
edit: test/decl/protocol/recursive_requirement.swift
edit: test/Generics/associated_type_typo.swift
edit: lib/Sema/GenericTypeResolver.h
edit: lib/Sema/TypeCheckType.cpp
edit: lib/AST/GenericSignature.cpp
edit: lib/AST/ArchetypeBuilder.cpp
edit: lib/Sema/TypeCheckGeneric.cpp
edit: include/swift/AST/ArchetypeBuilder.h

Commit ee00acf3d032bf8b040329d62fa96c6a2d81f64f by dgregor:
[AST] Remove GenericSignature::getRepresentative(). NFC

edit: lib/AST/GenericSignature.cpp
edit: include/swift/AST/GenericSignature.h


(Arnold Schwaighofer) #2

Yes.

https://bugs.swift.org/browse/SR-1517
https://bugs.swift.org/browse/SR-3621

···

On Feb 2, 2017, at 10:18 PM, Douglas Gregor via swift-dev <swift-dev@swift.org> wrote:

/home/buildnode/jenkins/workspace/oss-swift-incremental-RA-linux-ubuntu-16_10/buildbot_incremental/foundation-linux-x86_64/TestFoundation/TestFoundation: symbol lookup error: /home/buildnode/jenkins/workspace/oss-swift-incremental-RA-linux-ubuntu-16_10/buildbot_incremental/foundation-linux-x86_64/TestFoundation/TestFoundation: undefined symbol: _TFesRxs17MutableCollectionWx8Iterator7Element_s10ComparablerS_6sortedfT_GSaWxS0_S1___
/home/buildnode/jenkins/workspace/oss-swift-incremental-RA-linux-ubuntu-16_10/swift/utils/build-script: fatal error: command terminated with a non-zero exit status 127, aborting

Foundation doesn’t seem to have rebuilt… do we need to clear the workspace?

  - Doug

On Feb 2, 2017, at 9:59 PM, no-reply@swift.org wrote:

[FAILURE] oss-swift-incremental-RA-linux-ubuntu-16_10 [#1693]

Build URL: https://ci.swift.org/job/oss-swift-incremental-RA-linux-ubuntu-16_10/1693/
Project: oss-swift-incremental-RA-linux-ubuntu-16_10
Date of build: Thu, 02 Feb 2017 21:46:26 -0800
Build duration: 12 min
Tests:

Name: Swift(linux-x86_64)
Failed: 0 test(s), Passed: 8907 test(s), Total: 8907 test(s)
Name: Swift-Unit
Failed: 0 test(s), Passed: 305 test(s), Total: 305 test(s)

Changes

  • Commit 25017f0a8eaac55c5dfe5435a287eedce5774099 by dgregor:
[Archetype builder] Remove weird concrete-same-type assignment.

    • edit: lib/AST/ArchetypeBuilder.cpp

  • Commit 2dcf6f0e278b34f5654ca2c1f6601095631ce990 by dgregor:
[Archetype builder] Look up nested types on the requested parent.

    • edit: test/Generics/associated_type_typo.swift
    • edit: lib/AST/ArchetypeBuilder.cpp

  • Commit ded7e83aaba05c297262e66553e35d1d456036f9 by dgregor:
[Archetype builder] Make canonicalization of dependent types

    • edit: test/Generics/requirement_inference.swift
    • edit: test/decl/protocol/recursive_requirement.swift
    • edit: test/Generics/associated_type_typo.swift
    • edit: lib/Sema/GenericTypeResolver.h
    • edit: lib/Sema/TypeCheckType.cpp
    • edit: lib/AST/GenericSignature.cpp
    • edit: lib/AST/ArchetypeBuilder.cpp
    • edit: lib/Sema/TypeCheckGeneric.cpp
    • edit: include/swift/AST/ArchetypeBuilder.h

  • Commit ee00acf3d032bf8b040329d62fa96c6a2d81f64f by dgregor:
[AST] Remove GenericSignature::getRepresentative(). NFC

    • edit: lib/AST/GenericSignature.cpp
    • edit: include/swift/AST/GenericSignature.h

_______________________________________________
swift-dev mailing list
swift-dev@swift.org
https://lists.swift.org/mailman/listinfo/swift-dev