[Swift CI] Build Failure: 0. OSS - Swift Incremental RA - Ubuntu 16.10 (master) #1637


(Michael Ilseman) #1

Any recent changes to this code area, or new compiler bug?

Compile Swift Module 'PackageGraph' (4 sources)
Compile Swift Module 'Get' (9 sources)
Link Get
Valid decl has error type!
(subscript_decl "subscript(_:)" interface type='(Base.Index) -> Base.Iterator.Element' access=public storage_kind=computed
  (func_decl 'anonname=0x76be610' interface type='<Base where Base : BidirectionalCollection> (LazyBidirectionalCollection<Base>) -> (Base.Index) -> Base.Iterator.Element' access=public getter_for=subscript(_:slight_smile:
    (parameter_list
      (parameter "self" interface type='LazyBidirectionalCollection<Base>'))
    (parameter_list
      (parameter "position" interface type='Base.Index'))))
0 swift 0x00000000038ac4f8
1 swift 0x00000000038acc36
2 libpthread.so.0 0x00007f2dd896f670
3 libc.so.6 0x00007f2dd74ea7ef gsignal + 159
4 libc.so.6 0x00007f2dd74ec3ea abort + 362
5 swift 0x00000000013aa33e
6 swift 0x000000000139f30f
7 swift 0x00000000013ae42b
8 swift 0x00000000013adf94
9 swift 0x00000000013add14
10 swift 0x0000000001396112
11 swift 0x0000000000ff67cb
12 swift 0x0000000001050d88
13 swift 0x000000000132fcd9
14 swift 0x00000000011b96a5
15 swift 0x0000000000f0dbaa
16 swift 0x00000000004a5a66
17 swift 0x0000000000464187
18 libc.so.6 0x00007f2dd74d53f1 __libc_start_main + 241
19 swift 0x000000000046182a
Stack dump:
0. Program arguments: /home/buildnode/disk1/workspace/oss-swift-incremental-RA-linux-ubuntu-16_10/buildbot_incremental/swift-linux-x86_64/bin/swift -frontend -c /home/buildnode/disk1/workspace/oss-swift-incremental-RA-linux-ubuntu-16_10/swiftpm/Sources/PackageGraph/DependencyResolver.swift /home/buildnode/disk1/workspace/oss-swift-incremental-RA-linux-ubuntu-16_10/swiftpm/Sources/PackageGraph/PackageGraph.swift -primary-file /home/buildnode/disk1/workspace/oss-swift-incremental-RA-linux-ubuntu-16_10/swiftpm/Sources/PackageGraph/PackageGraphLoader.swift /home/buildnode/disk1/workspace/oss-swift-incremental-RA-linux-ubuntu-16_10/swiftpm/Sources/PackageGraph/RepositoryPackageContainerProvider.swift -target x86_64-unknown-linux-gnu -disable-objc-interop -I /home/buildnode/disk1/workspace/oss-swift-incremental-RA-linux-ubuntu-16_10/buildbot_incremental/swiftpm-linux-x86_64/.bootstrap/modules -I /home/buildnode/disk1/workspace/oss-swift-incremental-RA-linux-ubuntu-16_10/buildbot_incremental/swiftpm-linux-x86_64/.bootstrap/inc -I /home/buildnode/disk1/workspace/oss-swift-incremental-RA-linux-ubuntu-16_10/buildbot_incremental/foundation-linux-x86_64/Foundation -I /home/buildnode/disk1/workspace/oss-swift-incremental-RA-linux-ubuntu-16_10/buildbot_incremental/foundation-linux-x86_64/Foundation/usr/lib/swift/CoreFoundation -I /home/buildnode/disk1/workspace/oss-swift-incremental-RA-linux-ubuntu-16_10/buildbot_incremental/foundation-linux-x86_64/Foundation/usr/lib/swift -I /home/buildnode/disk1/workspace/oss-swift-incremental-RA-linux-ubuntu-16_10/buildbot_incremental/libdispatch-linux-x86_64/src -I /home/buildnode/disk1/workspace/oss-swift-incremental-RA-linux-ubuntu-16_10/buildbot_incremental/libdispatch-linux-x86_64/src/swift -I /home/buildnode/disk1/workspace/oss-swift-incremental-RA-linux-ubuntu-16_10/swift-corelibs-libdispatch -I /home/buildnode/disk1/workspace/oss-swift-incremental-RA-linux-ubuntu-16_10/buildbot_incremental/xctest-linux-x86_64 -Xcc -fblocks -emit-module-doc-path /home/buildnode/disk1/workspace/oss-swift-incremental-RA-linux-ubuntu-16_10/buildbot_incremental/swiftpm-linux-x86_64/.bootstrap/PackageGraph.build/PackageGraphLoader~partial.swiftdoc -Onone -parse-as-library -module-name PackageGraph -emit-module-path /home/buildnode/disk1/workspace/oss-swift-incremental-RA-linux-ubuntu-16_10/buildbot_incremental/swiftpm-linux-x86_64/.bootstrap/PackageGraph.build/PackageGraphLoader~partial.swiftmodule -emit-dependencies-path /home/buildnode/disk1/workspace/oss-swift-incremental-RA-linux-ubuntu-16_10/buildbot_incremental/swiftpm-linux-x86_64/.bootstrap/PackageGraph.build/PackageGraphLoader.d -emit-reference-dependencies-path /home/buildnode/disk1/workspace/oss-swift-incremental-RA-linux-ubuntu-16_10/buildbot_incremental/swiftpm-linux-x86_64/.bootstrap/PackageGraph.build/PackageGraphLoader.swiftdeps -o /home/buildnode/disk1/workspace/oss-swift-incremental-RA-linux-ubuntu-16_10/buildbot_incremental/swiftpm-linux-x86_64/.bootstrap/PackageGraph.build/PackageGraphLoader.o
1. While verifying errors 'subscript' in module 'Swift'
<><unknown>:0: error: unable to execute command: Aborted
<unknown>:0: error: compile command failed due to signal 6 (use -v to see invocation)
<unknown>:0: error: build had 1 command failures

···

On Jan 30, 2017, at 1:23 PM, no-reply@swift.org wrote:

[FAILURE] oss-swift-incremental-RA-linux-ubuntu-16_10 [#1637]

Build URL: https://ci.swift.org/job/oss-swift-incremental-RA-linux-ubuntu-16_10/1637/
Project: oss-swift-incremental-RA-linux-ubuntu-16_10
Date of build: Mon, 30 Jan 2017 12:30:33 -0800
Build duration: 52 min
Identified problems:

Compile Error: This build failed because of a compile error. Below is a list of all errors in the build log:
Indication 1 <https://ci.swift.org//job/oss-swift-incremental-RA-linux-ubuntu-16_10/1637/consoleFull#979178979ee1a197b-acac-4b17-83cf-a53b95139a76>
Changes

Commit 7d9ed86d8c8c9c1db6c693136b5466a03b77b08f by ktopley:
Fixes handling of range indices in DispatchData.copyBytes() and adds

edit: stdlib/public/SDK/Dispatch/Data.swift
edit: test/stdlib/Dispatch.swift

Commit 207fffc6feb2276d7f786bc052ad07608cd2312f by dgregor:
[Type checker] Limit the number of type variables introduced for

edit: lib/Sema/CSGen.cpp

Commit 21ee10b63b168727aa6d05fe7360c8dac535a44f by dgregor:
[Type checker] Detangling the constraints of interpolated string

edit: lib/Sema/CSApply.cpp
edit: lib/Sema/CSGen.cpp
add: test/Constraints/interpolation_segments.swift

Commit 4127f700f1368d2620d03713030994fb3833eb00 by dgregor:
[Type checker] Remove the now-unused InterpolationArgument locator

edit: lib/Sema/ConstraintLocator.h
edit: lib/Sema/CSSolver.cpp
edit: lib/Sema/CSApply.cpp
edit: lib/Sema/ConstraintLocator.cpp
edit: lib/Sema/CSDiag.cpp

Commit 658f2441885a08bae9e395a6e2715686cc76daee by dgregor:
[Standard library] de-GYB string interpolation. NFC

edit: stdlib/public/core/CMakeLists.txt
delete: stdlib/public/core/StringInterpolation.swift.gyb
add: stdlib/public/core/StringInterpolation.swift

Commit f57ff6d1132c599c55bf3834159b2bff28ef455e by anthony.parker:
copyItem Implementation with Tests. (#847)

edit: TestFoundation/TestNSFileManager.swift
edit: Foundation/NSFileManager.swift


(Slava Pestov) #2

Old compiler bug.

Doug, it’s baaaaaaaaaack!!!!!

···

On Jan 30, 2017, at 1:26 PM, Michael Ilseman via swift-dev <swift-dev@swift.org> wrote:

Any recent changes to this code area, or new compiler bug?

Compile Swift Module 'PackageGraph' (4 sources)
Compile Swift Module 'Get' (9 sources)
Link Get
Valid decl has error type!
(subscript_decl "subscript(_:)" interface type='(Base.Index) -> Base.Iterator.Element' access=public storage_kind=computed


(Michael Ilseman) #3

Over to Doug then

···

On Jan 30, 2017, at 2:17 PM, Slava Pestov <spestov@apple.com> wrote:

Old compiler bug.

Doug, it’s baaaaaaaaaack!!!!!

On Jan 30, 2017, at 1:26 PM, Michael Ilseman via swift-dev <swift-dev@swift.org <mailto:swift-dev@swift.org>> wrote:

Any recent changes to this code area, or new compiler bug?

Compile Swift Module 'PackageGraph' (4 sources)
Compile Swift Module 'Get' (9 sources)
Link Get
Valid decl has error type!
(subscript_decl "subscript(_:)" interface type='(Base.Index) -> Base.Iterator.Element' access=public storage_kind=computed