[Swift CI] Build Failure: 0. OSS - Swift Incremental RA - Ubuntu 16.10 (master) #1150


(Mishal Shah) #1

Hi Anders,

Can you please look at this failure?

Test Case 'ConventionTests.testInvalidTestTargets' started at 20:09:14.167
<>--- bootstrap: error: tests failed with exit status 1
/home/buildnode/jenkins/workspace/oss-swift-incremental-RA-linux-ubuntu-16_10/swift/utils/build-script: fatal error: command terminated with a non-zero exit status 1, aborting
/home/buildnode/jenkins/workspace/oss-swift-incremental-RA-linux-ubuntu-16_10/swift/utils/build-script: fatal error: command terminated with a non-zero exit status 1, aborting

Thanks,
Mishal Shah

···

On Jan 3, 2017, at 6:09 PM, no-reply@swift.org wrote:

[FAILURE] oss-swift-incremental-RA-linux-ubuntu-16_10 [#1150]

Build URL: https://ci.swift.org/job/oss-swift-incremental-RA-linux-ubuntu-16_10/1150/
Project: oss-swift-incremental-RA-linux-ubuntu-16_10
Date of build: Tue, 03 Jan 2017 17:59:58 -0800
Build duration: 9 min 27 sec
Identified problems:

Compile Error: This build failed because of a compile error. Below is a list of all errors in the build log:
Indication 1 <https://ci.swift.org//job/oss-swift-incremental-RA-linux-ubuntu-16_10/1150/consoleFull#-1007744702ee1a197b-acac-4b17-83cf-a53b95139a76>
Tests:

Name: Swift(linux-x86_64)
Failed: 0 test(s), Passed: 8704 test(s), Total: 8704 test(s)
Name: Swift-Unit
Failed: 0 test(s), Passed: 237 test(s), Total: 237 test(s)

Changes

Commit d668267f8ccb4d62f77caa1fa9766b6acea59d79 by anders:
SR-3467: double closing of a file descriptor from openpty

edit: Tests/BasicTests/TerminalControllerTests.swift
edit: Tests/UtilityTests/ProgressBarTests.swift


(Anders Bertelrud) #2

I’ll take a look. It seems unrelated to the fix I checked in earlier, though the changes only list my diff). I’ll reply when I find something out.

Anders

···

On 2017-01-03, at 18.11, mishal_shah <mishal_shah@apple.com> wrote:

Hi Anders,

Can you please look at this failure?

Test Case 'ConventionTests.testInvalidTestTargets' started at 20:09:14.167
<>--- bootstrap: error: tests failed with exit status 1
/home/buildnode/jenkins/workspace/oss-swift-incremental-RA-linux-ubuntu-16_10/swift/utils/build-script: fatal error: command terminated with a non-zero exit status 1, aborting
/home/buildnode/jenkins/workspace/oss-swift-incremental-RA-linux-ubuntu-16_10/swift/utils/build-script: fatal error: command terminated with a non-zero exit status 1, aborting

Thanks,
Mishal Shah

On Jan 3, 2017, at 6:09 PM, no-reply@swift.org <mailto:no-reply@swift.org> wrote:

[FAILURE] oss-swift-incremental-RA-linux-ubuntu-16_10 [#1150]

Build URL: https://ci.swift.org/job/oss-swift-incremental-RA-linux-ubuntu-16_10/1150/
Project: oss-swift-incremental-RA-linux-ubuntu-16_10
Date of build: Tue, 03 Jan 2017 17:59:58 -0800
Build duration: 9 min 27 sec
Identified problems:

Compile Error: This build failed because of a compile error. Below is a list of all errors in the build log:
Indication 1 <https://ci.swift.org//job/oss-swift-incremental-RA-linux-ubuntu-16_10/1150/consoleFull#-1007744702ee1a197b-acac-4b17-83cf-a53b95139a76>
Tests:

Name: Swift(linux-x86_64)
Failed: 0 test(s), Passed: 8704 test(s), Total: 8704 test(s)
Name: Swift-Unit
Failed: 0 test(s), Passed: 237 test(s), Total: 237 test(s)

Changes

Commit d668267f8ccb4d62f77caa1fa9766b6acea59d79 by anders:
SR-3467: double closing of a file descriptor from openpty

edit: Tests/BasicTests/TerminalControllerTests.swift
edit: Tests/UtilityTests/ProgressBarTests.swift


(Anders Bertelrud) #3

Hello Mishal,

It looks intermittent; the other runs succeeded. Also, it looks like a crash in one of the unit tests; is there a way to get a crash trace from the one time it occurred?

Anders

···

On Jan 3, 2017, at 18:11, mishal_shah <mishal_shah@apple.com> wrote:

Hi Anders,

Can you please look at this failure?

Test Case 'ConventionTests.testInvalidTestTargets' started at 20:09:14.167
--- bootstrap: error: tests failed with exit status 1
/home/buildnode/jenkins/workspace/oss-swift-incremental-RA-linux-ubuntu-16_10/swift/utils/build-script: fatal error: command terminated with a non-zero exit status 1, aborting
/home/buildnode/jenkins/workspace/oss-swift-incremental-RA-linux-ubuntu-16_10/swift/utils/build-script: fatal error: command terminated with a non-zero exit status 1, aborting

Thanks,
Mishal Shah

On Jan 3, 2017, at 6:09 PM, no-reply@swift.org wrote:

[FAILURE] oss-swift-incremental-RA-linux-ubuntu-16_10 [#1150]

Build URL: https://ci.swift.org/job/oss-swift-incremental-RA-linux-ubuntu-16_10/1150/
Project: oss-swift-incremental-RA-linux-ubuntu-16_10
Date of build: Tue, 03 Jan 2017 17:59:58 -0800
Build duration: 9 min 27 sec
Identified problems:

Compile Error: This build failed because of a compile error. Below is a list of all errors in the build log:
Indication 1
Tests:

Name: Swift(linux-x86_64)
Failed: 0 test(s), Passed: 8704 test(s), Total: 8704 test(s)
Name: Swift-Unit
Failed: 0 test(s), Passed: 237 test(s), Total: 237 test(s)

Changes

Commit d668267f8ccb4d62f77caa1fa9766b6acea59d79 by anders:
SR-3467: double closing of a file descriptor from openpty

edit: Tests/BasicTests/TerminalControllerTests.swift
edit: Tests/UtilityTests/ProgressBarTests.swift