[Swift CI] Build Failure: 0. OSS - Swift Incremental RA - Ubuntu 16.10 (master) #1121


(Jordan Rose) #1

This can't possibly be me.

Compile Swift Module 'Get' (9 sources)
Valid decl has error type!
(parameter "lhs" interface type='inout ContiguousArray<C.Iterator.Element>' mutable)
0 swift 0x0000000003509a08
1 swift 0x000000000350a146
2 libpthread.so.0 0x00007fdf44069670
3 libc.so.6 0x00007fdf429ac7ef gsignal + 159
4 libc.so.6 0x00007fdf429ae3ea abort + 362
5 swift 0x0000000000dfc69e
6 swift 0x0000000000df1622
7 swift 0x0000000000e00739
8 swift 0x0000000000e02c6e
9 swift 0x0000000000e0567c
10 swift 0x0000000000e0015f
11 swift 0x0000000000e00054
12 swift 0x0000000000de84a2
13 swift 0x0000000000a772db
14 swift 0x0000000000ac0a88
15 swift 0x0000000000d8b939
16 swift 0x0000000000c21987
17 swift 0x000000000099537b
18 swift 0x000000000047d8aa
19 swift 0x000000000043b587
20 libc.so.6 0x00007fdf429973f1 __libc_start_main + 241
21 swift 0x00000000004389ca
Stack dump:
0. Program arguments: /home/buildnode/jenkins/workspace/oss-swift-incremental-RA-linux-ubuntu-16_10/buildbot_incremental/swift-linux-x86_64/bin/swift -frontend -c /home/buildnode/jenkins/workspace/oss-swift-incremental-RA-linux-ubuntu-16_10/swiftpm/Sources/PackageGraph/RepositoryPackageContainerProvider.swift /home/buildnode/jenkins/workspace/oss-swift-incremental-RA-linux-ubuntu-16_10/swiftpm/Sources/PackageGraph/DependencyResolver.swift -primary-file /home/buildnode/jenkins/workspace/oss-swift-incremental-RA-linux-ubuntu-16_10/swiftpm/Sources/PackageGraph/PackageGraphLoader.swift /home/buildnode/jenkins/workspace/oss-swift-incremental-RA-linux-ubuntu-16_10/swiftpm/Sources/PackageGraph/PackageGraph.swift -target x86_64-unknown-linux-gnu -disable-objc-interop -I /home/buildnode/jenkins/workspace/oss-swift-incremental-RA-linux-ubuntu-16_10/buildbot_incremental/swiftpm-linux-x86_64/debug -I /home/buildnode/jenkins/workspace/oss-swift-incremental-RA-linux-ubuntu-16_10/buildbot_incremental/foundation-linux-x86_64/Foundation -I /home/buildnode/jenkins/workspace/oss-swift-incremental-RA-linux-ubuntu-16_10/buildbot_incremental/foundation-linux-x86_64/Foundation/usr/lib/swift -I /home/buildnode/jenkins/workspace/oss-swift-incremental-RA-linux-ubuntu-16_10/buildbot_incremental/xctest-linux-x86_64 -I /home/buildnode/jenkins/workspace/oss-swift-incremental-RA-linux-ubuntu-16_10/buildbot_incremental/libdispatch-linux-x86_64/src -I /home/buildnode/jenkins/workspace/oss-swift-incremental-RA-linux-ubuntu-16_10/buildbot_incremental/libdispatch-linux-x86_64/src/swift -I /home/buildnode/jenkins/workspace/oss-swift-incremental-RA-linux-ubuntu-16_10/swift-corelibs-libdispatch -enable-testing -g -module-cache-path /home/buildnode/jenkins/workspace/oss-swift-incremental-RA-linux-ubuntu-16_10/buildbot_incremental/swiftpm-linux-x86_64/debug/ModuleCache -D SWIFT_PACKAGE -Xcc -fblocks -emit-module-doc-path /home/buildnode/jenkins/workspace/oss-swift-incremental-RA-linux-ubuntu-16_10/buildbot_incremental/swiftpm-linux-x86_64/debug/PackageGraph.build/PackageGraphLoader~partial.swiftdoc -Onone -parse-as-library -module-name PackageGraph -emit-module-path /home/buildnode/jenkins/workspace/oss-swift-incremental-RA-linux-ubuntu-16_10/buildbot_incremental/swiftpm-linux-x86_64/debug/PackageGraph.build/PackageGraphLoader~partial.swiftmodule -emit-dependencies-path /home/buildnode/jenkins/workspace/oss-swift-incremental-RA-linux-ubuntu-16_10/buildbot_incremental/swiftpm-linux-x86_64/debug/PackageGraph.build/PackageGraphLoader.d -emit-reference-dependencies-path /home/buildnode/jenkins/workspace/oss-swift-incremental-RA-linux-ubuntu-16_10/buildbot_incremental/swiftpm-linux-x86_64/debug/PackageGraph.build/PackageGraphLoader.swiftdeps -num-threads 8 -o /home/buildnode/jenkins/workspace/oss-swift-incremental-RA-linux-ubuntu-16_10/buildbot_incremental/swiftpm-linux-x86_64/debug/PackageGraph.build/PackageGraphLoader.swift.o
1. While walking into body of '+=' in module 'Swift'
2. While verifying errors 'lhs' in module 'Swift'
<https://ci.swift.org//job/oss-swift-incremental-RA-linux-ubuntu-16_10/1121/consoleFull#979178979ee1a197b-acac-4b17-83cf-a53b95139a76>

I hope we don't have something nondeterministic.

Jordan

···

On Dec 21, 2016, at 17:23, no-reply@swift.org wrote:

[FAILURE] oss-swift-incremental-RA-linux-ubuntu-16_10 [#1121]

Build URL: https://ci.swift.org/job/oss-swift-incremental-RA-linux-ubuntu-16_10/1121/
Project: oss-swift-incremental-RA-linux-ubuntu-16_10
Date of build: Wed, 21 Dec 2016 17:18:55 -0800
Build duration: 4 min 18 sec
Identified problems:

Compile Error: This build failed because of a compile error. Below is a list of all errors in the build log:
Indication 1 <https://ci.swift.org//job/oss-swift-incremental-RA-linux-ubuntu-16_10/1121/consoleFull#979178979ee1a197b-acac-4b17-83cf-a53b95139a76>
Tests:

Name: Swift(linux-x86_64)
Failed: 0 test(s), Passed: 8692 test(s), Total: 8692 test(s)
Name: Swift-Unit
Failed: 0 test(s), Passed: 237 test(s), Total: 237 test(s)

Changes

Commit 05b0bb8ac2c9b47d414b7abc735e1733181c1a92 by jordan_rose:
[docs] Add (unfinished) doc about changes between Swift 3 and 4.

add: docs/Swift3Compatibility.md


(Greg Parker) #2

IIRC I saw something like this earlier this week, probably Tuesday, but I can't remember if it was in a CI PR build or in a local build on rad-main.

···

On Dec 21, 2016, at 5:35 PM, Jordan Rose via swift-dev <swift-dev@swift.org> wrote:

This can't possibly be me.

Compile Swift Module 'Get' (9 sources)
Valid decl has error type!
(parameter "lhs" interface type='inout ContiguousArray<C.Iterator.Element>' mutable)
0 swift 0x0000000003509a08
1 swift 0x000000000350a146
2 libpthread.so.0 0x00007fdf44069670
3 libc.so.6 0x00007fdf429ac7ef gsignal + 159
4 libc.so.6 0x00007fdf429ae3ea abort + 362
5 swift 0x0000000000dfc69e
6 swift 0x0000000000df1622
7 swift 0x0000000000e00739
8 swift 0x0000000000e02c6e
9 swift 0x0000000000e0567c
10 swift 0x0000000000e0015f
11 swift 0x0000000000e00054
12 swift 0x0000000000de84a2
13 swift 0x0000000000a772db
14 swift 0x0000000000ac0a88
15 swift 0x0000000000d8b939
16 swift 0x0000000000c21987
17 swift 0x000000000099537b
18 swift 0x000000000047d8aa
19 swift 0x000000000043b587
20 libc.so.6 0x00007fdf429973f1 __libc_start_main + 241
21 swift 0x00000000004389ca
Stack dump:
0. Program arguments: /home/buildnode/jenkins/workspace/oss-swift-incremental-RA-linux-ubuntu-16_10/buildbot_incremental/swift-linux-x86_64/bin/swift -frontend -c /home/buildnode/jenkins/workspace/oss-swift-incremental-RA-linux-ubuntu-16_10/swiftpm/Sources/PackageGraph/RepositoryPackageContainerProvider.swift /home/buildnode/jenkins/workspace/oss-swift-incremental-RA-linux-ubuntu-16_10/swiftpm/Sources/PackageGraph/DependencyResolver.swift -primary-file /home/buildnode/jenkins/workspace/oss-swift-incremental-RA-linux-ubuntu-16_10/swiftpm/Sources/PackageGraph/PackageGraphLoader.swift /home/buildnode/jenkins/workspace/oss-swift-incremental-RA-linux-ubuntu-16_10/swiftpm/Sources/PackageGraph/PackageGraph.swift -target x86_64-unknown-linux-gnu -disable-objc-interop -I /home/buildnode/jenkins/workspace/oss-swift-incremental-RA-linux-ubuntu-16_10/buildbot_incremental/swiftpm-linux-x86_64/debug -I /home/buildnode/jenkins/workspace/oss-swift-incremental-RA-linux-ubuntu-16_10/buildbot_incremental/foundation-linux-x86_64/Foundation -I /home/buildnode/jenkins/workspace/oss-swift-incremental-RA-linux-ubuntu-16_10/buildbot_incremental/foundation-linux-x86_64/Foundation/usr/lib/swift -I /home/buildnode/jenkins/workspace/oss-swift-incremental-RA-linux-ubuntu-16_10/buildbot_incremental/xctest-linux-x86_64 -I /home/buildnode/jenkins/workspace/oss-swift-incremental-RA-linux-ubuntu-16_10/buildbot_incremental/libdispatch-linux-x86_64/src -I /home/buildnode/jenkins/workspace/oss-swift-incremental-RA-linux-ubuntu-16_10/buildbot_incremental/libdispatch-linux-x86_64/src/swift -I /home/buildnode/jenkins/workspace/oss-swift-incremental-RA-linux-ubuntu-16_10/swift-corelibs-libdispatch -enable-testing -g -module-cache-path /home/buildnode/jenkins/workspace/oss-swift-incremental-RA-linux-ubuntu-16_10/buildbot_incremental/swiftpm-linux-x86_64/debug/ModuleCache -D SWIFT_PACKAGE -Xcc -fblocks -emit-module-doc-path /home/buildnode/jenkins/workspace/oss-swift-incremental-RA-linux-ubuntu-16_10/buildbot_incremental/swiftpm-linux-x86_64/debug/PackageGraph.build/PackageGraphLoader~partial.swiftdoc -Onone -parse-as-library -module-name PackageGraph -emit-module-path /home/buildnode/jenkins/workspace/oss-swift-incremental-RA-linux-ubuntu-16_10/buildbot_incremental/swiftpm-linux-x86_64/debug/PackageGraph.build/PackageGraphLoader~partial.swiftmodule -emit-dependencies-path /home/buildnode/jenkins/workspace/oss-swift-incremental-RA-linux-ubuntu-16_10/buildbot_incremental/swiftpm-linux-x86_64/debug/PackageGraph.build/PackageGraphLoader.d -emit-reference-dependencies-path /home/buildnode/jenkins/workspace/oss-swift-incremental-RA-linux-ubuntu-16_10/buildbot_incremental/swiftpm-linux-x86_64/debug/PackageGraph.build/PackageGraphLoader.swiftdeps -num-threads 8 -o /home/buildnode/jenkins/workspace/oss-swift-incremental-RA-linux-ubuntu-16_10/buildbot_incremental/swiftpm-linux-x86_64/debug/PackageGraph.build/PackageGraphLoader.swift.o
1. While walking into body of '+=' in module 'Swift'
2. While verifying errors 'lhs' in module 'Swift'
<https://ci.swift.org//job/oss-swift-incremental-RA-linux-ubuntu-16_10/1121/consoleFull#979178979ee1a197b-acac-4b17-83cf-a53b95139a76>

I hope we don't have something nondeterministic.

Jordan

On Dec 21, 2016, at 17:23, no-reply@swift.org <mailto:no-reply@swift.org> wrote:

[FAILURE] oss-swift-incremental-RA-linux-ubuntu-16_10 [#1121]

Build URL: https://ci.swift.org/job/oss-swift-incremental-RA-linux-ubuntu-16_10/1121/
Project: oss-swift-incremental-RA-linux-ubuntu-16_10
Date of build: Wed, 21 Dec 2016 17:18:55 -0800
Build duration: 4 min 18 sec
Identified problems:

Compile Error: This build failed because of a compile error. Below is a list of all errors in the build log:
Indication 1 <https://ci.swift.org//job/oss-swift-incremental-RA-linux-ubuntu-16_10/1121/consoleFull#979178979ee1a197b-acac-4b17-83cf-a53b95139a76>
Tests:

Name: Swift(linux-x86_64)
Failed: 0 test(s), Passed: 8692 test(s), Total: 8692 test(s)
Name: Swift-Unit
Failed: 0 test(s), Passed: 237 test(s), Total: 237 test(s)

Changes

Commit 05b0bb8ac2c9b47d414b7abc735e1733181c1a92 by jordan_rose:
[docs] Add (unfinished) doc about changes between Swift 3 and 4.

add: docs/Swift3Compatibility.md

_______________________________________________
swift-dev mailing list
swift-dev@swift.org
https://lists.swift.org/mailman/listinfo/swift-dev


(Ankit Aggarwal) #3

Happened again today when testing a PR

https://ci.swift.org/job/swift-package-manager-PR-Linux/749/consoleFull#979178979ee1a197b-acac-4b17-83cf-a53b95139a76

···

On 22-Dec-2016, at 8:23 AM, Greg Parker via swift-dev <swift-dev@swift.org> wrote:

IIRC I saw something like this earlier this week, probably Tuesday, but I can't remember if it was in a CI PR build or in a local build on rad-main.

On Dec 21, 2016, at 5:35 PM, Jordan Rose via swift-dev <swift-dev@swift.org <mailto:swift-dev@swift.org>> wrote:

This can't possibly be me.

Compile Swift Module 'Get' (9 sources)
Valid decl has error type!
(parameter "lhs" interface type='inout ContiguousArray<C.Iterator.Element>' mutable)
0 swift 0x0000000003509a08
1 swift 0x000000000350a146
2 libpthread.so.0 0x00007fdf44069670
3 libc.so.6 0x00007fdf429ac7ef gsignal + 159
4 libc.so.6 0x00007fdf429ae3ea abort + 362
5 swift 0x0000000000dfc69e
6 swift 0x0000000000df1622
7 swift 0x0000000000e00739
8 swift 0x0000000000e02c6e
9 swift 0x0000000000e0567c
10 swift 0x0000000000e0015f
11 swift 0x0000000000e00054
12 swift 0x0000000000de84a2
13 swift 0x0000000000a772db
14 swift 0x0000000000ac0a88
15 swift 0x0000000000d8b939
16 swift 0x0000000000c21987
17 swift 0x000000000099537b
18 swift 0x000000000047d8aa
19 swift 0x000000000043b587
20 libc.so.6 0x00007fdf429973f1 __libc_start_main + 241
21 swift 0x00000000004389ca
Stack dump:
0. Program arguments: /home/buildnode/jenkins/workspace/oss-swift-incremental-RA-linux-ubuntu-16_10/buildbot_incremental/swift-linux-x86_64/bin/swift -frontend -c /home/buildnode/jenkins/workspace/oss-swift-incremental-RA-linux-ubuntu-16_10/swiftpm/Sources/PackageGraph/RepositoryPackageContainerProvider.swift /home/buildnode/jenkins/workspace/oss-swift-incremental-RA-linux-ubuntu-16_10/swiftpm/Sources/PackageGraph/DependencyResolver.swift -primary-file /home/buildnode/jenkins/workspace/oss-swift-incremental-RA-linux-ubuntu-16_10/swiftpm/Sources/PackageGraph/PackageGraphLoader.swift /home/buildnode/jenkins/workspace/oss-swift-incremental-RA-linux-ubuntu-16_10/swiftpm/Sources/PackageGraph/PackageGraph.swift -target x86_64-unknown-linux-gnu -disable-objc-interop -I /home/buildnode/jenkins/workspace/oss-swift-incremental-RA-linux-ubuntu-16_10/buildbot_incremental/swiftpm-linux-x86_64/debug -I /home/buildnode/jenkins/workspace/oss-swift-incremental-RA-linux-ubuntu-16_10/buildbot_incremental/foundation-linux-x86_64/Foundation -I /home/buildnode/jenkins/workspace/oss-swift-incremental-RA-linux-ubuntu-16_10/buildbot_incremental/foundation-linux-x86_64/Foundation/usr/lib/swift -I /home/buildnode/jenkins/workspace/oss-swift-incremental-RA-linux-ubuntu-16_10/buildbot_incremental/xctest-linux-x86_64 -I /home/buildnode/jenkins/workspace/oss-swift-incremental-RA-linux-ubuntu-16_10/buildbot_incremental/libdispatch-linux-x86_64/src -I /home/buildnode/jenkins/workspace/oss-swift-incremental-RA-linux-ubuntu-16_10/buildbot_incremental/libdispatch-linux-x86_64/src/swift -I /home/buildnode/jenkins/workspace/oss-swift-incremental-RA-linux-ubuntu-16_10/swift-corelibs-libdispatch -enable-testing -g -module-cache-path /home/buildnode/jenkins/workspace/oss-swift-incremental-RA-linux-ubuntu-16_10/buildbot_incremental/swiftpm-linux-x86_64/debug/ModuleCache -D SWIFT_PACKAGE -Xcc -fblocks -emit-module-doc-path /home/buildnode/jenkins/workspace/oss-swift-incremental-RA-linux-ubuntu-16_10/buildbot_incremental/swiftpm-linux-x86_64/debug/PackageGraph.build/PackageGraphLoader~partial.swiftdoc -Onone -parse-as-library -module-name PackageGraph -emit-module-path /home/buildnode/jenkins/workspace/oss-swift-incremental-RA-linux-ubuntu-16_10/buildbot_incremental/swiftpm-linux-x86_64/debug/PackageGraph.build/PackageGraphLoader~partial.swiftmodule -emit-dependencies-path /home/buildnode/jenkins/workspace/oss-swift-incremental-RA-linux-ubuntu-16_10/buildbot_incremental/swiftpm-linux-x86_64/debug/PackageGraph.build/PackageGraphLoader.d -emit-reference-dependencies-path /home/buildnode/jenkins/workspace/oss-swift-incremental-RA-linux-ubuntu-16_10/buildbot_incremental/swiftpm-linux-x86_64/debug/PackageGraph.build/PackageGraphLoader.swiftdeps -num-threads 8 -o /home/buildnode/jenkins/workspace/oss-swift-incremental-RA-linux-ubuntu-16_10/buildbot_incremental/swiftpm-linux-x86_64/debug/PackageGraph.build/PackageGraphLoader.swift.o
1. While walking into body of '+=' in module 'Swift'
2. While verifying errors 'lhs' in module 'Swift'
<https://ci.swift.org//job/oss-swift-incremental-RA-linux-ubuntu-16_10/1121/consoleFull#979178979ee1a197b-acac-4b17-83cf-a53b95139a76>

I hope we don't have something nondeterministic.

Jordan

On Dec 21, 2016, at 17:23, no-reply@swift.org <mailto:no-reply@swift.org> wrote:

[FAILURE] oss-swift-incremental-RA-linux-ubuntu-16_10 [#1121]

Build URL: https://ci.swift.org/job/oss-swift-incremental-RA-linux-ubuntu-16_10/1121/
Project: oss-swift-incremental-RA-linux-ubuntu-16_10
Date of build: Wed, 21 Dec 2016 17:18:55 -0800
Build duration: 4 min 18 sec
Identified problems:

Compile Error: This build failed because of a compile error. Below is a list of all errors in the build log:
Indication 1 <https://ci.swift.org//job/oss-swift-incremental-RA-linux-ubuntu-16_10/1121/consoleFull#979178979ee1a197b-acac-4b17-83cf-a53b95139a76>
Tests:

Name: Swift(linux-x86_64)
Failed: 0 test(s), Passed: 8692 test(s), Total: 8692 test(s)
Name: Swift-Unit
Failed: 0 test(s), Passed: 237 test(s), Total: 237 test(s)

Changes

Commit 05b0bb8ac2c9b47d414b7abc735e1733181c1a92 by jordan_rose:
[docs] Add (unfinished) doc about changes between Swift 3 and 4.

add: docs/Swift3Compatibility.md

_______________________________________________
swift-dev mailing list
swift-dev@swift.org <mailto:swift-dev@swift.org>
https://lists.swift.org/mailman/listinfo/swift-dev

_______________________________________________
swift-dev mailing list
swift-dev@swift.org
https://lists.swift.org/mailman/listinfo/swift-dev