[Swift CI] Build Failure: 0. OSS - Swift Incremental RA - Ubuntu 16.04 (swift 4.1) #546

Doug, is this you? Looks like a lot of conditional conformance tests and you were touching that.

···

On Dec 19, 2017, at 3:30 PM, swift-ci@swift.org wrote:

[FAILURE] oss-swift-4.1-incremental-RA-linux-ubuntu-16_04 [#546]

Build URL: https://ci.swift.org/job/oss-swift-4.1-incremental-RA-linux-ubuntu-16_04/546/
Project: oss-swift-4.1-incremental-RA-linux-ubuntu-16_04
Date of build: Tue, 19 Dec 2017 16:57:58 -0600
Build duration: 32 min
Identified problems:

Compile Error: This build failed because of a compile error. Below is a list of all errors in the build log:
Indication 1 <https://ci.swift.org//job/oss-swift-4.1-incremental-RA-linux-ubuntu-16_04/546/consoleFull#-21365203213122a513-f36a-4c87-8ed7-cbc36a1ec144>
Regression test failed: This build failed because a regression test in the test suite FAILed. Below is a list of all errors:
Indication 1 <https://ci.swift.org//job/oss-swift-4.1-incremental-RA-linux-ubuntu-16_04/546/consoleFull#103335974ba62d58e-7248-467b-91e0-c7508d5cf947>
Tests:

Name: Swift(linux-x86_64)
Failed: 18 test(s), Passed: 10101 test(s), Total: 10119 test(s)
Failed: Swift(linux-x86_64).Frontend.embed-bitcode-tvos.ll <https://ci.swift.org/job/oss-swift-4.1-incremental-RA-linux-ubuntu-16_04/546/testReport/junit/Swift(linux-x86_64)/Frontend/embed_bitcode_tvos_ll>
Failed: Swift(linux-x86_64).Frontend.embed-bitcode.ll <https://ci.swift.org/job/oss-swift-4.1-incremental-RA-linux-ubuntu-16_04/546/testReport/junit/Swift(linux-x86_64)/Frontend/embed_bitcode_ll>
Failed: Swift(linux-x86_64).Parse/ConditionalCompilation.arm64AppleTVOSTarget.swift <https://ci.swift.org/job/oss-swift-4.1-incremental-RA-linux-ubuntu-16_04/546/testReport/junit/Swift(linux-x86_64)/Parse_ConditionalCompilation/arm64AppleTVOSTarget_swift>
Failed: Swift(linux-x86_64).Parse/ConditionalCompilation.arm64IOSTarget.swift <https://ci.swift.org/job/oss-swift-4.1-incremental-RA-linux-ubuntu-16_04/546/testReport/junit/Swift(linux-x86_64)/Parse_ConditionalCompilation/arm64IOSTarget_swift>
Failed: Swift(linux-x86_64).Parse/ConditionalCompilation.armIOSTarget.swift <https://ci.swift.org/job/oss-swift-4.1-incremental-RA-linux-ubuntu-16_04/546/testReport/junit/Swift(linux-x86_64)/Parse_ConditionalCompilation/armIOSTarget_swift>
Failed: Swift(linux-x86_64).Parse/ConditionalCompilation.armWatchOSTarget.swift <https://ci.swift.org/job/oss-swift-4.1-incremental-RA-linux-ubuntu-16_04/546/testReport/junit/Swift(linux-x86_64)/Parse_ConditionalCompilation/armWatchOSTarget_swift>
Failed: Swift(linux-x86_64).Parse/ConditionalCompilation.basicIdentity.swift <https://ci.swift.org/job/oss-swift-4.1-incremental-RA-linux-ubuntu-16_04/546/testReport/junit/Swift(linux-x86_64)/Parse_ConditionalCompilation/basicIdentity_swift>
Failed: Swift(linux-x86_64).Parse/ConditionalCompilation.i386AppleTVOSTarget.swift <https://ci.swift.org/job/oss-swift-4.1-incremental-RA-linux-ubuntu-16_04/546/testReport/junit/Swift(linux-x86_64)/Parse_ConditionalCompilation/i386AppleTVOSTarget_swift>
Failed: Swift(linux-x86_64).Parse/ConditionalCompilation.i386IOSTarget.swift <https://ci.swift.org/job/oss-swift-4.1-incremental-RA-linux-ubuntu-16_04/546/testReport/junit/Swift(linux-x86_64)/Parse_ConditionalCompilation/i386IOSTarget_swift>
Failed: Swift(linux-x86_64).Parse/ConditionalCompilation.i386WatchOSTarget.swift <https://ci.swift.org/job/oss-swift-4.1-incremental-RA-linux-ubuntu-16_04/546/testReport/junit/Swift(linux-x86_64)/Parse_ConditionalCompilation/i386WatchOSTarget_swift>
Failed: Swift(linux-x86_64).Parse/ConditionalCompilation.simulatorTargetEnv.swift <https://ci.swift.org/job/oss-swift-4.1-incremental-RA-linux-ubuntu-16_04/546/testReport/junit/Swift(linux-x86_64)/Parse_ConditionalCompilation/simulatorTargetEnv_swift>
Failed: Swift(linux-x86_64).Parse/ConditionalCompilation.trailingClosureOnTargetConfig.swift <https://ci.swift.org/job/oss-swift-4.1-incremental-RA-linux-ubuntu-16_04/546/testReport/junit/Swift(linux-x86_64)/Parse_ConditionalCompilation/trailingClosureOnTargetConfig_swift>
Failed: Swift(linux-x86_64).Parse/ConditionalCompilation.x64AppleTVOSTarget.swift <https://ci.swift.org/job/oss-swift-4.1-incremental-RA-linux-ubuntu-16_04/546/testReport/junit/Swift(linux-x86_64)/Parse_ConditionalCompilation/x64AppleTVOSTarget_swift>
Failed: Swift(linux-x86_64).Parse/ConditionalCompilation.x64IOSTarget.swift <https://ci.swift.org/job/oss-swift-4.1-incremental-RA-linux-ubuntu-16_04/546/testReport/junit/Swift(linux-x86_64)/Parse_ConditionalCompilation/x64IOSTarget_swift>
Failed: Swift(linux-x86_64).Parse/ConditionalCompilation.x64OSXTarget.swift <https://ci.swift.org/job/oss-swift-4.1-incremental-RA-linux-ubuntu-16_04/546/testReport/junit/Swift(linux-x86_64)/Parse_ConditionalCompilation/x64OSXTarget_swift>
Failed: Swift(linux-x86_64).attr.attr_availability_osx.swift <https://ci.swift.org/job/oss-swift-4.1-incremental-RA-linux-ubuntu-16_04/546/testReport/junit/Swift(linux-x86_64)/attr/attr_availability_osx_swift>
Failed: Swift(linux-x86_64).attr.attr_availability_tvos.swift <https://ci.swift.org/job/oss-swift-4.1-incremental-RA-linux-ubuntu-16_04/546/testReport/junit/Swift(linux-x86_64)/attr/attr_availability_tvos_swift>
Failed: Swift(linux-x86_64).attr.attr_availability_watchos.swift <https://ci.swift.org/job/oss-swift-4.1-incremental-RA-linux-ubuntu-16_04/546/testReport/junit/Swift(linux-x86_64)/attr/attr_availability_watchos_swift>
Name: Swift-Unit
Failed: 0 test(s), Passed: 487 test(s), Total: 487 test(s)

Changes

Commit d2505ab28dd999057f9da70ccdd98b536038ef93 by dgregor:
[Runtime] Warn about dynamically querying conditional conformances.

edit: stdlib/public/runtime/ProtocolConformance.cpp
add: test/Interpreter/conditional_conformances_warning.swift

Commit 2e14e88b96a5a4eae4a9a9918f88d87647fcfccf by dgregor:
Revert "[SE-0143] Put conditional conformances behind an "experimental"

edit: lib/Driver/ToolChains.cpp
edit: test/Generics/conditional_conformances_execute_smoke.swift
edit: test/decl/var/properties.swift
edit: stdlib/public/core/CMakeLists.txt
edit: include/swift/Option/Options.td
edit: test/SILOptimizer/devirt_conditional_conformance.swift
edit: test/Sema/enum_equatable_conditional.swift
edit: include/swift/AST/DiagnosticsSema.def
edit: test/SIL/Parser/witness_tables.sil
edit: test/decl/ext/generic.swift
edit: test/IRGen/conditional_conformances.swift
edit: test/Interpreter/conditional_conformances_modules.swift
edit: lib/Frontend/CompilerInvocation.cpp
edit: test/SILGen/conditional_conformance.swift
edit: test/Generics/conditional_conformances.swift
edit: lib/Sema/TypeCheckProtocol.cpp
edit: include/swift/Basic/LangOptions.h
edit: test/Generics/conditional_conformances_operators.swift
edit: test/Generics/requirement_inference.swift
edit: test/Interpreter/conditional_conformances.swift
edit: tools/sil-opt/SILOpt.cpp
edit: test/Interpreter/conditional_conformances_smoke.swift

Commit 3883b9319c66c261c90cf87d2340819d3f4f8820 by dgregor:
Eliminate extraneous uses of

edit: test/Constraints/array_literal.swift
edit: test/Prototypes/Algorithms.swift.gyb
edit: test/IRGen/protocol_conformance_records.swift
edit: test/Interpreter/conditional_conformances_warning.swift
edit: test/stmt/foreach.swift

Commit e68f77be5aa54db89dde6c321951153f2bdfbe20 by dgregor:
[Runtime] Print demangled names in conditional conformances warning.

edit: test/Interpreter/conditional_conformances_warning.swift
edit: stdlib/public/runtime/ProtocolConformance.cpp

Commit cf33f86c1171f505611b61aab464fef2d25e8805 by dgregor:
[Runtime] Update field names for the 4.1 branch

edit: stdlib/public/runtime/ProtocolConformance.cpp

Commit 1ac71826854a809f67ae15ddacaaa9a6eb8189e8 by aleksei_lorenz:
[driver][darwin] Take the OS version specified in "-target" as the

edit: test/Driver/objc-weak.m
edit: test/Driver/darwin-version.c
edit: lib/Driver/ToolChains/Darwin.cpp
edit: test/Driver/pic.c
edit: test/Driver/unavailable_aligned_allocation.cpp

Doug, is this you? Looks like a lot of conditional conformance tests and you were touching that.

Those are “conditional compilation” tests. Alex, this looks like your -target changes.

  - Doug

···

On Dec 19, 2017, at 4:00 PM, Michael Ilseman <milseman@apple.com> wrote:

On Dec 19, 2017, at 3:30 PM, swift-ci@swift.org <mailto:swift-ci@swift.org> wrote:

[FAILURE] oss-swift-4.1-incremental-RA-linux-ubuntu-16_04 [#546]

Build URL: https://ci.swift.org/job/oss-swift-4.1-incremental-RA-linux-ubuntu-16_04/546/
Project: oss-swift-4.1-incremental-RA-linux-ubuntu-16_04
Date of build: Tue, 19 Dec 2017 16:57:58 -0600
Build duration: 32 min
Identified problems:

Compile Error: This build failed because of a compile error. Below is a list of all errors in the build log:
Indication 1 <https://ci.swift.org//job/oss-swift-4.1-incremental-RA-linux-ubuntu-16_04/546/consoleFull#-21365203213122a513-f36a-4c87-8ed7-cbc36a1ec144>
Regression test failed: This build failed because a regression test in the test suite FAILed. Below is a list of all errors:
Indication 1 <https://ci.swift.org//job/oss-swift-4.1-incremental-RA-linux-ubuntu-16_04/546/consoleFull#103335974ba62d58e-7248-467b-91e0-c7508d5cf947>
Tests:

Name: Swift(linux-x86_64)
Failed: 18 test(s), Passed: 10101 test(s), Total: 10119 test(s)
Failed: Swift(linux-x86_64).Frontend.embed-bitcode-tvos.ll <https://ci.swift.org/job/oss-swift-4.1-incremental-RA-linux-ubuntu-16_04/546/testReport/junit/Swift(linux-x86_64)/Frontend/embed_bitcode_tvos_ll>
Failed: Swift(linux-x86_64).Frontend.embed-bitcode.ll <https://ci.swift.org/job/oss-swift-4.1-incremental-RA-linux-ubuntu-16_04/546/testReport/junit/Swift(linux-x86_64)/Frontend/embed_bitcode_ll>
Failed: Swift(linux-x86_64).Parse/ConditionalCompilation.arm64AppleTVOSTarget.swift <https://ci.swift.org/job/oss-swift-4.1-incremental-RA-linux-ubuntu-16_04/546/testReport/junit/Swift(linux-x86_64)/Parse_ConditionalCompilation/arm64AppleTVOSTarget_swift>
Failed: Swift(linux-x86_64).Parse/ConditionalCompilation.arm64IOSTarget.swift <https://ci.swift.org/job/oss-swift-4.1-incremental-RA-linux-ubuntu-16_04/546/testReport/junit/Swift(linux-x86_64)/Parse_ConditionalCompilation/arm64IOSTarget_swift>
Failed: Swift(linux-x86_64).Parse/ConditionalCompilation.armIOSTarget.swift <https://ci.swift.org/job/oss-swift-4.1-incremental-RA-linux-ubuntu-16_04/546/testReport/junit/Swift(linux-x86_64)/Parse_ConditionalCompilation/armIOSTarget_swift>
Failed: Swift(linux-x86_64).Parse/ConditionalCompilation.armWatchOSTarget.swift <https://ci.swift.org/job/oss-swift-4.1-incremental-RA-linux-ubuntu-16_04/546/testReport/junit/Swift(linux-x86_64)/Parse_ConditionalCompilation/armWatchOSTarget_swift>
Failed: Swift(linux-x86_64).Parse/ConditionalCompilation.basicIdentity.swift <https://ci.swift.org/job/oss-swift-4.1-incremental-RA-linux-ubuntu-16_04/546/testReport/junit/Swift(linux-x86_64)/Parse_ConditionalCompilation/basicIdentity_swift>
Failed: Swift(linux-x86_64).Parse/ConditionalCompilation.i386AppleTVOSTarget.swift <https://ci.swift.org/job/oss-swift-4.1-incremental-RA-linux-ubuntu-16_04/546/testReport/junit/Swift(linux-x86_64)/Parse_ConditionalCompilation/i386AppleTVOSTarget_swift>
Failed: Swift(linux-x86_64).Parse/ConditionalCompilation.i386IOSTarget.swift <https://ci.swift.org/job/oss-swift-4.1-incremental-RA-linux-ubuntu-16_04/546/testReport/junit/Swift(linux-x86_64)/Parse_ConditionalCompilation/i386IOSTarget_swift>
Failed: Swift(linux-x86_64).Parse/ConditionalCompilation.i386WatchOSTarget.swift <https://ci.swift.org/job/oss-swift-4.1-incremental-RA-linux-ubuntu-16_04/546/testReport/junit/Swift(linux-x86_64)/Parse_ConditionalCompilation/i386WatchOSTarget_swift>
Failed: Swift(linux-x86_64).Parse/ConditionalCompilation.simulatorTargetEnv.swift <https://ci.swift.org/job/oss-swift-4.1-incremental-RA-linux-ubuntu-16_04/546/testReport/junit/Swift(linux-x86_64)/Parse_ConditionalCompilation/simulatorTargetEnv_swift>
Failed: Swift(linux-x86_64).Parse/ConditionalCompilation.trailingClosureOnTargetConfig.swift <https://ci.swift.org/job/oss-swift-4.1-incremental-RA-linux-ubuntu-16_04/546/testReport/junit/Swift(linux-x86_64)/Parse_ConditionalCompilation/trailingClosureOnTargetConfig_swift>
Failed: Swift(linux-x86_64).Parse/ConditionalCompilation.x64AppleTVOSTarget.swift <https://ci.swift.org/job/oss-swift-4.1-incremental-RA-linux-ubuntu-16_04/546/testReport/junit/Swift(linux-x86_64)/Parse_ConditionalCompilation/x64AppleTVOSTarget_swift>
Failed: Swift(linux-x86_64).Parse/ConditionalCompilation.x64IOSTarget.swift <https://ci.swift.org/job/oss-swift-4.1-incremental-RA-linux-ubuntu-16_04/546/testReport/junit/Swift(linux-x86_64)/Parse_ConditionalCompilation/x64IOSTarget_swift>
Failed: Swift(linux-x86_64).Parse/ConditionalCompilation.x64OSXTarget.swift <https://ci.swift.org/job/oss-swift-4.1-incremental-RA-linux-ubuntu-16_04/546/testReport/junit/Swift(linux-x86_64)/Parse_ConditionalCompilation/x64OSXTarget_swift>
Failed: Swift(linux-x86_64).attr.attr_availability_osx.swift <https://ci.swift.org/job/oss-swift-4.1-incremental-RA-linux-ubuntu-16_04/546/testReport/junit/Swift(linux-x86_64)/attr/attr_availability_osx_swift>
Failed: Swift(linux-x86_64).attr.attr_availability_tvos.swift <https://ci.swift.org/job/oss-swift-4.1-incremental-RA-linux-ubuntu-16_04/546/testReport/junit/Swift(linux-x86_64)/attr/attr_availability_tvos_swift>
Failed: Swift(linux-x86_64).attr.attr_availability_watchos.swift <https://ci.swift.org/job/oss-swift-4.1-incremental-RA-linux-ubuntu-16_04/546/testReport/junit/Swift(linux-x86_64)/attr/attr_availability_watchos_swift>
Name: Swift-Unit
Failed: 0 test(s), Passed: 487 test(s), Total: 487 test(s)

Changes

Commit d2505ab28dd999057f9da70ccdd98b536038ef93 by dgregor:
[Runtime] Warn about dynamically querying conditional conformances.

edit: stdlib/public/runtime/ProtocolConformance.cpp
add: test/Interpreter/conditional_conformances_warning.swift

Commit 2e14e88b96a5a4eae4a9a9918f88d87647fcfccf by dgregor:
Revert "[SE-0143] Put conditional conformances behind an "experimental"

edit: lib/Driver/ToolChains.cpp
edit: test/Generics/conditional_conformances_execute_smoke.swift
edit: test/decl/var/properties.swift
edit: stdlib/public/core/CMakeLists.txt
edit: include/swift/Option/Options.td
edit: test/SILOptimizer/devirt_conditional_conformance.swift
edit: test/Sema/enum_equatable_conditional.swift
edit: include/swift/AST/DiagnosticsSema.def
edit: test/SIL/Parser/witness_tables.sil
edit: test/decl/ext/generic.swift
edit: test/IRGen/conditional_conformances.swift
edit: test/Interpreter/conditional_conformances_modules.swift
edit: lib/Frontend/CompilerInvocation.cpp
edit: test/SILGen/conditional_conformance.swift
edit: test/Generics/conditional_conformances.swift
edit: lib/Sema/TypeCheckProtocol.cpp
edit: include/swift/Basic/LangOptions.h
edit: test/Generics/conditional_conformances_operators.swift
edit: test/Generics/requirement_inference.swift
edit: test/Interpreter/conditional_conformances.swift
edit: tools/sil-opt/SILOpt.cpp
edit: test/Interpreter/conditional_conformances_smoke.swift

Commit 3883b9319c66c261c90cf87d2340819d3f4f8820 by dgregor:
Eliminate extraneous uses of

edit: test/Constraints/array_literal.swift
edit: test/Prototypes/Algorithms.swift.gyb
edit: test/IRGen/protocol_conformance_records.swift
edit: test/Interpreter/conditional_conformances_warning.swift
edit: test/stmt/foreach.swift

Commit e68f77be5aa54db89dde6c321951153f2bdfbe20 by dgregor:
[Runtime] Print demangled names in conditional conformances warning.

edit: test/Interpreter/conditional_conformances_warning.swift
edit: stdlib/public/runtime/ProtocolConformance.cpp

Commit cf33f86c1171f505611b61aab464fef2d25e8805 by dgregor:
[Runtime] Update field names for the 4.1 branch

edit: stdlib/public/runtime/ProtocolConformance.cpp

Commit 1ac71826854a809f67ae15ddacaaa9a6eb8189e8 by aleksei_lorenz:
[driver][darwin] Take the OS version specified in "-target" as the

edit: test/Driver/objc-weak.m
edit: test/Driver/darwin-version.c
edit: lib/Driver/ToolChains/Darwin.cpp
edit: test/Driver/pic.c
edit: test/Driver/unavailable_aligned_allocation.cpp

This looks like the other failure caused by Clang. I removed the warning from clang-4.1 branch already.

Thanks,
Alex

···

On Dec 19, 2017, at 4:00 PM, Michael Ilseman <milseman@apple.com> wrote:

Doug, is this you? Looks like a lot of conditional conformance tests and you were touching that.

On Dec 19, 2017, at 3:30 PM, swift-ci@swift.org <mailto:swift-ci@swift.org> wrote:

[FAILURE] oss-swift-4.1-incremental-RA-linux-ubuntu-16_04 [#546]

Build URL: https://ci.swift.org/job/oss-swift-4.1-incremental-RA-linux-ubuntu-16_04/546/
Project: oss-swift-4.1-incremental-RA-linux-ubuntu-16_04
Date of build: Tue, 19 Dec 2017 16:57:58 -0600
Build duration: 32 min
Identified problems:

Compile Error: This build failed because of a compile error. Below is a list of all errors in the build log:
Indication 1 <https://ci.swift.org//job/oss-swift-4.1-incremental-RA-linux-ubuntu-16_04/546/consoleFull#-21365203213122a513-f36a-4c87-8ed7-cbc36a1ec144>
Regression test failed: This build failed because a regression test in the test suite FAILed. Below is a list of all errors:
Indication 1 <https://ci.swift.org//job/oss-swift-4.1-incremental-RA-linux-ubuntu-16_04/546/consoleFull#103335974ba62d58e-7248-467b-91e0-c7508d5cf947>
Tests:

Name: Swift(linux-x86_64)
Failed: 18 test(s), Passed: 10101 test(s), Total: 10119 test(s)
Failed: Swift(linux-x86_64).Frontend.embed-bitcode-tvos.ll <https://ci.swift.org/job/oss-swift-4.1-incremental-RA-linux-ubuntu-16_04/546/testReport/junit/Swift(linux-x86_64)/Frontend/embed_bitcode_tvos_ll>
Failed: Swift(linux-x86_64).Frontend.embed-bitcode.ll <https://ci.swift.org/job/oss-swift-4.1-incremental-RA-linux-ubuntu-16_04/546/testReport/junit/Swift(linux-x86_64)/Frontend/embed_bitcode_ll>
Failed: Swift(linux-x86_64).Parse/ConditionalCompilation.arm64AppleTVOSTarget.swift <https://ci.swift.org/job/oss-swift-4.1-incremental-RA-linux-ubuntu-16_04/546/testReport/junit/Swift(linux-x86_64)/Parse_ConditionalCompilation/arm64AppleTVOSTarget_swift>
Failed: Swift(linux-x86_64).Parse/ConditionalCompilation.arm64IOSTarget.swift <https://ci.swift.org/job/oss-swift-4.1-incremental-RA-linux-ubuntu-16_04/546/testReport/junit/Swift(linux-x86_64)/Parse_ConditionalCompilation/arm64IOSTarget_swift>
Failed: Swift(linux-x86_64).Parse/ConditionalCompilation.armIOSTarget.swift <https://ci.swift.org/job/oss-swift-4.1-incremental-RA-linux-ubuntu-16_04/546/testReport/junit/Swift(linux-x86_64)/Parse_ConditionalCompilation/armIOSTarget_swift>
Failed: Swift(linux-x86_64).Parse/ConditionalCompilation.armWatchOSTarget.swift <https://ci.swift.org/job/oss-swift-4.1-incremental-RA-linux-ubuntu-16_04/546/testReport/junit/Swift(linux-x86_64)/Parse_ConditionalCompilation/armWatchOSTarget_swift>
Failed: Swift(linux-x86_64).Parse/ConditionalCompilation.basicIdentity.swift <https://ci.swift.org/job/oss-swift-4.1-incremental-RA-linux-ubuntu-16_04/546/testReport/junit/Swift(linux-x86_64)/Parse_ConditionalCompilation/basicIdentity_swift>
Failed: Swift(linux-x86_64).Parse/ConditionalCompilation.i386AppleTVOSTarget.swift <https://ci.swift.org/job/oss-swift-4.1-incremental-RA-linux-ubuntu-16_04/546/testReport/junit/Swift(linux-x86_64)/Parse_ConditionalCompilation/i386AppleTVOSTarget_swift>
Failed: Swift(linux-x86_64).Parse/ConditionalCompilation.i386IOSTarget.swift <https://ci.swift.org/job/oss-swift-4.1-incremental-RA-linux-ubuntu-16_04/546/testReport/junit/Swift(linux-x86_64)/Parse_ConditionalCompilation/i386IOSTarget_swift>
Failed: Swift(linux-x86_64).Parse/ConditionalCompilation.i386WatchOSTarget.swift <https://ci.swift.org/job/oss-swift-4.1-incremental-RA-linux-ubuntu-16_04/546/testReport/junit/Swift(linux-x86_64)/Parse_ConditionalCompilation/i386WatchOSTarget_swift>
Failed: Swift(linux-x86_64).Parse/ConditionalCompilation.simulatorTargetEnv.swift <https://ci.swift.org/job/oss-swift-4.1-incremental-RA-linux-ubuntu-16_04/546/testReport/junit/Swift(linux-x86_64)/Parse_ConditionalCompilation/simulatorTargetEnv_swift>
Failed: Swift(linux-x86_64).Parse/ConditionalCompilation.trailingClosureOnTargetConfig.swift <https://ci.swift.org/job/oss-swift-4.1-incremental-RA-linux-ubuntu-16_04/546/testReport/junit/Swift(linux-x86_64)/Parse_ConditionalCompilation/trailingClosureOnTargetConfig_swift>
Failed: Swift(linux-x86_64).Parse/ConditionalCompilation.x64AppleTVOSTarget.swift <https://ci.swift.org/job/oss-swift-4.1-incremental-RA-linux-ubuntu-16_04/546/testReport/junit/Swift(linux-x86_64)/Parse_ConditionalCompilation/x64AppleTVOSTarget_swift>
Failed: Swift(linux-x86_64).Parse/ConditionalCompilation.x64IOSTarget.swift <https://ci.swift.org/job/oss-swift-4.1-incremental-RA-linux-ubuntu-16_04/546/testReport/junit/Swift(linux-x86_64)/Parse_ConditionalCompilation/x64IOSTarget_swift>
Failed: Swift(linux-x86_64).Parse/ConditionalCompilation.x64OSXTarget.swift <https://ci.swift.org/job/oss-swift-4.1-incremental-RA-linux-ubuntu-16_04/546/testReport/junit/Swift(linux-x86_64)/Parse_ConditionalCompilation/x64OSXTarget_swift>
Failed: Swift(linux-x86_64).attr.attr_availability_osx.swift <https://ci.swift.org/job/oss-swift-4.1-incremental-RA-linux-ubuntu-16_04/546/testReport/junit/Swift(linux-x86_64)/attr/attr_availability_osx_swift>
Failed: Swift(linux-x86_64).attr.attr_availability_tvos.swift <https://ci.swift.org/job/oss-swift-4.1-incremental-RA-linux-ubuntu-16_04/546/testReport/junit/Swift(linux-x86_64)/attr/attr_availability_tvos_swift>
Failed: Swift(linux-x86_64).attr.attr_availability_watchos.swift <https://ci.swift.org/job/oss-swift-4.1-incremental-RA-linux-ubuntu-16_04/546/testReport/junit/Swift(linux-x86_64)/attr/attr_availability_watchos_swift>
Name: Swift-Unit
Failed: 0 test(s), Passed: 487 test(s), Total: 487 test(s)

Changes

Commit d2505ab28dd999057f9da70ccdd98b536038ef93 by dgregor:
[Runtime] Warn about dynamically querying conditional conformances.

edit: stdlib/public/runtime/ProtocolConformance.cpp
add: test/Interpreter/conditional_conformances_warning.swift

Commit 2e14e88b96a5a4eae4a9a9918f88d87647fcfccf by dgregor:
Revert "[SE-0143] Put conditional conformances behind an "experimental"

edit: lib/Driver/ToolChains.cpp
edit: test/Generics/conditional_conformances_execute_smoke.swift
edit: test/decl/var/properties.swift
edit: stdlib/public/core/CMakeLists.txt
edit: include/swift/Option/Options.td
edit: test/SILOptimizer/devirt_conditional_conformance.swift
edit: test/Sema/enum_equatable_conditional.swift
edit: include/swift/AST/DiagnosticsSema.def
edit: test/SIL/Parser/witness_tables.sil
edit: test/decl/ext/generic.swift
edit: test/IRGen/conditional_conformances.swift
edit: test/Interpreter/conditional_conformances_modules.swift
edit: lib/Frontend/CompilerInvocation.cpp
edit: test/SILGen/conditional_conformance.swift
edit: test/Generics/conditional_conformances.swift
edit: lib/Sema/TypeCheckProtocol.cpp
edit: include/swift/Basic/LangOptions.h
edit: test/Generics/conditional_conformances_operators.swift
edit: test/Generics/requirement_inference.swift
edit: test/Interpreter/conditional_conformances.swift
edit: tools/sil-opt/SILOpt.cpp
edit: test/Interpreter/conditional_conformances_smoke.swift

Commit 3883b9319c66c261c90cf87d2340819d3f4f8820 by dgregor:
Eliminate extraneous uses of

edit: test/Constraints/array_literal.swift
edit: test/Prototypes/Algorithms.swift.gyb
edit: test/IRGen/protocol_conformance_records.swift
edit: test/Interpreter/conditional_conformances_warning.swift
edit: test/stmt/foreach.swift

Commit e68f77be5aa54db89dde6c321951153f2bdfbe20 by dgregor:
[Runtime] Print demangled names in conditional conformances warning.

edit: test/Interpreter/conditional_conformances_warning.swift
edit: stdlib/public/runtime/ProtocolConformance.cpp

Commit cf33f86c1171f505611b61aab464fef2d25e8805 by dgregor:
[Runtime] Update field names for the 4.1 branch

edit: stdlib/public/runtime/ProtocolConformance.cpp

Commit 1ac71826854a809f67ae15ddacaaa9a6eb8189e8 by aleksei_lorenz:
[driver][darwin] Take the OS version specified in "-target" as the

edit: test/Driver/objc-weak.m
edit: test/Driver/darwin-version.c
edit: lib/Driver/ToolChains/Darwin.cpp
edit: test/Driver/pic.c
edit: test/Driver/unavailable_aligned_allocation.cpp