[Swift CI] Build Failure: 0. OSS - Swift Incremental RA - Ubuntu 16.04 (swift 4.0) #914


(Mishal Shah) #1

Test Case 'TestURLSession.test_dataTaskWithURL' started at 2017-07-11 16:02:57.515
/home/buildnode/jenkins/workspace/oss-swift-4.0-incremental-RA-linux-ubuntu-16_04/swift/utils/build-script-impl: line 262: 46641 Segmentation fault (core dumped) "$@"
/home/buildnode/jenkins/workspace/oss-swift-4.0-incremental-RA-linux-ubuntu-16_04/swift/utils/build-script: fatal error: command terminated with a non-zero exit status 139, aborting
/home/buildnode/jenkins/workspace/oss-swift-4.0-incremental-RA-linux-ubuntu-16_04/swift/utils/build-script: fatal error: command terminated with a non-zero exit status 1, aborting

Thanks,
Mishal Shah

ยทยทยท

On Jul 11, 2017, at 2:02 PM, no-reply@swift.org wrote:

[FAILURE] oss-swift-4.0-incremental-RA-linux-ubuntu-16_04 [#914]

Build URL: https://ci.swift.org/job/oss-swift-4.0-incremental-RA-linux-ubuntu-16_04/914/
Project: oss-swift-4.0-incremental-RA-linux-ubuntu-16_04
Date of build: Tue, 11 Jul 2017 13:36:42 -0700
Build duration: 27 min
Tests:

Name: Swift(linux-x86_64)
Failed: 0 test(s), Passed: 9561 test(s), Total: 9561 test(s)
Name: Swift-Unit
Failed: 0 test(s), Passed: 441 test(s), Total: 441 test(s)

Changes

Commit 5b7ab1bab0e857cb9c04fbb757c4dcde2444ee62 by Mishal Shah:
[Utils] Update the branch info for swift-4.0-branch-07-11-2017

edit: utils/update-checkout-config.json