[Swift CI] Build Failure: 0. OSS - Swift Incremental RA - Ubuntu 16.04 (master) #6


(Mishal Shah) #1

Hi Andy,

This commit passed in PR testing on Ubuntu 14.04, however we are seeing failure on Ubuntu 16.04 and 15.10.

PR test: https://ci.swift.org/job/swift-PR-Linux/3877/console

https://ci.swift.org/job/oss-swift-incremental-RA-linux-ubuntu-16_04/6/
https://ci.swift.org/job/oss-swift-incremental-RA-linux-ubuntu-15_10/7750/

Test Case 'TestNSData.testBasicConstruction' started at 01:09:31.825
/home/buildnode/jenkins/workspace/oss-swift-incremental-RA-linux-ubuntu-16_04/buildbot_incremental/foundation-linux-x86_64/TestFoundation/TestFoundation: symbol lookup error: /home/buildnode/jenkins/workspace/oss-swift-incremental-RA-linux-ubuntu-16_04/buildbot_incremental/foundation-linux-x86_64/TestFoundation/TestFoundation: undefined symbol: _TFSP17withMemoryReboundu0_rfzT2toMqd__8capacitySiFzGSpqd___qd_0__qd_0_
/home/buildnode/jenkins/workspace/oss-swift-incremental-RA-linux-ubuntu-16_04/swift/utils/build-script: fatal error: command terminated with a non-zero exit status 127, aborting
/home/buildnode/jenkins/workspace/oss-swift-incremental-RA-linux-ubuntu-16_04/swift/utils/build-script: fatal error: command terminated with a non-zero exit status 1, aborting
Build step 'Execute shell' marked build as failure

Thanks,
Mishal Shah

···

On Sep 21, 2016, at 6:10 PM, no-reply@swift.org wrote:

[FAILURE] oss-swift-incremental-RA-linux-ubuntu-16_04 [#6]

Build URL: https://ci.swift.org/job/oss-swift-incremental-RA-linux-ubuntu-16_04/6/
Project: oss-swift-incremental-RA-linux-ubuntu-16_04
Date of build: Wed, 21 Sep 2016 17:55:24 -0700
Build duration: 14 min
Tests:

Name: Swift(linux-x86_64)
Failed: 0 test(s), Passed: 8338 test(s), Total: 8338 test(s)
Name: Swift-Unit
Failed: 0 test(s), Passed: 297 test(s), Total: 297 test(s)

Changes

Commit 2c9cde1c7192269757ea6f0625d08442499a0e76 by atrick:
[stdlib] fix UnsafePointer.withMemoryRebound(to:capacity:) argument

edit: stdlib/public/core/UnsafePointer.swift.gyb
edit: test/stdlib/UnsafePointer.swift.gyb


(Mishal Shah) #2

Not sure what happened, looks like unstable test.

Rebuilding made the failure go away on 15.10/16.04

https://ci.swift.org/job/oss-swift-incremental-RA-linux-ubuntu-16_04/7/
https://ci.swift.org/job/oss-swift-incremental-RA-linux-ubuntu-15_10/7751/

Thanks,
Mishal Shah

···

On Sep 21, 2016, at 6:20 PM, mishal_shah via swift-dev <swift-dev@swift.org> wrote:

Hi Andy,

This commit passed in PR testing on Ubuntu 14.04, however we are seeing failure on Ubuntu 16.04 and 15.10.

PR test: https://ci.swift.org/job/swift-PR-Linux/3877/console

https://ci.swift.org/job/oss-swift-incremental-RA-linux-ubuntu-16_04/6/
https://ci.swift.org/job/oss-swift-incremental-RA-linux-ubuntu-15_10/7750/

Test Case 'TestNSData.testBasicConstruction' started at 01:09:31.825
/home/buildnode/jenkins/workspace/oss-swift-incremental-RA-linux-ubuntu-16_04/buildbot_incremental/foundation-linux-x86_64/TestFoundation/TestFoundation: symbol lookup error: /home/buildnode/jenkins/workspace/oss-swift-incremental-RA-linux-ubuntu-16_04/buildbot_incremental/foundation-linux-x86_64/TestFoundation/TestFoundation: undefined symbol: _TFSP17withMemoryReboundu0_rfzT2toMqd__8capacitySiFzGSpqd___qd_0__qd_0_
/home/buildnode/jenkins/workspace/oss-swift-incremental-RA-linux-ubuntu-16_04/swift/utils/build-script: fatal error: command terminated with a non-zero exit status 127, aborting
/home/buildnode/jenkins/workspace/oss-swift-incremental-RA-linux-ubuntu-16_04/swift/utils/build-script: fatal error: command terminated with a non-zero exit status 1, aborting
Build step 'Execute shell' marked build as failure

Thanks,
Mishal Shah

On Sep 21, 2016, at 6:10 PM, no-reply@swift.org <mailto:no-reply@swift.org> wrote:

[FAILURE] oss-swift-incremental-RA-linux-ubuntu-16_04 [#6]

Build URL: https://ci.swift.org/job/oss-swift-incremental-RA-linux-ubuntu-16_04/6/
Project: oss-swift-incremental-RA-linux-ubuntu-16_04
Date of build: Wed, 21 Sep 2016 17:55:24 -0700
Build duration: 14 min
Tests:

Name: Swift(linux-x86_64)
Failed: 0 test(s), Passed: 8338 test(s), Total: 8338 test(s)
Name: Swift-Unit
Failed: 0 test(s), Passed: 297 test(s), Total: 297 test(s)

Changes

Commit 2c9cde1c7192269757ea6f0625d08442499a0e76 by atrick:
[stdlib] fix UnsafePointer.withMemoryRebound(to:capacity:) argument

edit: stdlib/public/core/UnsafePointer.swift.gyb
edit: test/stdlib/UnsafePointer.swift.gyb

_______________________________________________
swift-dev mailing list
swift-dev@swift.org
https://lists.swift.org/mailman/listinfo/swift-dev