[Swift CI] Build Failure: 0. OSS - Swift Incremental RA - Ubuntu 16.04 (master) #3925


(Pavel Yaskevich) #1

Log says:

/home/buildnode/disk2/workspace/oss-swift-incremental-RA-linux-ubuntu-16_04/swift/utils/build-script-impl:
line 262: 27497 Segmentation fault "$@"
/home/buildnode/disk2/workspace/oss-swift-incremental-RA-linux-ubuntu-16_04/swift/utils/build-script:
fatal error: command terminated with a non-zero exit status 139, aborting
/home/buildnode/disk2/workspace/oss-swift-incremental-RA-linux-ubuntu-16_04/swift/utils/build-script:
fatal error: command terminated with a non-zero exit status 1, aborting

Mishal, could you please check what happened?

···

On Wed, Jul 12, 2017 at 3:39 PM, <no-reply@swift.org> wrote:

[FAILURE] oss-swift-incremental-RA-linux-ubuntu-16_04 [#3925]
Build URL: https://ci.swift.org/job/oss-swift-incremental-RA-linux-
ubuntu-16_04/3925/
Project: oss-swift-incremental-RA-linux-ubuntu-16_04
Date of build: Wed, 12 Jul 2017 14:31:21 -0700
Build duration: 1 hr 8 min Tests:
Name: *Swift(linux-x86_64)*
Failed: 0 test(s), Passed: 9630 test(s), Total: 9630 test(s)
Name: *Swift-Unit*
Failed: 0 test(s), Passed: 441 test(s), Total: 441 test(s)

Changes

   - Commit *481401f6c3c754c5e88b496b2353f2488fb4b584* by *Pavel
   Yaskevich:*

   [QoI] Don't try to lookup members on incorrect type during Objective-C
   - *add*: validation-test/compiler_crashers_2_fixed/0113-
      rdar33044867.swift
      - *edit*: lib/Sema/TypeCheckExprObjC.cpp


(Slava Pestov) #2

FWIW I filed rdar://33276769 <rdar://33276769> to track the issue internally.

···

On Jul 12, 2017, at 3:44 PM, Pavel Yaskevich <xedin@apache.org> wrote:

Log says:

/home/buildnode/disk2/workspace/oss-swift-incremental-RA-linux-ubuntu-16_04/swift/utils/build-script-impl: line 262: 27497 Segmentation fault "$@"
/home/buildnode/disk2/workspace/oss-swift-incremental-RA-linux-ubuntu-16_04/swift/utils/build-script: fatal error: command terminated with a non-zero exit status 139, aborting
/home/buildnode/disk2/workspace/oss-swift-incremental-RA-linux-ubuntu-16_04/swift/utils/build-script: fatal error: command terminated with a non-zero exit status 1, aborting

Mishal, could you please check what happened?

On Wed, Jul 12, 2017 at 3:39 PM, <no-reply@swift.org <mailto:no-reply@swift.org>> wrote:
[FAILURE] oss-swift-incremental-RA-linux-ubuntu-16_04 [#3925]

Build URL: https://ci.swift.org/job/oss-swift-incremental-RA-linux-ubuntu-16_04/3925/
Project: oss-swift-incremental-RA-linux-ubuntu-16_04
Date of build: Wed, 12 Jul 2017 14:31:21 -0700
Build duration: 1 hr 8 min
Tests:

Name: Swift(linux-x86_64)
Failed: 0 test(s), Passed: 9630 test(s), Total: 9630 test(s)
Name: Swift-Unit
Failed: 0 test(s), Passed: 441 test(s), Total: 441 test(s)

Changes

Commit 481401f6c3c754c5e88b496b2353f2488fb4b584 by Pavel Yaskevich:
[QoI] Don't try to lookup members on incorrect type during Objective-C

add: validation-test/compiler_crashers_2_fixed/0113-rdar33044867.swift
edit: lib/Sema/TypeCheckExprObjC.cpp