[Swift CI] Build Failure: 0. OSS - Swift Incremental RA - Ubuntu 16.04 (master) #1385

Looks like libdispatch problem again, can anybody please take a look at it?

<unknown>:0: error: module map file '/home/buildnode/jenkins/workspace/oss-swift-incremental-RA-linux-ubuntu-16_04/swift-corelibs-libdispatch/dispatch/module.modulemap' not found
<><unknown>:0: error: module map file '/home/buildnode/jenkins/workspace/oss-swift-incremental-RA-linux-ubuntu-16_04/swift-corelibs-libdispatch/dispatch/module.modulemap' not found

···

On Nov 8, 2017, at 7:13 PM, no-reply@swift.org wrote:

[FAILURE] oss-swift-incremental-RA-linux-ubuntu-16_04 [#1385]

Build URL: https://ci.swift.org/job/oss-swift-incremental-RA-linux-ubuntu-16_04/1385/
Project: oss-swift-incremental-RA-linux-ubuntu-16_04
Date of build: Wed, 08 Nov 2017 20:48:44 -0600
Build duration: 24 min
Identified problems:

Compile Error: This build failed because of a compile error. Below is a list of all errors in the build log:
Indication 1 <https://ci.swift.org//job/oss-swift-incremental-RA-linux-ubuntu-16_04/1385/consoleFull#-14044565523122a513-f36a-4c87-8ed7-cbc36a1ec144>
Tests:

Name: Swift(linux-x86_64)
Failed: 0 test(s), Passed: 10036 test(s), Total: 10036 test(s)
Name: Swift-Unit
Failed: 0 test(s), Passed: 486 test(s), Total: 486 test(s)

Changes

Commit 0cd96b26abb5adc937bebd714c5239f5a69adf00 by enderby:
Fix a crash in llvm-nm for a bad Mach-O file that has an N_SECT type

edit: tools/llvm-nm/llvm-nm.cpp
add: test/tools/llvm-nm/X86/macho-bad-zero-nsect-for-N_SECT.test
add: test/tools/llvm-nm/X86/Inputs/macho-bad-zero-nsect-for-N_SECT

Commit b2a89068d01c236b39e9af1e9db41a8be93ba1e5 by enderby:
Fix a bug in llvm-objdump when disassembling using the wrong default CPU

add: test/tools/llvm-objdump/AArch64/macho-fat-arm-disasm.test
edit: tools/llvm-objdump/MachODump.cpp
add: test/tools/llvm-objdump/AArch64/Inputs/fat.macho-armv7s-arm64