[Swift CI] Build Failure: 0. OSS - Swift Incremental RA - Ubuntu 16.04 (master) #1367

Build failed with following error:

<unknown>:0: error: module map file '/home/buildnode/jenkins/workspace/oss-swift-incremental-RA-linux-ubuntu-16_04/swift-corelibs-libdispatch/dispatch/module.modulemap' not found
<unknown>:0: error: module map file '/home/buildnode/jenkins/workspace/oss-swift-incremental-RA-linux-ubuntu-16_04/swift-corelibs-libdispatch/dispatch/module.modulemap' not found

Mishal, is this something infra related?

···

On Nov 7, 2017, at 11:41 AM, no-reply@swift.org wrote:

[FAILURE] oss-swift-incremental-RA-linux-ubuntu-16_04 [#1367]

Build URL: https://ci.swift.org/job/oss-swift-incremental-RA-linux-ubuntu-16_04/1367/
Project: oss-swift-incremental-RA-linux-ubuntu-16_04
Date of build: Tue, 07 Nov 2017 13:36:03 -0600
Build duration: 6 min 12 sec
Identified problems:

Compile Error: This build failed because of a compile error. Below is a list of all errors in the build log:
Indication 1 <https://ci.swift.org//job/oss-swift-incremental-RA-linux-ubuntu-16_04/1367/consoleFull#-14044565523122a513-f36a-4c87-8ed7-cbc36a1ec144>
Tests:

Name: Swift(linux-x86_64)
Failed: 0 test(s), Passed: 10030 test(s), Total: 10030 test(s)
Name: Swift-Unit
Failed: 0 test(s), Passed: 486 test(s), Total: 486 test(s)

Changes

Commit 884f3dbdc275235b6be2a9185480b3faf9b068c6 by github:
swift-api-digester: Ignore the declarations that have no accessibility

edit: tools/swift-api-digester/swift-api-digester.cpp

I think this is due to libdispatch not getting rebuild after swift changes.

Hopefully this PR resolves the issue:
https://github.com/apple/swift/pull/12736

Thanks,
Mishal Shah

···

On Nov 7, 2017, at 11:42 AM, Pavel Yaskevich <pyaskevich@apple.com> wrote:

Build failed with following error:

<unknown>:0: error: module map file '/home/buildnode/jenkins/workspace/oss-swift-incremental-RA-linux-ubuntu-16_04/swift-corelibs-libdispatch/dispatch/module.modulemap' not found
<unknown>:0: error: module map file '/home/buildnode/jenkins/workspace/oss-swift-incremental-RA-linux-ubuntu-16_04/swift-corelibs-libdispatch/dispatch/module.modulemap' not found

Mishal, is this something infra related?

On Nov 7, 2017, at 11:41 AM, no-reply@swift.org <mailto:no-reply@swift.org> wrote:

[FAILURE] oss-swift-incremental-RA-linux-ubuntu-16_04 [#1367]

Build URL: https://ci.swift.org/job/oss-swift-incremental-RA-linux-ubuntu-16_04/1367/
Project: oss-swift-incremental-RA-linux-ubuntu-16_04
Date of build: Tue, 07 Nov 2017 13:36:03 -0600
Build duration: 6 min 12 sec
Identified problems:

Compile Error: This build failed because of a compile error. Below is a list of all errors in the build log:
Indication 1 <https://ci.swift.org//job/oss-swift-incremental-RA-linux-ubuntu-16_04/1367/consoleFull#-14044565523122a513-f36a-4c87-8ed7-cbc36a1ec144>
Tests:

Name: Swift(linux-x86_64)
Failed: 0 test(s), Passed: 10030 test(s), Total: 10030 test(s)
Name: Swift-Unit
Failed: 0 test(s), Passed: 486 test(s), Total: 486 test(s)

Changes

Commit 884f3dbdc275235b6be2a9185480b3faf9b068c6 by github:
swift-api-digester: Ignore the declarations that have no accessibility

edit: tools/swift-api-digester/swift-api-digester.cpp