[Swift CI] Build Failure: 0. OSS - Swift Incremental RA - Ubuntu 16.04 (master) #12933

Report

[FAILURE] oss-swift-incremental-RA-linux-ubuntu-16_04 [#12933]

Build URL:
https://ci.swift.org/job/oss-swift-incremental-RA-linux-ubuntu-16_04/12933/
Project:
oss-swift-incremental-RA-linux-ubuntu-16_04
Date of build:
Thu, 09 Apr 2020 09:39:08 -0500
Build duration:
1 hr 17 min

Changes

  • Commit 5213bec4d2e96d6cdccf4e91a615433f330d0336 by owen:
    [Sema] Eliminate duplication in CaseStmt typechecking for switch and

    • edit: lib/Sema/TypeCheckStmt.cpp

New issue found!

I'm looking at this now, it seems to be unrelated to the change above but I haven't 100% narrowed it down.

Relevant logs:

10:09:35 Test Suite 'Selected tests' started at 2020-04-09 17:09:34.502
10:09:35 Test Suite 'SwiftPMIntegrationTests' started at 2020-04-09 17:09:34.504
10:09:35 Test Case 'SwiftPMIntegrationTests.testSwiftPMIntegration' started at 2020-04-09 17:09:34.504
10:09:35 Test Case 'SwiftPMIntegrationTests.testSwiftPMIntegration' passed (0.816 seconds)
10:09:35 Test Suite 'SwiftPMIntegrationTests' passed at 2020-04-09 17:09:35.320
10:09:35 	 Executed 1 test, with 0 failures (0 unexpected) in 0.816 (0.816) seconds
10:09:35 Test Suite 'Selected tests' passed at 2020-04-09 17:09:35.320
10:09:35 	 Executed 1 test, with 0 failures (0 unexpected) in 0.816 (0.816) seconds
10:09:35 
<unknown>:0: error: compiler is in code completion mode (benign diagnostic)
10:09:35 /home/buildnode/jenkins/workspace/oss-swift-incremental-RA-linux-ubuntu-16_04/buildbot_incremental/toolchain-linux-x86_64/usr/bin/swift build --show-bin-path --package-path /home/buildnode/jenkins/workspace/oss-swift-incremental-RA-linux-ubuntu-16_04/sourcekit-lsp --build-path /home/buildnode/jenkins/workspace/oss-swift-incremental-RA-linux-ubuntu-16_04/buildbot_incremental/sourcekitlsp-linux-x86_64 --configuration release -Xcxx -I -Xcxx /home/buildnode/jenkins/workspace/oss-swift-incremental-RA-linux-ubuntu-16_04/buildbot_incremental/toolchain-linux-x86_64/usr/lib/swift -Xcxx -I -Xcxx /home/buildnode/jenkins/workspace/oss-swift-incremental-RA-linux-ubuntu-16_04/buildbot_incremental/toolchain-linux-x86_64/usr/lib/swift/Block -Xlinker -rpath -Xlinker $ORIGIN/../lib/swift/linux
10:09:35 Cleaning /home/buildnode/jenkins/workspace/oss-swift-incremental-RA-linux-ubuntu-16_04/buildbot_incremental/sourcekitlsp-linux-x86_64/x86_64-unknown-linux-gnu/release/sk-tests
10:09:35 /home/buildnode/jenkins/workspace/oss-swift-incremental-RA-linux-ubuntu-16_04/buildbot_incremental/toolchain-linux-x86_64/usr/bin/swift test --package-path /home/buildnode/jenkins/workspace/oss-swift-incremental-RA-linux-ubuntu-16_04/sourcekit-lsp --build-path /home/buildnode/jenkins/workspace/oss-swift-incremental-RA-linux-ubuntu-16_04/buildbot_incremental/sourcekitlsp-linux-x86_64 --configuration release --verbose -Xcxx -I -Xcxx /home/buildnode/jenkins/workspace/oss-swift-incremental-RA-linux-ubuntu-16_04/buildbot_incremental/toolchain-linux-x86_64/usr/lib/swift -Xcxx -I -Xcxx /home/buildnode/jenkins/workspace/oss-swift-incremental-RA-linux-ubuntu-16_04/buildbot_incremental/toolchain-linux-x86_64/usr/lib/swift/Block -Xlinker -rpath -Xlinker $ORIGIN/../lib/swift/linux --parallel
10:09:35 Traceback (most recent call last):
10:09:35   File "/home/buildnode/jenkins/workspace/oss-swift-incremental-RA-linux-ubuntu-16_04/sourcekit-lsp/Utilities/build-script-helper.py", line 145, in <module>
10:09:35     main()
10:09:35   File "/home/buildnode/jenkins/workspace/oss-swift-incremental-RA-linux-ubuntu-16_04/sourcekit-lsp/Utilities/build-script-helper.py", line 136, in main
10:09:35     swiftpm('test', swift_exec, swiftpm_args + ['--parallel'], env)
10:09:35   File "/home/buildnode/jenkins/workspace/oss-swift-incremental-RA-linux-ubuntu-16_04/sourcekit-lsp/Utilities/build-script-helper.py", line 15, in swiftpm
10:09:35     subprocess.check_call(cmd, env=env)
10:09:35   File "/usr/lib/python2.7/subprocess.py", line 541, in check_call
10:09:35     raise CalledProcessError(retcode, cmd)
10:09:35 subprocess.CalledProcessError: Command '['/home/buildnode/jenkins/workspace/oss-swift-incremental-RA-linux-ubuntu-16_04/buildbot_incremental/toolchain-linux-x86_64/usr/bin/swift', 'test', '--package-path', '/home/buildnode/jenkins/workspace/oss-swift-incremental-RA-linux-ubuntu-16_04/sourcekit-lsp', '--build-path', '/home/buildnode/jenkins/workspace/oss-swift-incremental-RA-linux-ubuntu-16_04/buildbot_incremental/sourcekitlsp-linux-x86_64', '--configuration', 'release', '--verbose', '-Xcxx', '-I', '-Xcxx', '/home/buildnode/jenkins/workspace/oss-swift-incremental-RA-linux-ubuntu-16_04/buildbot_incremental/toolchain-linux-x86_64/usr/lib/swift', '-Xcxx', '-I', '-Xcxx', '/home/buildnode/jenkins/workspace/oss-swift-incremental-RA-linux-ubuntu-16_04/buildbot_incremental/toolchain-linux-x86_64/usr/lib/swift/Block', '-Xlinker', '-rpath', '-Xlinker', '$ORIGIN/../lib/swift/linux', '--parallel']' returned non-zero exit status 1
10:09:35 Building the standard library for: swift-stdlib-linux-x86_64
10:09:35 Running Swift tests for: check-swift-validation-linux-x86_64
Terms of Service

Privacy Policy

Cookie Policy