[Swift CI] Build Failure: 0. OSS - Swift Incremental RA - Ubuntu 16.04 (master) #1118


(Mishal Shah) #1

llbuild test failure:

******************** TEST 'llbuild-unit :: BuildSystem/BuildSystemTests/BuildSystemFrontendTest.commandSkippingFailure' FAILED ********************

Note: Google Test filter = BuildSystemFrontendTest.commandSkippingFailure
[==========] Running 1 test from 1 test case.
[----------] Global test environment set-up.
[----------] 1 test from BuildSystemFrontendTest
[ RUN ] BuildSystemFrontendTest.commandSkippingFailure

···

********************
Testing: 0 .. 10.. 20.. 30.. 40.. 50.. 60.. 70.. 80.. 90..
Testing Time: 10.61s
********************
Failing Tests (1):
    llbuild-unit :: BuildSystem/BuildSystemTests/BuildSystemFrontendTest.commandSkippingFailure

Thanks,
Mishal Shah

On Dec 20, 2016, at 10:24 AM, no-reply@swift.org wrote:

[FAILURE] oss-swift-incremental-RA-linux-ubuntu-16_04 [#1118]

Build URL: https://ci.swift.org/job/oss-swift-incremental-RA-linux-ubuntu-16_04/1118/
Project: oss-swift-incremental-RA-linux-ubuntu-16_04
Date of build: Mon, 19 Dec 2016 20:24:28 -0800
Build duration: 30 min
Identified problems:

Regression test failed: This build failed because a regression test in the test suite FAILed. Below is a list of all errors:
Indication 1 <https://ci.swift.org//job/oss-swift-incremental-RA-linux-ubuntu-16_04/1118/consoleFull#-902833422fca400bf-2f4a-462e-b517-e058d770b2d7>
Tests:

Name: Swift(linux-x86_64)
Failed: 0 test(s), Passed: 8673 test(s), Total: 8673 test(s)
Name: Swift-Unit
Failed: 0 test(s), Passed: 237 test(s), Total: 237 test(s)

Changes

Commit a8a0667f50bf0d03bfb68bcaa961f927a8dba153 by hughbellars:
Fix MSVC errors compiling GenericSignature.h

edit: include/swift/AST/Type.h
edit: include/swift/AST/GenericSignature.h


(Daniel Dunbar) #2

Thanks Mishal!

+ Mirza

I reverted in:
  b68d158
while we investigate.

- Daniel

···

On Dec 19, 2016, at 8:56 PM, mishal_shah via swift-dev <swift-dev@swift.org> wrote:

llbuild test failure:

******************** TEST 'llbuild-unit :: BuildSystem/BuildSystemTests/BuildSystemFrontendTest.commandSkippingFailure' FAILED ********************

Note: Google Test filter = BuildSystemFrontendTest.commandSkippingFailure
[==========] Running 1 test from 1 test case.
[----------] Global test environment set-up.
[----------] 1 test from BuildSystemFrontendTest
[ RUN ] BuildSystemFrontendTest.commandSkippingFailure

********************
Testing: 0 .. 10.. 20.. 30.. 40.. 50.. 60.. 70.. 80.. 90..
Testing Time: 10.61s
********************
Failing Tests (1):
    llbuild-unit :: BuildSystem/BuildSystemTests/BuildSystemFrontendTest.commandSkippingFailure

Thanks,
Mishal Shah

On Dec 20, 2016, at 10:24 AM, no-reply@swift.org <mailto:no-reply@swift.org> wrote:

[FAILURE] oss-swift-incremental-RA-linux-ubuntu-16_04 [#1118]

Build URL: https://ci.swift.org/job/oss-swift-incremental-RA-linux-ubuntu-16_04/1118/
Project: oss-swift-incremental-RA-linux-ubuntu-16_04
Date of build: Mon, 19 Dec 2016 20:24:28 -0800
Build duration: 30 min
Identified problems:

Regression test failed: This build failed because a regression test in the test suite FAILed. Below is a list of all errors:
Indication 1 <https://ci.swift.org//job/oss-swift-incremental-RA-linux-ubuntu-16_04/1118/consoleFull#-902833422fca400bf-2f4a-462e-b517-e058d770b2d7>
Tests:

Name: Swift(linux-x86_64)
Failed: 0 test(s), Passed: 8673 test(s), Total: 8673 test(s)
Name: Swift-Unit
Failed: 0 test(s), Passed: 237 test(s), Total: 237 test(s)

Changes

Commit a8a0667f50bf0d03bfb68bcaa961f927a8dba153 by hughbellars:
Fix MSVC errors compiling GenericSignature.h

edit: include/swift/AST/Type.h
edit: include/swift/AST/GenericSignature.h

_______________________________________________
swift-dev mailing list
swift-dev@swift.org
https://lists.swift.org/mailman/listinfo/swift-dev