[Swift CI] Build Failure: 0. OSS - Swift Incremental RA - Ubuntu 16.04 (master) #1078

This needs a clean build too...

···

On Oct 17, 2017, at 11:55 AM, no-reply@swift.org wrote:

[FAILURE] oss-swift-incremental-RA-linux-ubuntu-16_04 [#1078]

Build URL: https://ci.swift.org/job/oss-swift-incremental-RA-linux-ubuntu-16_04/1078/
Project: oss-swift-incremental-RA-linux-ubuntu-16_04
Date of build: Tue, 17 Oct 2017 13:35:55 -0500
Build duration: 20 min
Identified problems:

Regression test failed: This build failed because a regression test in the test suite FAILed. Below is a list of all errors:
Indication 1 <https://ci.swift.org//job/oss-swift-incremental-RA-linux-ubuntu-16_04/1078/consoleFull#-25631360ba62d58e-7248-467b-91e0-c7508d5cf947>
Compile Error: This build failed because of a compile error. Below is a list of all errors in the build log:
Indication 1 <https://ci.swift.org//job/oss-swift-incremental-RA-linux-ubuntu-16_04/1078/consoleFull#14485137193122a513-f36a-4c87-8ed7-cbc36a1ec144>
Tests:

Name: Swift(linux-x86_64)
Failed: 2 test(s), Passed: 10003 test(s), Total: 10005 test(s)
Failed: Swift(linux-x86_64).Reflection.capture_descriptors.sil <https://ci.swift.org/job/oss-swift-incremental-RA-linux-ubuntu-16_04/1078/testReport/junit/Swift(linux-x86_64)/Reflection/capture_descriptors_sil>
Failed: Swift(linux-x86_64).Reflection.typeref_decoding.swift <https://ci.swift.org/job/oss-swift-incremental-RA-linux-ubuntu-16_04/1078/testReport/junit/Swift(linux-x86_64)/Reflection/typeref_decoding_swift>
Name: Swift-Unit
Failed: 0 test(s), Passed: 483 test(s), Total: 483 test(s)

Changes

Commit 8f26fb88d4e0e03bbdfadb560b96f00079205b19 by pyaskevich:
[Mangling] Improve handling of the variadic function parameters

edit: test/Reflection/typeref_decoding.swift
edit: lib/AST/ASTMangler.cpp
edit: test/Reflection/capture_descriptors.sil
edit: test/SourceKit/DocSupport/doc_clang_module.swift.response
edit: test/SILGen/scalar_to_tuple_args.swift
edit: test/IRGen/big_types_corner_cases.swift
edit: test/SILGen/mangling.swift
edit: test/Serialization/function.swift
edit: stdlib/public/Reflection/TypeRef.cpp
edit: lib/Demangling/NodePrinter.cpp
edit: test/Demangle/Inputs/manglings.txt
edit: test/SILGen/opaque_values_silgen.swift
edit: test/SILGen/default_arguments_imported.swift
edit: test/Reflection/Inputs/ConcreteTypes.swift
edit: test/SILGen/retaining_globals.swift
edit: test/SIL/Serialization/deserialize_generic.sil
edit: test/SILGen/errors.swift

Commit 7dce4bfda9e31a877cded78019b4b43f2110c0ca by ankit_aggarwal:
[PinsStore] Add support for loading PinsStore schema 1

edit: Sources/Workspace/PinsStore.swift
edit: Tests/WorkspaceTests/PinsStoreTests.swift

Workspace cleaned, next build will be clean build.

Thanks,
Mishal Shah

···

On Oct 17, 2017, at 11:56 AM, Pavel Yaskevich <pyaskevich@apple.com> wrote:

This needs a clean build too...

On Oct 17, 2017, at 11:55 AM, no-reply@swift.org <mailto:no-reply@swift.org> wrote:

[FAILURE] oss-swift-incremental-RA-linux-ubuntu-16_04 [#1078]

Build URL: https://ci.swift.org/job/oss-swift-incremental-RA-linux-ubuntu-16_04/1078/
Project: oss-swift-incremental-RA-linux-ubuntu-16_04
Date of build: Tue, 17 Oct 2017 13:35:55 -0500
Build duration: 20 min
Identified problems:

Regression test failed: This build failed because a regression test in the test suite FAILed. Below is a list of all errors:
Indication 1 <https://ci.swift.org//job/oss-swift-incremental-RA-linux-ubuntu-16_04/1078/consoleFull#-25631360ba62d58e-7248-467b-91e0-c7508d5cf947>
Compile Error: This build failed because of a compile error. Below is a list of all errors in the build log:
Indication 1 <https://ci.swift.org//job/oss-swift-incremental-RA-linux-ubuntu-16_04/1078/consoleFull#14485137193122a513-f36a-4c87-8ed7-cbc36a1ec144>
Tests:

Name: Swift(linux-x86_64)
Failed: 2 test(s), Passed: 10003 test(s), Total: 10005 test(s)
Failed: Swift(linux-x86_64).Reflection.capture_descriptors.sil <https://ci.swift.org/job/oss-swift-incremental-RA-linux-ubuntu-16_04/1078/testReport/junit/Swift(linux-x86_64)/Reflection/capture_descriptors_sil>
Failed: Swift(linux-x86_64).Reflection.typeref_decoding.swift <https://ci.swift.org/job/oss-swift-incremental-RA-linux-ubuntu-16_04/1078/testReport/junit/Swift(linux-x86_64)/Reflection/typeref_decoding_swift>
Name: Swift-Unit
Failed: 0 test(s), Passed: 483 test(s), Total: 483 test(s)

Changes

Commit 8f26fb88d4e0e03bbdfadb560b96f00079205b19 by pyaskevich:
[Mangling] Improve handling of the variadic function parameters

edit: test/Reflection/typeref_decoding.swift
edit: lib/AST/ASTMangler.cpp
edit: test/Reflection/capture_descriptors.sil
edit: test/SourceKit/DocSupport/doc_clang_module.swift.response
edit: test/SILGen/scalar_to_tuple_args.swift
edit: test/IRGen/big_types_corner_cases.swift
edit: test/SILGen/mangling.swift
edit: test/Serialization/function.swift
edit: stdlib/public/Reflection/TypeRef.cpp
edit: lib/Demangling/NodePrinter.cpp
edit: test/Demangle/Inputs/manglings.txt
edit: test/SILGen/opaque_values_silgen.swift
edit: test/SILGen/default_arguments_imported.swift
edit: test/Reflection/Inputs/ConcreteTypes.swift
edit: test/SILGen/retaining_globals.swift
edit: test/SIL/Serialization/deserialize_generic.sil
edit: test/SILGen/errors.swift

Commit 7dce4bfda9e31a877cded78019b4b43f2110c0ca by ankit_aggarwal:
[PinsStore] Add support for loading PinsStore schema 1

edit: Sources/Workspace/PinsStore.swift
edit: Tests/WorkspaceTests/PinsStoreTests.swift

Thank you, Mishal!

···

On Oct 17, 2017, at 12:01 PM, Mishal Shah <mishal_shah@apple.com> wrote:

Workspace cleaned, next build will be clean build.

Thanks,
Mishal Shah

On Oct 17, 2017, at 11:56 AM, Pavel Yaskevich <pyaskevich@apple.com <mailto:pyaskevich@apple.com>> wrote:

This needs a clean build too...

On Oct 17, 2017, at 11:55 AM, no-reply@swift.org <mailto:no-reply@swift.org> wrote:

[FAILURE] oss-swift-incremental-RA-linux-ubuntu-16_04 [#1078]

Build URL: https://ci.swift.org/job/oss-swift-incremental-RA-linux-ubuntu-16_04/1078/
Project: oss-swift-incremental-RA-linux-ubuntu-16_04
Date of build: Tue, 17 Oct 2017 13:35:55 -0500
Build duration: 20 min
Identified problems:

Regression test failed: This build failed because a regression test in the test suite FAILed. Below is a list of all errors:
Indication 1 <https://ci.swift.org//job/oss-swift-incremental-RA-linux-ubuntu-16_04/1078/consoleFull#-25631360ba62d58e-7248-467b-91e0-c7508d5cf947>
Compile Error: This build failed because of a compile error. Below is a list of all errors in the build log:
Indication 1 <https://ci.swift.org//job/oss-swift-incremental-RA-linux-ubuntu-16_04/1078/consoleFull#14485137193122a513-f36a-4c87-8ed7-cbc36a1ec144>
Tests:

Name: Swift(linux-x86_64)
Failed: 2 test(s), Passed: 10003 test(s), Total: 10005 test(s)
Failed: Swift(linux-x86_64).Reflection.capture_descriptors.sil <https://ci.swift.org/job/oss-swift-incremental-RA-linux-ubuntu-16_04/1078/testReport/junit/Swift(linux-x86_64)/Reflection/capture_descriptors_sil>
Failed: Swift(linux-x86_64).Reflection.typeref_decoding.swift <https://ci.swift.org/job/oss-swift-incremental-RA-linux-ubuntu-16_04/1078/testReport/junit/Swift(linux-x86_64)/Reflection/typeref_decoding_swift>
Name: Swift-Unit
Failed: 0 test(s), Passed: 483 test(s), Total: 483 test(s)

Changes

Commit 8f26fb88d4e0e03bbdfadb560b96f00079205b19 by pyaskevich:
[Mangling] Improve handling of the variadic function parameters

edit: test/Reflection/typeref_decoding.swift
edit: lib/AST/ASTMangler.cpp
edit: test/Reflection/capture_descriptors.sil
edit: test/SourceKit/DocSupport/doc_clang_module.swift.response
edit: test/SILGen/scalar_to_tuple_args.swift
edit: test/IRGen/big_types_corner_cases.swift
edit: test/SILGen/mangling.swift
edit: test/Serialization/function.swift
edit: stdlib/public/Reflection/TypeRef.cpp
edit: lib/Demangling/NodePrinter.cpp
edit: test/Demangle/Inputs/manglings.txt
edit: test/SILGen/opaque_values_silgen.swift
edit: test/SILGen/default_arguments_imported.swift
edit: test/Reflection/Inputs/ConcreteTypes.swift
edit: test/SILGen/retaining_globals.swift
edit: test/SIL/Serialization/deserialize_generic.sil
edit: test/SILGen/errors.swift

Commit 7dce4bfda9e31a877cded78019b4b43f2110c0ca by ankit_aggarwal:
[PinsStore] Add support for loading PinsStore schema 1

edit: Sources/Workspace/PinsStore.swift
edit: Tests/WorkspaceTests/PinsStoreTests.swift