[Swift CI] Build Failure: 0. OSS - Swift Incremental RA - Ubuntu 16.04 - Long Test (master) #447

Missing build dependency somewhere?

[7/78] Generating swiftDispatch.o, swift/Dispatch.swiftmodule, swift/Dispatch.swiftdoc
FAILED: src/swiftDispatch.o src/swift/Dispatch.swiftmodule src/swift/Dispatch.swiftdoc
cd /home/buildnode/jenkins/workspace/oss-swift-incremental-RA-linux-ubuntu-16_04-long-test/buildbot_incremental/libdispatch-linux-x86_64/src && /usr/bin/cmake -E make_directory /home/buildnode/jenkins/workspace/oss-swift-incremental-RA-linux-ubuntu-16_04-long-test/buildbot_incremental/libdispatch-linux-x86_64/src/swift && /home/buildnode/jenkins/workspace/oss-swift-incremental-RA-linux-ubuntu-16_04-long-test/buildbot_incremental/swift-linux-x86_64/bin/swiftc -emit-library -module-name Dispatch -module-link-name dispatch -emit-module-path /home/buildnode/jenkins/workspace/oss-swift-incremental-RA-linux-ubuntu-16_04-long-test/buildbot_incremental/libdispatch-linux-x86_64/src/swift/Dispatch.swiftmodule -I /home/buildnode/jenkins/workspace/oss-swift-incremental-RA-linux-ubuntu-16_04-long-test/swift-corelibs-libdispatch -Xcc -fblocks -Xcc -fmodule-map-file=/home/buildnode/jenkins/workspace/oss-swift-incremental-RA-linux-ubuntu-16_04-long-test/swift-corelibs-libdispatch/dispatch/module.modulemap -force-single-frontend-invocation -c /home/buildnode/jenkins/workspace/oss-swift-incremental-RA-linux-ubuntu-16_04-long-test/swift-corelibs-libdispatch/src/swift/Block.swift /home/buildnode/jenkins/workspace/oss-swift-incremental-RA-linux-ubuntu-16_04-long-test/swift-corelibs-libdispatch/src/swift/Data.swift /home/buildnode/jenkins/workspace/oss-swift-incremental-RA-linux-ubuntu-16_04-long-test/swift-corelibs-libdispatch/src/swift/Dispatch.swift /home/buildnode/jenkins/workspace/oss-swift-incremental-RA-linux-ubuntu-16_04-long-test/swift-corelibs-libdispatch/src/swift/IO.swift /home/buildnode/jenkins/workspace/oss-swift-incremental-RA-linux-ubuntu-16_04-long-test/swift-corelibs-libdispatch/src/swift/Private.swift /home/buildnode/jenkins/workspace/oss-swift-incremental-RA-linux-ubuntu-16_04-long-test/swift-corelibs-libdispatch/src/swift/Queue.swift /home/buildnode/jenkins/workspace/oss-swift-incremental-RA-linux-ubuntu-16_04-long-test/swift-corelibs-libdispatch/src/swift/Source.swift /home/buildnode/jenkins/workspace/oss-swift-incremental-RA-linux-ubuntu-16_04-long-test/swift-corelibs-libdispatch/src/swift/Time.swift /home/buildnode/jenkins/workspace/oss-swift-incremental-RA-linux-ubuntu-16_04-long-test/swift-corelibs-libdispatch/src/swift/Wrapper.swift -o /home/buildnode/jenkins/workspace/oss-swift-incremental-RA-linux-ubuntu-16_04-long-test/buildbot_incremental/libdispatch-linux-x86_64/src/swiftDispatch.o
<unknown>:0: error: module map file '/home/buildnode/jenkins/workspace/oss-swift-incremental-RA-linux-ubuntu-16_04-long-test/swift-corelibs-libdispatch/dispatch/module.modulemap' not found
<unknown>:0: error: module map file '/home/buildnode/jenkins/workspace/oss-swift-incremental-RA-linux-ubuntu-16_04-long-test/swift-corelibs-libdispatch/dispatch/module.modulemap' not found
<unknown>:0: error: missing required module 'SwiftShims'

ยทยทยท

On Oct 18, 2017, at 6:56 AM, no-reply@swift.org wrote:

[FAILURE] oss-swift-incremental-RA-linux-ubuntu-16_04-long-test [#447]

Build URL: https://ci.swift.org/job/oss-swift-incremental-RA-linux-ubuntu-16_04-long-test/447/
Project: oss-swift-incremental-RA-linux-ubuntu-16_04-long-test
Date of build: Wed, 18 Oct 2017 08:19:00 -0500
Build duration: 38 min
Identified problems:

Compile Error: This build failed because of a compile error. Below is a list of all errors in the build log:
Indication 1 <https://ci.swift.org//job/oss-swift-incremental-RA-linux-ubuntu-16_04-long-test/447/consoleFull#-13603032823122a513-f36a-4c87-8ed7-cbc36a1ec144>
Changes

Commit bed0e27c78503aef1061f81de1290d218bbe9b9b by dave:
[AST] NFC: Warn if ExtInfo "with*" API results are unused

edit: include/swift/AST/Types.h

Commit 72c65ffcaf0a3356dcda492f825f976c618973fe by gparker:
Revert "[stdlib] Fix FloatingPoint.init(exactly:) (#11311)"

edit: test/stdlib/TestNSNumberBridging.swift
edit: validation-test/stdlib/FloatingPointConversion.swift.gyb
edit: stdlib/public/core/FloatingPointTypes.swift.gyb
edit: validation-test/stdlib/ValidationNSNumberBridging.swift

Commit 00a8ca48a5f70893669fc0567bc6d8485b71cc1f by github:
Revert "Update NSNumberBridging test for init(exactly:)"

edit: TestFoundation/TestNSNumberBridging.swift