[Swift CI] Build Failure: 0. OSS - Swift Incremental RA - Ubuntu 15.10 (master) #8474


(Mishal Shah) #1

Hi Anna,

Can you please look at this error?

/home/buildnode/jenkins/workspace/oss-swift-incremental-RA-linux-ubuntu-15_10/llvm/projects/compiler-rt/lib/sanitizer_common/sanitizer_posix.cc:362: multiple definition of `__sanitizer::FindAvailableMemoryRange(unsigned long, unsigned long, unsigned long)'
lib/sanitizer_common/CMakeFiles/RTSanitizerCommon.x86_64.dir/sanitizer_linux.cc.o:/home/buildnode/jenkins/workspace/oss-swift-incremental-RA-linux-ubuntu-15_10/llvm/projects/compiler-rt/lib/sanitizer_common/sanitizer_linux.cc:1393: first defined here
<>clang-4.0: error: linker command failed with exit code 1 (use -v to see invocation)
ninja: build stopped: subcommand failed.
ninja: build stopped: subcommand failed.
/home/buildnode/jenkins/workspace/oss-swift-incremental-RA-linux-ubuntu-15_10/swift/utils/build-script: fatal error: command terminated with a non-zero exit status 1, aborting
/home/buildnode/jenkins/workspace/oss-swift-incremental-RA-linux-ubuntu-15_10/swift/utils/build-script: fatal error: command terminated with a non-zero exit status 1, aborting

Thanks,
Mishal Shah

···

On Oct 26, 2016, at 6:03 PM, no-reply@swift.org wrote:

[FAILURE] oss-swift-incremental-RA-linux-ubuntu-15_10 [#8474]

Build URL: https://ci.swift.org/job/oss-swift-incremental-RA-linux-ubuntu-15_10/8474/
Project: oss-swift-incremental-RA-linux-ubuntu-15_10
Date of build: Wed, 26 Oct 2016 17:52:35 -0700
Build duration: 10 min
Identified problems:

Compile Error: This build failed because of a compile error. Below is a list of all errors in the build log:
Indication 1 <https://ci.swift.org//job/oss-swift-incremental-RA-linux-ubuntu-15_10/8474/consoleFull#-1232730284ee1a197b-acac-4b17-83cf-a53b95139a76>
Changes

Commit 1fecd0953f7fff95da703e9be17b97e5c4810974 by ganna:
[compiler-rt] Add support for the dynamic shadow allocation

edit: lib/sanitizer_common/sanitizer_common.h
edit: lib/asan/asan_win.cc
edit: lib/sanitizer_common/sanitizer_win.cc
edit: lib/asan/asan_interface_internal.h
edit: lib/asan/asan_win_dynamic_runtime_thunk.cc
edit: lib/asan/asan_win_dll_thunk.cc
edit: lib/asan/asan_mapping.h
edit: lib/asan/asan_rtl.cc
edit: lib/sanitizer_common/sanitizer_posix.cc


(Anna Zaks) #2

Thanks! Should be fixed now.
Anna.

···

On Oct 26, 2016, at 6:09 PM, mishal_shah <mishal_shah@apple.com <mailto:mishal_shah@apple.com>> wrote:

Hi Anna,

Can you please look at this error?

/home/buildnode/jenkins/workspace/oss-swift-incremental-RA-linux-ubuntu-15_10/llvm/projects/compiler-rt/lib/sanitizer_common/sanitizer_posix.cc:362: multiple definition of `__sanitizer::FindAvailableMemoryRange(unsigned long, unsigned long, unsigned long)'
lib/sanitizer_common/CMakeFiles/RTSanitizerCommon.x86_64.dir/sanitizer_linux.cc.o:/home/buildnode/jenkins/workspace/oss-swift-incremental-RA-linux-ubuntu-15_10/llvm/projects/compiler-rt/lib/sanitizer_common/sanitizer_linux.cc:1393: first defined here
<>clang-4.0: error: linker command failed with exit code 1 (use -v to see invocation)
ninja: build stopped: subcommand failed.
ninja: build stopped: subcommand failed.
/home/buildnode/jenkins/workspace/oss-swift-incremental-RA-linux-ubuntu-15_10/swift/utils/build-script: fatal error: command terminated with a non-zero exit status 1, aborting
/home/buildnode/jenkins/workspace/oss-swift-incremental-RA-linux-ubuntu-15_10/swift/utils/build-script: fatal error: command terminated with a non-zero exit status 1, aborting

Thanks,
Mishal Shah

On Oct 26, 2016, at 6:03 PM, no-reply@swift.org <mailto:no-reply@swift.org> wrote:

[FAILURE] oss-swift-incremental-RA-linux-ubuntu-15_10 [#8474]

Build URL: https://ci.swift.org/job/oss-swift-incremental-RA-linux-ubuntu-15_10/8474/
Project: oss-swift-incremental-RA-linux-ubuntu-15_10
Date of build: Wed, 26 Oct 2016 17:52:35 -0700
Build duration: 10 min
Identified problems:

Compile Error: This build failed because of a compile error. Below is a list of all errors in the build log:
Indication 1 <https://ci.swift.org//job/oss-swift-incremental-RA-linux-ubuntu-15_10/8474/consoleFull#-1232730284ee1a197b-acac-4b17-83cf-a53b95139a76>
Changes

Commit 1fecd0953f7fff95da703e9be17b97e5c4810974 by ganna:
[compiler-rt] Add support for the dynamic shadow allocation

edit: lib/sanitizer_common/sanitizer_common.h
edit: lib/asan/asan_win.cc
edit: lib/sanitizer_common/sanitizer_win.cc
edit: lib/asan/asan_interface_internal.h
edit: lib/asan/asan_win_dynamic_runtime_thunk.cc
edit: lib/asan/asan_win_dll_thunk.cc
edit: lib/asan/asan_mapping.h
edit: lib/asan/asan_rtl.cc
edit: lib/sanitizer_common/sanitizer_posix.cc