[Swift CI] Build Failure: 0. OSS - Swift Incremental RA - Ubuntu 15.10 (master) #7860


(Mishal Shah) #1

Hi,

This failure does not look like released to this commit.

Foundation test failed due to timeout.

Test Case 'TestURLSession.test_dataTaskWithURL' started at 11:00:53.813

TestFoundation/TestNSURLSession.swift:40: error: TestURLSession.test_dataTaskWithURL : Asynchronous wait failed - Exceeded timeout of 12.0 seconds, with unfulfilled expectations: data task

TestFoundation/TestNSURLSession.swift:42: error: TestURLSession.test_dataTaskWithURL : XCTAssertEqual failed: ("unknown") is not equal to ("Kathmandu") - test_dataTaskWithURLRequest returned an unexpected result

Thanks,
Mishal Shah

···

On Sep 26, 2016, at 9:58 AM, no-reply@swift.org wrote:

[FAILURE] oss-swift-incremental-RA-linux-ubuntu-15_10 [#7860]

Build URL: https://ci.swift.org/job/oss-swift-incremental-RA-linux-ubuntu-15_10/7860/
Project: oss-swift-incremental-RA-linux-ubuntu-15_10
Date of build: Mon, 26 Sep 2016 09:38:23 -0700
Build duration: 20 min
Identified problems:

Compile Error: This build failed because of a compile error. Below is a list of all errors in the build log:
Indication 1 <https://ci.swift.org//job/oss-swift-incremental-RA-linux-ubuntu-15_10/7860/consoleFull#1312037437ee1a197b-acac-4b17-83cf-a53b95139a76>
Tests:

Name: Swift(linux-x86_64)
Failed: 0 test(s), Passed: 8352 test(s), Total: 8352 test(s)
Name: Swift-Unit
Failed: 0 test(s), Passed: 297 test(s), Total: 297 test(s)

Changes

Commit 0a20774f8b3b803a70342bd6b2dae0767081cb10 by beanz:
Fix swift tests to work with in-tree LLDB

edit: test/Driver/options-repl-darwin.swift
edit: test/Driver/options-repl.swift
edit: test/Driver/subcommands.swift


(Tony Parker) #2

Hm, I thought the URLSession tests were still disabled?

- Tony

···

On Sep 26, 2016, at 10:41 AM, mishal_shah <mishal_shah@apple.com> wrote:

Hi,

This failure does not look like released to this commit.

Foundation test failed due to timeout.

Test Case 'TestURLSession.test_dataTaskWithURL' started at 11:00:53.813

TestFoundation/TestNSURLSession.swift:40: error: TestURLSession.test_dataTaskWithURL : Asynchronous wait failed - Exceeded timeout of 12.0 seconds, with unfulfilled expectations: data task

TestFoundation/TestNSURLSession.swift:42: error: TestURLSession.test_dataTaskWithURL : XCTAssertEqual failed: ("unknown") is not equal to ("Kathmandu") - test_dataTaskWithURLRequest returned an unexpected result

Thanks,
Mishal Shah

On Sep 26, 2016, at 9:58 AM, no-reply@swift.org <mailto:no-reply@swift.org> wrote:

[FAILURE] oss-swift-incremental-RA-linux-ubuntu-15_10 [#7860]

Build URL: https://ci.swift.org/job/oss-swift-incremental-RA-linux-ubuntu-15_10/7860/
Project: oss-swift-incremental-RA-linux-ubuntu-15_10
Date of build: Mon, 26 Sep 2016 09:38:23 -0700
Build duration: 20 min
Identified problems:

Compile Error: This build failed because of a compile error. Below is a list of all errors in the build log:
Indication 1 <https://ci.swift.org//job/oss-swift-incremental-RA-linux-ubuntu-15_10/7860/consoleFull#1312037437ee1a197b-acac-4b17-83cf-a53b95139a76>
Tests:

Name: Swift(linux-x86_64)
Failed: 0 test(s), Passed: 8352 test(s), Total: 8352 test(s)
Name: Swift-Unit
Failed: 0 test(s), Passed: 297 test(s), Total: 297 test(s)

Changes

Commit 0a20774f8b3b803a70342bd6b2dae0767081cb10 by beanz:
Fix swift tests to work with in-tree LLDB

edit: test/Driver/options-repl-darwin.swift
edit: test/Driver/options-repl.swift
edit: test/Driver/subcommands.swift


(Pushkar N Kulkarni) #3

Only the download task tests are disabled. And this is the second time we are seeing this data task test timing out.

I’d be glad to get more reviews and suggestions on: https://github.com/apple/swift-corelibs-foundation/pull/613 to have loopback tests replace these tests with external URL. Thanks.

Pushkar N Kulkarni,

IBM Runtimes

Simplicity is prerequisite for reliability - Edsger W. Dijkstra

  • Tony
···

On Sep 26, 2016, at 10:41 AM, mishal_shah mishal_shah@apple.com wrote:

Hi,

This failure does not look like released to this commit.

Foundation test failed due to timeout.

Test Case ‘TestURLSession.test_dataTaskWithURL’ started at 11:00:53.813

TestFoundation/TestNSURLSession.swift:40: error: TestURLSession.test_dataTaskWithURL : Asynchronous wait failed - Exceeded timeout of 12.0 seconds, with unfulfilled expectations: data task

TestFoundation/TestNSURLSession.swift:42: error: TestURLSession.test_dataTaskWithURL : XCTAssertEqual failed: (“unknown”) is not equal to (“Kathmandu”) - test_dataTaskWithURLRequest returned an unexpected result

Thanks,

Mishal Shah

On Sep 26, 2016, at 9:58 AM, no-reply@swift.org wrote:

[FAILURE] oss-swift-incremental-RA-linux-ubuntu-15_10 [#7860]

Build URL:
https://ci.swift.org/job/oss-swift-incremental-RA-linux-ubuntu-15_10/7860/
Project:
oss-swift-incremental-RA-linux-ubuntu-15_10
Date of build:
Mon, 26 Sep 2016 09:38:23 -0700
Build duration:
20 min

Identified problems:

  • Compile Error: This build failed because of a compile error. Below is a list of all errors in the build log:

Tests:

Name: Swift(linux-x86_64)
Failed: 0 test(s), Passed: 8352 test(s), Total: 8352 test(s)
Name: Swift-Unit
Failed: 0 test(s), Passed: 297 test(s), Total: 297 test(s)

Changes

  • Commit 0a20774f8b3b803a70342bd6b2dae0767081cb10 by beanz:
    Fix swift tests to work with in-tree LLDB
  • edit: test/Driver/options-repl-darwin.swift
  • edit: test/Driver/options-repl.swift
  • edit: test/Driver/subcommands.swift

To: mishal_shah mishal_shah@apple.com, Chris Bailey BAILEYC@uk.ibm.com, Pushkar N Kulkarni/India/IBM@IBMIN
From: Tony Parker
Sent by: anthony.parker@apple.com
Date: 09/26/2016 11:16PM
Cc: swift-dev swift-dev@swift.org, beanz@apple.com, Philippe Hausler phausler@apple.com
Subject: Re: [Swift CI] Build Failure: 0. OSS - Swift Incremental RA - Ubuntu 15.10 (master) #7860

Hm, I thought the URLSession tests were still disabled?

-----anthony.parker@apple.com wrote: -----


(Tony Parker) #4

Thanks Pushkar. I only had one comment on that PR. Looks like we should be able to merge it soon.

- Tony

···

On Sep 26, 2016, at 11:30 AM, Pushkar N Kulkarni <pushkar.nk@in.ibm.com> wrote:

Only the download task tests are disabled. And this is the second time we are seeing this data task test timing out.

I'd be glad to get more reviews and suggestions on: https://github.com/apple/swift-corelibs-foundation/pull/613 to have loopback tests replace these tests with external URL. Thanks.

Pushkar N Kulkarni,
IBM Runtimes

Simplicity is prerequisite for reliability - Edsger W. Dijkstra

-----anthony.parker@apple.com <mailto:-----anthony.parker@apple.com> wrote: -----
To: mishal_shah <mishal_shah@apple.com <mailto:mishal_shah@apple.com>>, Chris Bailey <BAILEYC@uk.ibm.com <mailto:BAILEYC@uk.ibm.com>>, Pushkar N Kulkarni/India/IBM@IBMIN
From: Tony Parker
Sent by: anthony.parker@apple.com <mailto:anthony.parker@apple.com>
Date: 09/26/2016 11:16PM
Cc: swift-dev <swift-dev@swift.org <mailto:swift-dev@swift.org>>, beanz@apple.com <mailto:beanz@apple.com>, Philippe Hausler <phausler@apple.com <mailto:phausler@apple.com>>
Subject: Re: [Swift CI] Build Failure: 0. OSS - Swift Incremental RA - Ubuntu 15.10 (master) #7860

Hm, I thought the URLSession tests were still disabled?

- Tony

On Sep 26, 2016, at 10:41 AM, mishal_shah <mishal_shah@apple.com <mailto:mishal_shah@apple.com>> wrote:

Hi,

This failure does not look like released to this commit.

Foundation test failed due to timeout.

Test Case 'TestURLSession.test_dataTaskWithURL' started at 11:00:53.813

TestFoundation/TestNSURLSession.swift:40: error: TestURLSession.test_dataTaskWithURL : Asynchronous wait failed - Exceeded timeout of 12.0 seconds, with unfulfilled expectations: data task

TestFoundation/TestNSURLSession.swift:42: error: TestURLSession.test_dataTaskWithURL : XCTAssertEqual failed: ("unknown") is not equal to ("Kathmandu") - test_dataTaskWithURLRequest returned an unexpected result

Thanks,
Mishal Shah

On Sep 26, 2016, at 9:58 AM, no-reply@swift.org <mailto:no-reply@swift.org> wrote:

[FAILURE] oss-swift-incremental-RA-linux-ubuntu-15_10 [#7860]

Build URL: https://ci.swift.org/job/oss-swift-incremental-RA-linux-ubuntu-15_10/7860/
Project: oss-swift-incremental-RA-linux-ubuntu-15_10
Date of build: Mon, 26 Sep 2016 09:38:23 -0700
Build duration: 20 min
Identified problems:

Compile Error: This build failed because of a compile error. Below is a list of all errors in the build log:
Indication 1 <https://ci.swift.org//job/oss-swift-incremental-RA-linux-ubuntu-15_10/7860/consoleFull#1312037437ee1a197b-acac-4b17-83cf-a53b95139a76>
Tests:

Name: Swift(linux-x86_64)
Failed: 0 test(s), Passed: 8352 test(s), Total: 8352 test(s)
Name: Swift-Unit
Failed: 0 test(s), Passed: 297 test(s), Total: 297 test(s)

Changes

Commit 0a20774f8b3b803a70342bd6b2dae0767081cb10 by beanz:
Fix swift tests to work with in-tree LLDB

edit: test/Driver/options-repl-darwin.swift
edit: test/Driver/options-repl.swift
edit: test/Driver/subcommands.swift