[Swift CI] Build Failure: 0. OSS - Swift Incremental RA - Ubuntu 15.10 (master) #2711


(Mishal Shah) #1

Hi Erik,

Can you please look at this failure?

Test Case 'DependencyResolutionTestCase.testInternalSimple' started.
    Building Debug
0 swift 0x00000000031373f8 llvm::sys::PrintStackTrace(llvm::raw_ostream&) + 40
1 swift 0x0000000003135bf6 llvm::sys::RunSignalHandlers() + 54
2 swift 0x0000000003137f26
3 libpthread.so.0 0x00007f7680af2d10
4 libswiftCore.so 0x00007f767da409b4 _TTSg5Vs5UInt8___TFSa37_appendElementAssumeUniqueAndCapacityfTSi10newElementx_T_ + 100
5 libPackageDescription.so 0x00007f767debe7c9 _TFC18PackageDescription7PackagecfT4nameGSqSS_7targetsGSaCS_6Target_12dependenciesGSaCS0_10Dependency_16testDependenciesGSaS2__7excludeGSaSS__S0_ + 921
6 libPackageDescription.so 0x00007f767debee08 _TFC18PackageDescription7PackageCfT4nameGSqSS_7targetsGSaCS_6Target_12dependenciesGSaCS0_10Dependency_16testDependenciesGSaS2__7excludeGSaSS__S0_ + 152
7 libPackageDescription.so 0x00007f7680d5f1d0 _TFC18PackageDescription7PackageCfT4nameGSqSS_7targetsGSaCS_6Target_12dependenciesGSaCS0_10Dependency_16testDependenciesGSaS2__7excludeGSaSS__S0_ + 48890976
8 swift 0x0000000000d089a4 llvm::MCJIT::runFunction(llvm::Function*, llvm::ArrayRef<llvm::GenericValue>) + 996
9 swift 0x0000000000d0c01f llvm::ExecutionEngine::runFunctionAsMain(llvm::Function*, std::vector<std::__cxx11::basic_string<char, std::char_traits<char>, std::allocator<char> >, std::allocator<std::__cxx11::basic_string<char, std::char_traits<char>, std::allocator<char> > > > const&, char const* const*) + 1263
10 swift 0x0000000000bf3318 swift::RunImmediately(swift::CompilerInstance&, std::vector<std::__cxx11::basic_string<char, std::char_traits<char>, std::allocator<char> >, std::allocator<std::__cxx11::basic_string<char, std::char_traits<char>, std::allocator<char> > > > const&, swift::IRGenOptions&, swift::SILOptions const&) + 2296
11 swift 0x0000000000789502
12 swift 0x0000000000784a73 frontend_main(llvm::ArrayRef<char const*>, char const*, void*) + 2643
13 swift 0x0000000000780056 main + 2518
14 libc.so.6 0x00007f767f425a40 __libc_start_main + 240
15 swift 0x000000000077f579 _start + 41
Stack dump:
0. Program arguments: /home/buildnode/jenkins/workspace/oss-swift-incremental-RA-linux-ubuntu-15_10/Ninja-ReleaseAssert/swift-linux-x86_64/bin/swift -frontend -interpret /tmp/DependencyResolution_Internal_Simple.DlQ0sz/Simple/Package.swift -target x86_64-unknown-linux-gnu -disable-objc-interop -I /home/buildnode/jenkins/workspace/oss-swift-incremental-RA-linux-ubuntu-15_10/Ninja-ReleaseAssert/swiftpm-linux-x86_64/lib/swift/pm -module-name Package -lPackageDescription

swift-build: error: Child process exited with signal

    Building Release
0 swift 0x00000000031373f8 llvm::sys::PrintStackTrace(llvm::raw_ostream&) + 40
1 swift 0x0000000003135bf6 llvm::sys::RunSignalHandlers() + 54
2 swift 0x0000000003137f26
3 libpthread.so.0 0x00007efc263d6d10
4 libswiftCore.so 0x00007efc233249b4 _TTSg5Vs5UInt8___TFSa37_appendElementAssumeUniqueAndCapacityfTSi10newElementx_T_ + 100
5 libPackageDescription.so 0x00007efc237a27c9 _TFC18PackageDescription7PackagecfT4nameGSqSS_7targetsGSaCS_6Target_12dependenciesGSaCS0_10Dependency_16testDependenciesGSaS2__7excludeGSaSS__S0_ + 921
6 libPackageDescription.so 0x00007efc237a2e08 _TFC18PackageDescription7PackageCfT4nameGSqSS_7targetsGSaCS_6Target_12dependenciesGSaCS0_10Dependency_16testDependenciesGSaS2__7excludeGSaSS__S0_ + 152
7 libPackageDescription.so 0x00007efc266431d0 _TFC18PackageDescription7PackageCfT4nameGSqSS_7targetsGSaCS_6Target_12dependenciesGSaCS0_10Dependency_16testDependenciesGSaS2__7excludeGSaSS__S0_ + 48890976
8 swift 0x0000000000d089a4 llvm::MCJIT::runFunction(llvm::Function*, llvm::ArrayRef<llvm::GenericValue>) + 996
9 swift 0x0000000000d0c01f llvm::ExecutionEngine::runFunctionAsMain(llvm::Function*, std::vector<std::__cxx11::basic_string<char, std::char_traits<char>, std::allocator<char> >, std::allocator<std::__cxx11::basic_string<char, std::char_traits<char>, std::allocator<char> > > > const&, char const* const*) + 1263
10 swift 0x0000000000bf3318 swift::RunImmediately(swift::CompilerInstance&, std::vector<std::__cxx11::basic_string<char, std::char_traits<char>, std::allocator<char> >, std::allocator<std::__cxx11::basic_string<char, std::char_traits<char>, std::allocator<char> > > > const&, swift::IRGenOptions&, swift::SILOptions const&) + 2296
11 swift 0x0000000000789502
12 swift 0x0000000000784a73 frontend_main(llvm::ArrayRef<char const*>, char const*, void*) + 2643
13 swift 0x0000000000780056 main + 2518
14 libc.so.6 0x00007efc24d09a40 __libc_start_main + 240
15 swift 0x000000000077f579 _start + 41
Stack dump:
0. Program arguments: /home/buildnode/jenkins/workspace/oss-swift-incremental-RA-linux-ubuntu-15_10/Ninja-ReleaseAssert/swift-linux-x86_64/bin/swift -frontend -interpret /tmp/DependencyResolution_Internal_Simple.DlQ0sz/Simple/Package.swift -target x86_64-unknown-linux-gnu -disable-objc-interop -I /home/buildnode/jenkins/workspace/oss-swift-incremental-RA-linux-ubuntu-15_10/Ninja-ReleaseAssert/swiftpm-linux-x86_64/lib/swift/pm -module-name Package -lPackageDescription

swift-build: error: Child process exited with signal

/home/buildnode/jenkins/workspace/oss-swift-incremental-RA-linux-ubuntu-15_10/swiftpm/Tests/Functional/TestDependencyResolution.swift:18: error: DependencyResolutionTestCase.testInternalSimple : failed - `swift build -c Debug' failed:

exit(1): /home/buildnode/jenkins/workspace/oss-swift-incremental-RA-linux-ubuntu-15_10/Ninja-ReleaseAssert/swiftpm-linux-x86_64/bin/swift-build --chdir /tmp/DependencyResolution_Internal_Simple.DlQ0sz/Simple --configuration debug

/home/buildnode/jenkins/workspace/oss-swift-incremental-RA-linux-ubuntu-15_10/swiftpm/Tests/Functional/TestDependencyResolution.swift:18: error: DependencyResolutionTestCase.testInternalSimple : failed - `swift build -c Release' failed:

exit(1): /home/buildnode/jenkins/workspace/oss-swift-incremental-RA-linux-ubuntu-15_10/Ninja-ReleaseAssert/swiftpm-linux-x86_64/bin/swift-build --chdir /tmp/DependencyResolution_Internal_Simple.DlQ0sz/Simple --configuration release

/home/buildnode/jenkins/workspace/oss-swift-incremental-RA-linux-ubuntu-15_10/swiftpm/Tests/Functional/TestDependencyResolution.swift:17: error: DependencyResolutionTestCase.testInternalSimple : failed - exit(127): /tmp/DependencyResolution_Internal_Simple.DlQ0sz/Simple/.build/debug/Foo
Test Case 'DependencyResolutionTestCase.testInternalSimple' failed (0.37 seconds).
Test Case 'DependencyResolutionTestCase.testInternalComplex' started.
    Building Debug
0 swift 0x00000000031373f8 llvm::sys::PrintStackTrace(llvm::raw_ostream&) + 40
1 swift 0x0000000003135bf6 llvm::sys::RunSignalHandlers() + 54
2 swift 0x0000000003137f26
3 libpthread.so.0 0x00007f5df3951d10
4 libswiftCore.so 0x00007f5df089f9b4 _TTSg5Vs5UInt8___TFSa37_appendElementAssumeUniqueAndCapacityfTSi10newElementx_T_ + 100
5 libPackageDescription.so 0x00007f5df0d1d7c9 _TFC18PackageDescription7PackagecfT4nameGSqSS_7targetsGSaCS_6Target_12dependenciesGSaCS0_10Dependency_16testDependenciesGSaS2__7excludeGSaSS__S0_ + 921
6 libPackageDescription.so 0x00007f5df0d1de08 _TFC18PackageDescription7PackageCfT4nameGSqSS_7targetsGSaCS_6Target_12dependenciesGSaCS0_10Dependency_16testDependenciesGSaS2__7excludeGSaSS__S0_ + 152
7 libPackageDescription.so 0x00007f5df3bbe357 _TFC18PackageDescription7PackageCfT4nameGSqSS_7targetsGSaCS_6Target_12dependenciesGSaCS0_10Dependency_16testDependenciesGSaS2__7excludeGSaSS__S0_ + 48891367
8 swift 0x0000000000d089a4 llvm::MCJIT::runFunction(llvm::Function*, llvm::ArrayRef<llvm::GenericValue>) + 996
9 swift 0x0000000000d0c01f llvm::ExecutionEngine::runFunctionAsMain(llvm::Function*, std::vector<std::__cxx11::basic_string<char, std::char_traits<char>, std::allocator<char> >, std::allocator<std::__cxx11::basic_string<char, std::char_traits<char>, std::allocator<char> > > > const&, char const* const*) + 1263
10 swift 0x0000000000bf3318 swift::RunImmediately(swift::CompilerInstance&, std::vector<std::__cxx11::basic_string<char, std::char_traits<char>, std::allocator<char> >, std::allocator<std::__cxx11::basic_string<char, std::char_traits<char>, std::allocator<char> > > > const&, swift::IRGenOptions&, swift::SILOptions const&) + 2296
11 swift 0x0000000000789502
12 swift 0x0000000000784a73 frontend_main(llvm::ArrayRef<char const*>, char const*, void*) + 2643
13 swift 0x0000000000780056 main + 2518
14 libc.so.6 0x00007f5df2284a40 __libc_start_main + 240
15 swift 0x000000000077f579 _start + 41
Stack dump:
0. Program arguments: /home/buildnode/jenkins/workspace/oss-swift-incremental-RA-linux-ubuntu-15_10/Ninja-ReleaseAssert/swift-linux-x86_64/bin/swift -frontend -interpret /tmp/DependencyResolution_Internal_Complex.lveuYG/Complex/Package.swift -target x86_64-unknown-linux-gnu -disable-objc-interop -I /home/buildnode/jenkins/workspace/oss-swift-incremental-RA-linux-ubuntu-15_10/Ninja-ReleaseAssert/swiftpm-linux-x86_64/lib/swift/pm -module-name Package -lPackageDescription

swift-build: error: Child process exited with signal

    Building Release
0 swift 0x00000000031373f8 llvm::sys::PrintStackTrace(llvm::raw_ostream&) + 40
1 swift 0x0000000003135bf6 llvm::sys::RunSignalHandlers() + 54
2 swift 0x0000000003137f26
3 libpthread.so.0 0x00007f0fba950d10
4 libswiftCore.so 0x00007f0fb789e9b4 _TTSg5Vs5UInt8___TFSa37_appendElementAssumeUniqueAndCapacityfTSi10newElementx_T_ + 100
5 libPackageDescription.so 0x00007f0fb7d1c7c9 _TFC18PackageDescription7PackagecfT4nameGSqSS_7targetsGSaCS_6Target_12dependenciesGSaCS0_10Dependency_16testDependenciesGSaS2__7excludeGSaSS__S0_ + 921
6 libPackageDescription.so 0x00007f0fb7d1ce08 _TFC18PackageDescription7PackageCfT4nameGSqSS_7targetsGSaCS_6Target_12dependenciesGSaCS0_10Dependency_16testDependenciesGSaS2__7excludeGSaSS__S0_ + 152
7 libPackageDescription.so 0x00007f0fbabbd357 _TFC18PackageDescription7PackageCfT4nameGSqSS_7targetsGSaCS_6Target_12dependenciesGSaCS0_10Dependency_16testDependenciesGSaS2__7excludeGSaSS__S0_ + 48891367
8 swift 0x0000000000d089a4 llvm::MCJIT::runFunction(llvm::Function*, llvm::ArrayRef<llvm::GenericValue>) + 996
9 swift 0x0000000000d0c01f llvm::ExecutionEngine::runFunctionAsMain(llvm::Function*, std::vector<std::__cxx11::basic_string<char, std::char_traits<char>, std::allocator<char> >, std::allocator<std::__cxx11::basic_string<char, std::char_traits<char>, std::allocator<char> > > > const&, char const* const*) + 1263
10 swift 0x0000000000bf3318 swift::RunImmediately(swift::CompilerInstance&, std::vector<std::__cxx11::basic_string<char, std::char_traits<char>, std::allocator<char> >, std::allocator<std::__cxx11::basic_string<char, std::char_traits<char>, std::allocator<char> > > > const&, swift::IRGenOptions&, swift::SILOptions const&) + 2296
11 swift 0x0000000000789502
12 swift 0x0000000000784a73 frontend_main(llvm::ArrayRef<char const*>, char const*, void*) + 2643
13 swift 0x0000000000780056 main + 2518
14 libc.so.6 0x00007f0fb9283a40 __libc_start_main + 240
15 swift 0x000000000077f579 _start + 41
Stack dump:
0. Program arguments: /home/buildnode/jenkins/workspace/oss-swift-incremental-RA-linux-ubuntu-15_10/Ninja-ReleaseAssert/swift-linux-x86_64/bin/swift -frontend -interpret /tmp/DependencyResolution_Internal_Complex.lveuYG/Complex/Package.swift -target x86_64-unknown-linux-gnu -disable-objc-interop -I /home/buildnode/jenkins/workspace/oss-swift-incremental-RA-linux-ubuntu-15_10/Ninja-ReleaseAssert/swiftpm-linux-x86_64/lib/swift/pm -module-name Package -lPackageDescription

swift-build: error: Child process exited with signal

/home/buildnode/jenkins/workspace/oss-swift-incremental-RA-linux-ubuntu-15_10/swiftpm/Tests/Functional/TestDependencyResolution.swift:27: error: DependencyResolutionTestCase.testInternalComplex : failed - `swift build -c Debug' failed:

exit(1): /home/buildnode/jenkins/workspace/oss-swift-incremental-RA-linux-ubuntu-15_10/Ninja-ReleaseAssert/swiftpm-linux-x86_64/bin/swift-build --chdir /tmp/DependencyResolution_Internal_Complex.lveuYG/Complex --configuration debug

/home/buildnode/jenkins/workspace/oss-swift-incremental-RA-linux-ubuntu-15_10/swiftpm/Tests/Functional/TestDependencyResolution.swift:27: error: DependencyResolutionTestCase.testInternalComplex : failed - `swift build -c Release' failed:

exit(1): /home/buildnode/jenkins/workspace/oss-swift-incremental-RA-linux-ubuntu-15_10/Ninja-ReleaseAssert/swiftpm-linux-x86_64/bin/swift-build --chdir /tmp/DependencyResolution_Internal_Complex.lveuYG/Complex --configuration release

/home/buildnode/jenkins/workspace/oss-swift-incremental-RA-linux-ubuntu-15_10/swiftpm/Tests/Functional/TestDependencyResolution.swift:26: error: DependencyResolutionTestCase.testInternalComplex : failed - exit(127): /tmp/DependencyResolution_Internal_Complex.lveuYG/Complex/.build/debug/Foo
Test Case 'DependencyResolutionTestCase.testInternalComplex' failed (0.373 seconds).
Test Case 'DependencyResolutionTestCase.testExternalSimple' started.
    Building Debug
0 swift 0x00000000031373f8 llvm::sys::PrintStackTrace(llvm::raw_ostream&) + 40
1 swift 0x0000000003135bf6 llvm::sys::RunSignalHandlers() + 54
2 swift 0x0000000003137f26
3 libpthread.so.0 0x00007fc3f10e8d10
4 libswiftCore.so 0x00007fc3ee0369b4 _TTSg5Vs5UInt8___TFSa37_appendElementAssumeUniqueAndCapacityfTSi10newElementx_T_ + 100
5 libPackageDescription.so 0x00007fc3ee4b47c9 _TFC18PackageDescription7PackagecfT4nameGSqSS_7targetsGSaCS_6Target_12dependenciesGSaCS0_10Dependency_16testDependenciesGSaS2__7excludeGSaSS__S0_ + 921
6 libPackageDescription.so 0x00007fc3ee4b4e08 _TFC18PackageDescription7PackageCfT4nameGSqSS_7targetsGSaCS_6Target_12dependenciesGSaCS0_10Dependency_16testDependenciesGSaS2__7excludeGSaSS__S0_ + 152
7 libPackageDescription.so 0x00007fc3f1355164 _TFC18PackageDescription7PackageCfT4nameGSqSS_7targetsGSaCS_6Target_12dependenciesGSaCS0_10Dependency_16testDependenciesGSaS2__7excludeGSaSS__S0_ + 48890868
8 swift 0x0000000000d089a4 llvm::MCJIT::runFunction(llvm::Function*, llvm::ArrayRef<llvm::GenericValue>) + 996
9 swift 0x0000000000d0c01f llvm::ExecutionEngine::runFunctionAsMain(llvm::Function*, std::vector<std::__cxx11::basic_string<char, std::char_traits<char>, std::allocator<char> >, std::allocator<std::__cxx11::basic_string<char, std::char_traits<char>, std::allocator<char> > > > const&, char const* const*) + 1263
10 swift 0x0000000000bf3318 swift::RunImmediately(swift::CompilerInstance&, std::vector<std::__cxx11::basic_string<char, std::char_traits<char>, std::allocator<char> >, std::allocator<std::__cxx11::basic_string<char, std::char_traits<char>, std::allocator<char> > > > const&, swift::IRGenOptions&, swift::SILOptions const&) + 2296
11 swift 0x0000000000789502
12 swift 0x0000000000784a73 frontend_main(llvm::ArrayRef<char const*>, char const*, void*) + 2643
13 swift 0x0000000000780056 main + 2518
14 libc.so.6 0x00007fc3efa1ba40 __libc_start_main + 240
15 swift 0x000000000077f579 _start + 41
Stack dump:
0. Program arguments: /home/buildnode/jenkins/workspace/oss-swift-incremental-RA-linux-ubuntu-15_10/Ninja-ReleaseAssert/swift-linux-x86_64/bin/swift -frontend -interpret /tmp/DependencyResolution_External_Simple.FRaGxP/Bar/Package.swift -target x86_64-unknown-linux-gnu -disable-objc-interop -I /home/buildnode/jenkins/workspace/oss-swift-incremental-RA-linux-ubuntu-15_10/Ninja-ReleaseAssert/swiftpm-linux-x86_64/lib/swift/pm -module-name Package -lPackageDescription

swift-build: error: Child process exited with signal

    Building Release
0 swift 0x00000000031373f8 llvm::sys::PrintStackTrace(llvm::raw_ostream&) + 40
1 swift 0x0000000003135bf6 llvm::sys::RunSignalHandlers() + 54
2 swift 0x0000000003137f26
3 libpthread.so.0 0x00007f630da3bd10
4 libswiftCore.so 0x00007f630a9899b4 _TTSg5Vs5UInt8___TFSa37_appendElementAssumeUniqueAndCapacityfTSi10newElementx_T_ + 100
5 libPackageDescription.so 0x00007f630ae077c9 _TFC18PackageDescription7PackagecfT4nameGSqSS_7targetsGSaCS_6Target_12dependenciesGSaCS0_10Dependency_16testDependenciesGSaS2__7excludeGSaSS__S0_ + 921
6 libPackageDescription.so 0x00007f630ae07e08 _TFC18PackageDescription7PackageCfT4nameGSqSS_7targetsGSaCS_6Target_12dependenciesGSaCS0_10Dependency_16testDependenciesGSaS2__7excludeGSaSS__S0_ + 152
7 libPackageDescription.so 0x00007f630dca8164 _TFC18PackageDescription7PackageCfT4nameGSqSS_7targetsGSaCS_6Target_12dependenciesGSaCS0_10Dependency_16testDependenciesGSaS2__7excludeGSaSS__S0_ + 48890868
8 swift 0x0000000000d089a4 llvm::MCJIT::runFunction(llvm::Function*, llvm::ArrayRef<llvm::GenericValue>) + 996
9 swift 0x0000000000d0c01f llvm::ExecutionEngine::runFunctionAsMain(llvm::Function*, std::vector<std::__cxx11::basic_string<char, std::char_traits<char>, std::allocator<char> >, std::allocator<std::__cxx11::basic_string<char, std::char_traits<char>, std::allocator<char> > > > const&, char const* const*) + 1263
10 swift 0x0000000000bf3318 swift::RunImmediately(swift::CompilerInstance&, std::vector<std::__cxx11::basic_string<char, std::char_traits<char>, std::allocator<char> >, std::allocator<std::__cxx11::basic_string<char, std::char_traits<char>, std::allocator<char> > > > const&, swift::IRGenOptions&, swift::SILOptions const&) + 2296
11 swift 0x0000000000789502
12 swift 0x0000000000784a73 frontend_main(llvm::ArrayRef<char const*>, char const*, void*) + 2643
13 swift 0x0000000000780056 main + 2518
14 libc.so.6 0x00007f630c36ea40 __libc_start_main + 240
15 swift 0x000000000077f579 _start + 41
Stack dump:
0. Program arguments: /home/buildnode/jenkins/workspace/oss-swift-incremental-RA-linux-ubuntu-15_10/Ninja-ReleaseAssert/swift-linux-x86_64/bin/swift -frontend -interpret /tmp/DependencyResolution_External_Simple.FRaGxP/Bar/Package.swift -target x86_64-unknown-linux-gnu -disable-objc-interop -I /home/buildnode/jenkins/workspace/oss-swift-incremental-RA-linux-ubuntu-15_10/Ninja-ReleaseAssert/swiftpm-linux-x86_64/lib/swift/pm -module-name Package -lPackageDescription

swift-build: error: Child process exited with signal

/home/buildnode/jenkins/workspace/oss-swift-incremental-RA-linux-ubuntu-15_10/swiftpm/Tests/Functional/TestDependencyResolution.swift:36: error: DependencyResolutionTestCase.testExternalSimple : failed - `swift build -c Debug' failed:

exit(1): /home/buildnode/jenkins/workspace/oss-swift-incremental-RA-linux-ubuntu-15_10/Ninja-ReleaseAssert/swiftpm-linux-x86_64/bin/swift-build --chdir /tmp/DependencyResolution_External_Simple.FRaGxP/Bar --configuration debug

/home/buildnode/jenkins/workspace/oss-swift-incremental-RA-linux-ubuntu-15_10/swiftpm/Tests/Functional/TestDependencyResolution.swift:36: error: DependencyResolutionTestCase.testExternalSimple : failed - `swift build -c Release' failed:

exit(1): /home/buildnode/jenkins/workspace/oss-swift-incremental-RA-linux-ubuntu-15_10/Ninja-ReleaseAssert/swiftpm-linux-x86_64/bin/swift-build --chdir /tmp/DependencyResolution_External_Simple.FRaGxP/Bar --configuration release

/home/buildnode/jenkins/workspace/oss-swift-incremental-RA-linux-ubuntu-15_10/swiftpm/Tests/Functional/TestDependencyResolution.swift:37: error: DependencyResolutionTestCase.testExternalSimple : failed - Expected file doesn’t exist: /tmp/DependencyResolution_External_Simple.FRaGxP/Bar/.build/debug/Bar
/home/buildnode/jenkins/workspace/oss-swift-incremental-RA-linux-ubuntu-15_10/swiftpm/Tests/Functional/TestDependencyResolution.swift:38: error: DependencyResolutionTestCase.testExternalSimple : failed - Expected directory doesn’t exist: /tmp/DependencyResolution_External_Simple.FRaGxP/Bar/Packages/Foo-1.2.3
Test Case 'DependencyResolutionTestCase.testExternalSimple' failed (0.404 seconds).
Test Case 'DependencyResolutionTestCase.testExternalComplex' started.
    Building Debug
0 swift 0x00000000031373f8 llvm::sys::PrintStackTrace(llvm::raw_ostream&) + 40
1 swift 0x0000000003135bf6 llvm::sys::RunSignalHandlers() + 54
2 swift 0x0000000003137f26
3 libpthread.so.0 0x00007fae410bbd10
4 libswiftCore.so 0x00007fae3e0099b4 _TTSg5Vs5UInt8___TFSa37_appendElementAssumeUniqueAndCapacityfTSi10newElementx_T_ + 100
5 libPackageDescription.so 0x00007fae3e4877c9 _TFC18PackageDescription7PackagecfT4nameGSqSS_7targetsGSaCS_6Target_12dependenciesGSaCS0_10Dependency_16testDependenciesGSaS2__7excludeGSaSS__S0_ + 921
6 libPackageDescription.so 0x00007fae3e487e08 _TFC18PackageDescription7PackageCfT4nameGSqSS_7targetsGSaCS_6Target_12dependenciesGSaCS0_10Dependency_16testDependenciesGSaS2__7excludeGSaSS__S0_ + 152
7 libPackageDescription.so 0x00007fae413285e3 _TFC18PackageDescription7PackageCfT4nameGSqSS_7targetsGSaCS_6Target_12dependenciesGSaCS0_10Dependency_16testDependenciesGSaS2__7excludeGSaSS__S0_ + 48892019
8 swift 0x0000000000d089a4 llvm::MCJIT::runFunction(llvm::Function*, llvm::ArrayRef<llvm::GenericValue>) + 996
9 swift 0x0000000000d0c01f llvm::ExecutionEngine::runFunctionAsMain(llvm::Function*, std::vector<std::__cxx11::basic_string<char, std::char_traits<char>, std::allocator<char> >, std::allocator<std::__cxx11::basic_string<char, std::char_traits<char>, std::allocator<char> > > > const&, char const* const*) + 1263
10 swift 0x0000000000bf3318 swift::RunImmediately(swift::CompilerInstance&, std::vector<std::__cxx11::basic_string<char, std::char_traits<char>, std::allocator<char> >, std::allocator<std::__cxx11::basic_string<char, std::char_traits<char>, std::allocator<char> > > > const&, swift::IRGenOptions&, swift::SILOptions const&) + 2296
11 swift 0x0000000000789502
12 swift 0x0000000000784a73 frontend_main(llvm::ArrayRef<char const*>, char const*, void*) + 2643
13 swift 0x0000000000780056 main + 2518
14 libc.so.6 0x00007fae3f9eea40 __libc_start_main + 240
15 swift 0x000000000077f579 _start + 41
Stack dump:
0. Program arguments: /home/buildnode/jenkins/workspace/oss-swift-incremental-RA-linux-ubuntu-15_10/Ninja-ReleaseAssert/swift-linux-x86_64/bin/swift -frontend -interpret /tmp/DependencyResolution_External_Complex.5Nq3fZ/app/Package.swift -target x86_64-unknown-linux-gnu -disable-objc-interop -I /home/buildnode/jenkins/workspace/oss-swift-incremental-RA-linux-ubuntu-15_10/Ninja-ReleaseAssert/swiftpm-linux-x86_64/lib/swift/pm -module-name Package -lPackageDescription

swift-build: error: Child process exited with signal

    Building Release
0 swift 0x00000000031373f8 llvm::sys::PrintStackTrace(llvm::raw_ostream&) + 40
1 swift 0x0000000003135bf6 llvm::sys::RunSignalHandlers() + 54
2 swift 0x0000000003137f26
3 libpthread.so.0 0x00007fccb06acd10
4 libswiftCore.so 0x00007fccad5fa9b4 _TTSg5Vs5UInt8___TFSa37_appendElementAssumeUniqueAndCapacityfTSi10newElementx_T_ + 100
5 libPackageDescription.so 0x00007fccada787c9 _TFC18PackageDescription7PackagecfT4nameGSqSS_7targetsGSaCS_6Target_12dependenciesGSaCS0_10Dependency_16testDependenciesGSaS2__7excludeGSaSS__S0_ + 921
6 libPackageDescription.so 0x00007fccada78e08 _TFC18PackageDescription7PackageCfT4nameGSqSS_7targetsGSaCS_6Target_12dependenciesGSaCS0_10Dependency_16testDependenciesGSaS2__7excludeGSaSS__S0_ + 152
7 libPackageDescription.so 0x00007fccb09195e3 _TFC18PackageDescription7PackageCfT4nameGSqSS_7targetsGSaCS_6Target_12dependenciesGSaCS0_10Dependency_16testDependenciesGSaS2__7excludeGSaSS__S0_ + 48892019
8 swift 0x0000000000d089a4 llvm::MCJIT::runFunction(llvm::Function*, llvm::ArrayRef<llvm::GenericValue>) + 996
9 swift 0x0000000000d0c01f llvm::ExecutionEngine::runFunctionAsMain(llvm::Function*, std::vector<std::__cxx11::basic_string<char, std::char_traits<char>, std::allocator<char> >, std::allocator<std::__cxx11::basic_string<char, std::char_traits<char>, std::allocator<char> > > > const&, char const* const*) + 1263
10 swift 0x0000000000bf3318 swift::RunImmediately(swift::CompilerInstance&, std::vector<std::__cxx11::basic_string<char, std::char_traits<char>, std::allocator<char> >, std::allocator<std::__cxx11::basic_string<char, std::char_traits<char>, std::allocator<char> > > > const&, swift::IRGenOptions&, swift::SILOptions const&) + 2296
11 swift 0x0000000000789502
12 swift 0x0000000000784a73 frontend_main(llvm::ArrayRef<char const*>, char const*, void*) + 2643
13 swift 0x0000000000780056 main + 2518
14 libc.so.6 0x00007fccaefdfa40 __libc_start_main + 240
15 swift 0x000000000077f579 _start + 41
Stack dump:
0. Program arguments: /home/buildnode/jenkins/workspace/oss-swift-incremental-RA-linux-ubuntu-15_10/Ninja-ReleaseAssert/swift-linux-x86_64/bin/swift -frontend -interpret /tmp/DependencyResolution_External_Complex.5Nq3fZ/app/Package.swift -target x86_64-unknown-linux-gnu -disable-objc-interop -I /home/buildnode/jenkins/workspace/oss-swift-incremental-RA-linux-ubuntu-15_10/Ninja-ReleaseAssert/swiftpm-linux-x86_64/lib/swift/pm -module-name Package -lPackageDescription

swift-build: error: Child process exited with signal

/home/buildnode/jenkins/workspace/oss-swift-incremental-RA-linux-ubuntu-15_10/swiftpm/Tests/Functional/TestDependencyResolution.swift:44: error: DependencyResolutionTestCase.testExternalComplex : failed - `swift build -c Debug' failed:

exit(1): /home/buildnode/jenkins/workspace/oss-swift-incremental-RA-linux-ubuntu-15_10/Ninja-ReleaseAssert/swiftpm-linux-x86_64/bin/swift-build --chdir /tmp/DependencyResolution_External_Complex.5Nq3fZ/app --configuration debug

/home/buildnode/jenkins/workspace/oss-swift-incremental-RA-linux-ubuntu-15_10/swiftpm/Tests/Functional/TestDependencyResolution.swift:44: error: DependencyResolutionTestCase.testExternalComplex : failed - `swift build -c Release' failed:

exit(1): /home/buildnode/jenkins/workspace/oss-swift-incremental-RA-linux-ubuntu-15_10/Ninja-ReleaseAssert/swiftpm-linux-x86_64/bin/swift-build --chdir /tmp/DependencyResolution_External_Complex.5Nq3fZ/app --configuration release

/home/buildnode/jenkins/workspace/oss-swift-incremental-RA-linux-ubuntu-15_10/swiftpm/Tests/Functional/TestDependencyResolution.swift:43: error: DependencyResolutionTestCase.testExternalComplex : failed - exit(127): /tmp/DependencyResolution_External_Complex.5Nq3fZ/app/.build/debug/Dealer
Test Case 'DependencyResolutionTestCase.testExternalComplex' failed (0.481 seconds).
Executed 4 tests, with 13 failures (0 unexpected) in 1.629 (1.63) seconds
Test Case 'FileTests.testOpenFile' started.
Test Case 'FileTests.testOpenFile' passed (0.0 seconds).
Test Case 'FileTests.testOpenFileFail' started.
Test Case 'FileTests.testOpenFileFail' passed (0.0 seconds).
Test Case 'FileTests.testReadRegularTextFile' started.
Test Case 'FileTests.testReadRegularTextFile' passed (0.0 seconds).
Test Case 'FileTests.testReadRegularTextFileWithSeparator' started.
Test Case 'FileTests.testReadRegularTextFileWithSeparator' passed (0.0 seconds).
Executed 4 tests, with 0 failures (0 unexpected) in 0.001 (0.002) seconds
Test Case 'GetTests.testRawCloneDoesNotCrashIfManifestIsNotPresent' started.
Test Case 'GetTests.testRawCloneDoesNotCrashIfManifestIsNotPresent' passed (0.864 seconds).
Test Case 'GetTests.testRangeConstrain' started.
Test Case 'GetTests.testRangeConstrain' passed (0.0 seconds).
Test Case 'GetTests.testGitRepoInitialization' started.
Test Case 'GetTests.testGitRepoInitialization' passed (0.08 seconds).
Executed 3 tests, with 0 failures (0 unexpected) in 0.944 (0.944) seconds
Test Case 'GitTests.testHasVersion' started.
Test Case 'GitTests.testHasVersion' passed (0.019 seconds).
Test Case 'GitTests.testHasNoVersion' started.
Test Case 'GitTests.testHasNoVersion' passed (0.017 seconds).
Test Case 'GitTests.testCloneShouldNotCrashWihoutTags' started.
Test Case 'GitTests.testCloneShouldNotCrashWihoutTags' passed (0.019 seconds).
Test Case 'GitTests.testCloneShouldCrashWihoutTags' started.
Test Case 'GitTests.testCloneShouldCrashWihoutTags' passed (0.016 seconds).
Executed 4 tests, with 0 failures (0 unexpected) in 0.071 (0.071) seconds
Test Case 'InvalidLayoutsTestCase.testNoTargets' started.
Test Case 'InvalidLayoutsTestCase.testNoTargets' passed (0.047 seconds).
Test Case 'InvalidLayoutsTestCase.testMultipleRoots' started.
Test Case 'InvalidLayoutsTestCase.testMultipleRoots' passed (0.085 seconds).
Test Case 'InvalidLayoutsTestCase.testInvalidLayout1' started.
    Building Debug
0 swift 0x00000000031373f8 llvm::sys::PrintStackTrace(llvm::raw_ostream&) + 40
1 swift 0x0000000003135bf6 llvm::sys::RunSignalHandlers() + 54
2 swift 0x0000000003137f26
3 libpthread.so.0 0x00007f3c67fcad10
4 libswiftCore.so 0x00007f3c64f189b4 _TTSg5Vs5UInt8___TFSa37_appendElementAssumeUniqueAndCapacityfTSi10newElementx_T_ + 100
5 libPackageDescription.so 0x00007f3c653967c9 _TFC18PackageDescription7PackagecfT4nameGSqSS_7targetsGSaCS_6Target_12dependenciesGSaCS0_10Dependency_16testDependenciesGSaS2__7excludeGSaSS__S0_ + 921
6 libPackageDescription.so 0x00007f3c65396e08 _TFC18PackageDescription7PackageCfT4nameGSqSS_7targetsGSaCS_6Target_12dependenciesGSaCS0_10Dependency_16testDependenciesGSaS2__7excludeGSaSS__S0_ + 152
7 libPackageDescription.so 0x00007f3c682370f1 _TFC18PackageDescription7PackageCfT4nameGSqSS_7targetsGSaCS_6Target_12dependenciesGSaCS0_10Dependency_16testDependenciesGSaS2__7excludeGSaSS__S0_ + 48890753
8 swift 0x0000000000d089a4 llvm::MCJIT::runFunction(llvm::Function*, llvm::ArrayRef<llvm::GenericValue>) + 996
9 swift 0x0000000000d0c01f llvm::ExecutionEngine::runFunctionAsMain(llvm::Function*, std::vector<std::__cxx11::basic_string<char, std::char_traits<char>, std::allocator<char> >, std::allocator<std::__cxx11::basic_string<char, std::char_traits<char>, std::allocator<char> > > > const&, char const* const*) + 1263
10 swift 0x0000000000bf3318 swift::RunImmediately(swift::CompilerInstance&, std::vector<std::__cxx11::basic_string<char, std::char_traits<char>, std::allocator<char> >, std::allocator<std::__cxx11::basic_string<char, std::char_traits<char>, std::allocator<char> > > > const&, swift::IRGenOptions&, swift::SILOptions const&) + 2296
11 swift 0x0000000000789502
12 swift 0x0000000000784a73 frontend_main(llvm::ArrayRef<char const*>, char const*, void*) + 2643
13 swift 0x0000000000780056 main + 2518
14 libc.so.6 0x00007f3c668fda40 __libc_start_main + 240
15 swift 0x000000000077f579 _start + 41
Stack dump:
0. Program arguments: /home/buildnode/jenkins/workspace/oss-swift-incremental-RA-linux-ubuntu-15_10/Ninja-ReleaseAssert/swift-linux-x86_64/bin/swift -frontend -interpret /tmp/InvalidLayouts_Generic1.9NwYTb/Generic1/Package.swift -target x86_64-unknown-linux-gnu -disable-objc-interop -I /home/buildnode/jenkins/workspace/oss-swift-incremental-RA-linux-ubuntu-15_10/Ninja-ReleaseAssert/swiftpm-linux-x86_64/lib/swift/pm -module-name Package -lPackageDescription

swift-build: error: Child process exited with signal

    Building Release
0 swift 0x00000000031373f8 llvm::sys::PrintStackTrace(llvm::raw_ostream&) + 40
1 swift 0x0000000003135bf6 llvm::sys::RunSignalHandlers() + 54
2 swift 0x0000000003137f26
3 libpthread.so.0 0x00007f7ed6ce2d10
4 libswiftCore.so 0x00007f7ed3c309b4 _TTSg5Vs5UInt8___TFSa37_appendElementAssumeUniqueAndCapacityfTSi10newElementx_T_ + 100
5 libPackageDescription.so 0x00007f7ed40ae7c9 _TFC18PackageDescription7PackagecfT4nameGSqSS_7targetsGSaCS_6Target_12dependenciesGSaCS0_10Dependency_16testDependenciesGSaS2__7excludeGSaSS__S0_ + 921
6 libPackageDescription.so 0x00007f7ed40aee08 _TFC18PackageDescription7PackageCfT4nameGSqSS_7targetsGSaCS_6Target_12dependenciesGSaCS0_10Dependency_16testDependenciesGSaS2__7excludeGSaSS__S0_ + 152
7 libPackageDescription.so 0x00007f7ed6f4f0f1 _TFC18PackageDescription7PackageCfT4nameGSqSS_7targetsGSaCS_6Target_12dependenciesGSaCS0_10Dependency_16testDependenciesGSaS2__7excludeGSaSS__S0_ + 48890753
8 swift 0x0000000000d089a4 llvm::MCJIT::runFunction(llvm::Function*, llvm::ArrayRef<llvm::GenericValue>) + 996
9 swift 0x0000000000d0c01f llvm::ExecutionEngine::runFunctionAsMain(llvm::Function*, std::vector<std::__cxx11::basic_string<char, std::char_traits<char>, std::allocator<char> >, std::allocator<std::__cxx11::basic_string<char, std::char_traits<char>, std::allocator<char> > > > const&, char const* const*) + 1263
10 swift 0x0000000000bf3318 swift::RunImmediately(swift::CompilerInstance&, std::vector<std::__cxx11::basic_string<char, std::char_traits<char>, std::allocator<char> >, std::allocator<std::__cxx11::basic_string<char, std::char_traits<char>, std::allocator<char> > > > const&, swift::IRGenOptions&, swift::SILOptions const&) + 2296
11 swift 0x0000000000789502
12 swift 0x0000000000784a73 frontend_main(llvm::ArrayRef<char const*>, char const*, void*) + 2643
13 swift 0x0000000000780056 main + 2518
14 libc.so.6 0x00007f7ed5615a40 __libc_start_main + 240
15 swift 0x000000000077f579 _start + 41
Stack dump:
0. Program arguments: /home/buildnode/jenkins/workspace/oss-swift-incremental-RA-linux-ubuntu-15_10/Ninja-ReleaseAssert/swift-linux-x86_64/bin/swift -frontend -interpret /tmp/InvalidLayouts_Generic1.9NwYTb/Generic1/Package.swift -target x86_64-unknown-linux-gnu -disable-objc-interop -I /home/buildnode/jenkins/workspace/oss-swift-incremental-RA-linux-ubuntu-15_10/Ninja-ReleaseAssert/swiftpm-linux-x86_64/lib/swift/pm -module-name Package -lPackageDescription

swift-build: error: Child process exited with signal

/home/buildnode/jenkins/workspace/oss-swift-incremental-RA-linux-ubuntu-15_10/swiftpm/Tests/Functional/TestInvalidLayouts.swift:43: error: InvalidLayoutsTestCase.testInvalidLayout1 : failed - `swift build -c Debug' failed:

exit(1): /home/buildnode/jenkins/workspace/oss-swift-incremental-RA-linux-ubuntu-15_10/Ninja-ReleaseAssert/swiftpm-linux-x86_64/bin/swift-build --chdir /tmp/InvalidLayouts_Generic1.9NwYTb/Generic1 --configuration debug

/home/buildnode/jenkins/workspace/oss-swift-incremental-RA-linux-ubuntu-15_10/swiftpm/Tests/Functional/TestInvalidLayouts.swift:43: error: InvalidLayoutsTestCase.testInvalidLayout1 : failed - `swift build -c Release' failed:

exit(1): /home/buildnode/jenkins/workspace/oss-swift-incremental-RA-linux-ubuntu-15_10/Ninja-ReleaseAssert/swiftpm-linux-x86_64/bin/swift-build --chdir /tmp/InvalidLayouts_Generic1.9NwYTb/Generic1 --configuration release

Test Case 'InvalidLayoutsTestCase.testInvalidLayout1' failed (0.468 seconds).
Test Case 'InvalidLayoutsTestCase.testInvalidLayout2' started.
    Building Debug
0 swift 0x00000000031373f8 llvm::sys::PrintStackTrace(llvm::raw_ostream&) + 40
1 swift 0x0000000003135bf6 llvm::sys::RunSignalHandlers() + 54
2 swift 0x0000000003137f26
3 libpthread.so.0 0x00007fac94313d10
4 libswiftCore.so 0x00007fac912619b4 _TTSg5Vs5UInt8___TFSa37_appendElementAssumeUniqueAndCapacityfTSi10newElementx_T_ + 100
5 libPackageDescription.so 0x00007fac916df7c9 _TFC18PackageDescription7PackagecfT4nameGSqSS_7targetsGSaCS_6Target_12dependenciesGSaCS0_10Dependency_16testDependenciesGSaS2__7excludeGSaSS__S0_ + 921
6 libPackageDescription.so 0x00007fac916dfe08 _TFC18PackageDescription7PackageCfT4nameGSqSS_7targetsGSaCS_6Target_12dependenciesGSaCS0_10Dependency_16testDependenciesGSaS2__7excludeGSaSS__S0_ + 152
7 libPackageDescription.so 0x00007fac945800f1 _TFC18PackageDescription7PackageCfT4nameGSqSS_7targetsGSaCS_6Target_12dependenciesGSaCS0_10Dependency_16testDependenciesGSaS2__7excludeGSaSS__S0_ + 48890753
8 swift 0x0000000000d089a4 llvm::MCJIT::runFunction(llvm::Function*, llvm::ArrayRef<llvm::GenericValue>) + 996
9 swift 0x0000000000d0c01f llvm::ExecutionEngine::runFunctionAsMain(llvm::Function*, std::vector<std::__cxx11::basic_string<char, std::char_traits<char>, std::allocator<char> >, std::allocator<std::__cxx11::basic_string<char, std::char_traits<char>, std::allocator<char> > > > const&, char const* const*) + 1263
10 swift 0x0000000000bf3318 swift::RunImmediately(swift::CompilerInstance&, std::vector<std::__cxx11::basic_string<char, std::char_traits<char>, std::allocator<char> >, std::allocator<std::__cxx11::basic_string<char, std::char_traits<char>, std::allocator<char> > > > const&, swift::IRGenOptions&, swift::SILOptions const&) + 2296
11 swift 0x0000000000789502
12 swift 0x0000000000784a73 frontend_main(llvm::ArrayRef<char const*>, char const*, void*) + 2643
13 swift 0x0000000000780056 main + 2518
14 libc.so.6 0x00007fac92c46a40 __libc_start_main + 240
15 swift 0x000000000077f579 _start + 41
Stack dump:
0. Program arguments: /home/buildnode/jenkins/workspace/oss-swift-incremental-RA-linux-ubuntu-15_10/Ninja-ReleaseAssert/swift-linux-x86_64/bin/swift -frontend -interpret /tmp/InvalidLayouts_Generic2.disHzr/Generic2/Package.swift -target x86_64-unknown-linux-gnu -disable-objc-interop -I /home/buildnode/jenkins/workspace/oss-swift-incremental-RA-linux-ubuntu-15_10/Ninja-ReleaseAssert/swiftpm-linux-x86_64/lib/swift/pm -module-name Package -lPackageDescription

swift-build: error: Child process exited with signal

    Building Release
0 swift 0x00000000031373f8 llvm::sys::PrintStackTrace(llvm::raw_ostream&) + 40
1 swift 0x0000000003135bf6 llvm::sys::RunSignalHandlers() + 54
2 swift 0x0000000003137f26
3 libpthread.so.0 0x00007f1073e83d10
4 libswiftCore.so 0x00007f1070dd19b4 _TTSg5Vs5UInt8___TFSa37_appendElementAssumeUniqueAndCapacityfTSi10newElementx_T_ + 100
5 libPackageDescription.so 0x00007f107124f7c9 _TFC18PackageDescription7PackagecfT4nameGSqSS_7targetsGSaCS_6Target_12dependenciesGSaCS0_10Dependency_16testDependenciesGSaS2__7excludeGSaSS__S0_ + 921
6 libPackageDescription.so 0x00007f107124fe08 _TFC18PackageDescription7PackageCfT4nameGSqSS_7targetsGSaCS_6Target_12dependenciesGSaCS0_10Dependency_16testDependenciesGSaS2__7excludeGSaSS__S0_ + 152
7 libPackageDescription.so 0x00007f10740f00f1 _TFC18PackageDescription7PackageCfT4nameGSqSS_7targetsGSaCS_6Target_12dependenciesGSaCS0_10Dependency_16testDependenciesGSaS2__7excludeGSaSS__S0_ + 48890753
8 swift 0x0000000000d089a4 llvm::MCJIT::runFunction(llvm::Function*, llvm::ArrayRef<llvm::GenericValue>) + 996
9 swift 0x0000000000d0c01f llvm::ExecutionEngine::runFunctionAsMain(llvm::Function*, std::vector<std::__cxx11::basic_string<char, std::char_traits<char>, std::allocator<char> >, std::allocator<std::__cxx11::basic_string<char, std::char_traits<char>, std::allocator<char> > > > const&, char const* const*) + 1263
10 swift 0x0000000000bf3318 swift::RunImmediately(swift::CompilerInstance&, std::vector<std::__cxx11::basic_string<char, std::char_traits<char>, std::allocator<char> >, std::allocator<std::__cxx11::basic_string<char, std::char_traits<char>, std::allocator<char> > > > const&, swift::IRGenOptions&, swift::SILOptions const&) + 2296
11 swift 0x0000000000789502
12 swift 0x0000000000784a73 frontend_main(llvm::ArrayRef<char const*>, char const*, void*) + 2643
13 swift 0x0000000000780056 main + 2518
14 libc.so.6 0x00007f10727b6a40 __libc_start_main + 240
15 swift 0x000000000077f579 _start + 41
Stack dump:
0. Program arguments: /home/buildnode/jenkins/workspace/oss-swift-incremental-RA-linux-ubuntu-15_10/Ninja-ReleaseAssert/swift-linux-x86_64/bin/swift -frontend -interpret /tmp/InvalidLayouts_Generic2.disHzr/Generic2/Package.swift -target x86_64-unknown-linux-gnu -disable-objc-interop -I /home/buildnode/jenkins/workspace/oss-swift-incremental-RA-linux-ubuntu-15_10/Ninja-ReleaseAssert/swiftpm-linux-x86_64/lib/swift/pm -module-name Package -lPackageDescription

swift-build: error: Child process exited with signal

/home/buildnode/jenkins/workspace/oss-swift-incremental-RA-linux-ubuntu-15_10/swiftpm/Tests/Functional/TestInvalidLayouts.swift:58: error: InvalidLayoutsTestCase.testInvalidLayout2 : failed - `swift build -c Debug' failed:

exit(1): /home/buildnode/jenkins/workspace/oss-swift-incremental-RA-linux-ubuntu-15_10/Ninja-ReleaseAssert/swiftpm-linux-x86_64/bin/swift-build --chdir /tmp/InvalidLayouts_Generic2.disHzr/Generic2 --configuration debug

/home/buildnode/jenkins/workspace/oss-swift-incremental-RA-linux-ubuntu-15_10/swiftpm/Tests/Functional/TestInvalidLayouts.swift:58: error: InvalidLayoutsTestCase.testInvalidLayout2 : failed - `swift build -c Release' failed:

exit(1): /home/buildnode/jenkins/workspace/oss-swift-incremental-RA-linux-ubuntu-15_10/Ninja-ReleaseAssert/swiftpm-linux-x86_64/bin/swift-build --chdir /tmp/InvalidLayouts_Generic2.disHzr/Generic2 --configuration release

Test Case 'InvalidLayoutsTestCase.testInvalidLayout2' failed (0.483 seconds).
Test Case 'InvalidLayoutsTestCase.testInvalidLayout3' started.
    Building Debug
0 swift 0x00000000031373f8 llvm::sys::PrintStackTrace(llvm::raw_ostream&) + 40
1 swift 0x0000000003135bf6 llvm::sys::RunSignalHandlers() + 54
2 swift 0x0000000003137f26
3 libpthread.so.0 0x00007febe218dd10
4 libswiftCore.so 0x00007febdf0db9b4 _TTSg5Vs5UInt8___TFSa37_appendElementAssumeUniqueAndCapacityfTSi10newElementx_T_ + 100
5 libPackageDescription.so 0x00007febdf5597c9 _TFC18PackageDescription7PackagecfT4nameGSqSS_7targetsGSaCS_6Target_12dependenciesGSaCS0_10Dependency_16testDependenciesGSaS2__7excludeGSaSS__S0_ + 921
6 libPackageDescription.so 0x00007febdf559e08 _TFC18PackageDescription7PackageCfT4nameGSqSS_7targetsGSaCS_6Target_12dependenciesGSaCS0_10Dependency_16testDependenciesGSaS2__7excludeGSaSS__S0_ + 152
7 libPackageDescription.so 0x00007febe23fa0f1 _TFC18PackageDescription7PackageCfT4nameGSqSS_7targetsGSaCS_6Target_12dependenciesGSaCS0_10Dependency_16testDependenciesGSaS2__7excludeGSaSS__S0_ + 48890753
8 swift 0x0000000000d089a4 llvm::MCJIT::runFunction(llvm::Function*, llvm::ArrayRef<llvm::GenericValue>) + 996
9 swift 0x0000000000d0c01f llvm::ExecutionEngine::runFunctionAsMain(llvm::Function*, std::vector<std::__cxx11::basic_string<char, std::char_traits<char>, std::allocator<char> >, std::allocator<std::__cxx11::basic_string<char, std::char_traits<char>, std::allocator<char> > > > const&, char const* const*) + 1263
10 swift 0x0000000000bf3318 swift::RunImmediately(swift::CompilerInstance&, std::vector<std::__cxx11::basic_string<char, std::char_traits<char>, std::allocator<char> >, std::allocator<std::__cxx11::basic_string<char, std::char_traits<char>, std::allocator<char> > > > const&, swift::IRGenOptions&, swift::SILOptions const&) + 2296
11 swift 0x0000000000789502
12 swift 0x0000000000784a73 frontend_main(llvm::ArrayRef<char const*>, char const*, void*) + 2643
13 swift 0x0000000000780056 main + 2518
14 libc.so.6 0x00007febe0ac0a40 __libc_start_main + 240
15 swift 0x000000000077f579 _start + 41
Stack dump:
0. Program arguments: /home/buildnode/jenkins/workspace/oss-swift-incremental-RA-linux-ubuntu-15_10/Ninja-ReleaseAssert/swift-linux-x86_64/bin/swift -frontend -interpret /tmp/InvalidLayouts_Generic3.DzpsCI/Generic3/Package.swift -target x86_64-unknown-linux-gnu -disable-objc-interop -I /home/buildnode/jenkins/workspace/oss-swift-incremental-RA-linux-ubuntu-15_10/Ninja-ReleaseAssert/swiftpm-linux-x86_64/lib/swift/pm -module-name Package -lPackageDescription

swift-build: error: Child process exited with signal

    Building Release
0 swift 0x00000000031373f8 llvm::sys::PrintStackTrace(llvm::raw_ostream&) + 40
1 swift 0x0000000003135bf6 llvm::sys::RunSignalHandlers() + 54
2 swift 0x0000000003137f26
3 libpthread.so.0 0x00007fc4469b1d10
4 libswiftCore.so 0x00007fc4438ff9b4 _TTSg5Vs5UInt8___TFSa37_appendElementAssumeUniqueAndCapacityfTSi10newElementx_T_ + 100
5 libPackageDescription.so 0x00007fc443d7d7c9 _TFC18PackageDescription7PackagecfT4nameGSqSS_7targetsGSaCS_6Target_12dependenciesGSaCS0_10Dependency_16testDependenciesGSaS2__7excludeGSaSS__S0_ + 921
6 libPackageDescription.so 0x00007fc443d7de08 _TFC18PackageDescription7PackageCfT4nameGSqSS_7targetsGSaCS_6Target_12dependenciesGSaCS0_10Dependency_16testDependenciesGSaS2__7excludeGSaSS__S0_ + 152
7 libPackageDescription.so 0x00007fc446c1e0f1 _TFC18PackageDescription7PackageCfT4nameGSqSS_7targetsGSaCS_6Target_12dependenciesGSaCS0_10Dependency_16testDependenciesGSaS2__7excludeGSaSS__S0_ + 48890753
8 swift 0x0000000000d089a4 llvm::MCJIT::runFunction(llvm::Function*, llvm::ArrayRef<llvm::GenericValue>) + 996
9 swift 0x0000000000d0c01f llvm::ExecutionEngine::runFunctionAsMain(llvm::Function*, std::vector<std::__cxx11::basic_string<char, std::char_traits<char>, std::allocator<char> >, std::allocator<std::__cxx11::basic_string<char, std::char_traits<char>, std::allocator<char> > > > const&, char const* const*) + 1263
10 swift 0x0000000000bf3318 swift::RunImmediately(swift::CompilerInstance&, std::vector<std::__cxx11::basic_string<char, std::char_traits<char>, std::allocator<char> >, std::allocator<std::__cxx11::basic_string<char, std::char_traits<char>, std::allocator<char> > > > const&, swift::IRGenOptions&, swift::SILOptions const&) + 2296
11 swift 0x0000000000789502
12 swift 0x0000000000784a73 frontend_main(llvm::ArrayRef<char const*>, char const*, void*) + 2643
13 swift 0x0000000000780056 main + 2518
14 libc.so.6 0x00007fc4452e4a40 __libc_start_main + 240
15 swift 0x000000000077f579 _start + 41
Stack dump:
0. Program arguments: /home/buildnode/jenkins/workspace/oss-swift-incremental-RA-linux-ubuntu-15_10/Ninja-ReleaseAssert/swift-linux-x86_64/bin/swift -frontend -interpret /tmp/InvalidLayouts_Generic3.DzpsCI/Generic3/Package.swift -target x86_64-unknown-linux-gnu -disable-objc-interop -I /home/buildnode/jenkins/workspace/oss-swift-incremental-RA-linux-ubuntu-15_10/Ninja-ReleaseAssert/swiftpm-linux-x86_64/lib/swift/pm -module-name Package -lPackageDescription

swift-build: error: Child process exited with signal

/home/buildnode/jenkins/workspace/oss-swift-incremental-RA-linux-ubuntu-15_10/swiftpm/Tests/Functional/TestInvalidLayouts.swift:73: error: InvalidLayoutsTestCase.testInvalidLayout3 : failed - `swift build -c Debug' failed:

exit(1): /home/buildnode/jenkins/workspace/oss-swift-incremental-RA-linux-ubuntu-15_10/Ninja-ReleaseAssert/swiftpm-linux-x86_64/bin/swift-build --chdir /tmp/InvalidLayouts_Generic3.DzpsCI/Generic3 --configuration debug

/home/buildnode/jenkins/workspace/oss-swift-incremental-RA-linux-ubuntu-15_10/swiftpm/Tests/Functional/TestInvalidLayouts.swift:73: error: InvalidLayoutsTestCase.testInvalidLayout3 : failed - `swift build -c Release' failed:

exit(1): /home/buildnode/jenkins/workspace/oss-swift-incremental-RA-linux-ubuntu-15_10/Ninja-ReleaseAssert/swiftpm-linux-x86_64/bin/swift-build --chdir /tmp/InvalidLayouts_Generic3.DzpsCI/Generic3 --configuration release

Test Case 'InvalidLayoutsTestCase.testInvalidLayout3' failed (0.498 seconds).
Test Case 'InvalidLayoutsTestCase.testInvalidLayout4' started.
    Building Debug
0 swift 0x00000000031373f8 llvm::sys::PrintStackTrace(llvm::raw_ostream&) + 40
1 swift 0x0000000003135bf6 llvm::sys::RunSignalHandlers() + 54
2 swift 0x0000000003137f26
3 libpthread.so.0 0x00007f3345893d10
4 libswiftCore.so 0x00007f33427e19b4 _TTSg5Vs5UInt8___TFSa37_appendElementAssumeUniqueAndCapacityfTSi10newElementx_T_ + 100
5 libPackageDescription.so 0x00007f3342c5f7c9 _TFC18PackageDescription7PackagecfT4nameGSqSS_7targetsGSaCS_6Target_12dependenciesGSaCS0_10Dependency_16testDependenciesGSaS2__7excludeGSaSS__S0_ + 921
6 libPackageDescription.so 0x00007f3342c5fe08 _TFC18PackageDescription7PackageCfT4nameGSqSS_7targetsGSaCS_6Target_12dependenciesGSaCS0_10Dependency_16testDependenciesGSaS2__7excludeGSaSS__S0_ + 152
7 libPackageDescription.so 0x00007f3345b000f1 _TFC18PackageDescription7PackageCfT4nameGSqSS_7targetsGSaCS_6Target_12dependenciesGSaCS0_10Dependency_16testDependenciesGSaS2__7excludeGSaSS__S0_ + 48890753
8 swift 0x0000000000d089a4 llvm::MCJIT::runFunction(llvm::Function*, llvm::ArrayRef<llvm::GenericValue>) + 996
9 swift 0x0000000000d0c01f llvm::ExecutionEngine::runFunctionAsMain(llvm::Function*, std::vector<std::__cxx11::basic_string<char, std::char_traits<char>, std::allocator<char> >, std::allocator<std::__cxx11::basic_string<char, std::char_traits<char>, std::allocator<char> > > > const&, char const* const*) + 1263
10 swift 0x0000000000bf3318 swift::RunImmediately(swift::CompilerInstance&, std::vector<std::__cxx11::basic_string<char, std::char_traits<char>, std::allocator<char> >, std::allocator<std::__cxx11::basic_string<char, std::char_traits<char>, std::allocator<char> > > > const&, swift::IRGenOptions&, swift::SILOptions const&) + 2296
11 swift 0x0000000000789502
12 swift 0x0000000000784a73 frontend_main(llvm::ArrayRef<char const*>, char const*, void*) + 2643
13 swift 0x0000000000780056 main + 2518
14 libc.so.6 0x00007f33441c6a40 __libc_start_main + 240
15 swift 0x000000000077f579 _start + 41
Stack dump:
0. Program arguments: /home/buildnode/jenkins/workspace/oss-swift-incremental-RA-linux-ubuntu-15_10/Ninja-ReleaseAssert/swift-linux-x86_64/bin/swift -frontend -interpret /tmp/InvalidLayouts_Generic4.zlvM40/Generic4/Package.swift -target x86_64-unknown-linux-gnu -disable-objc-interop -I /home/buildnode/jenkins/workspace/oss-swift-incremental-RA-linux-ubuntu-15_10/Ninja-ReleaseAssert/swiftpm-linux-x86_64/lib/swift/pm -module-name Package -lPackageDescription

swift-build: error: Child process exited with signal

    Building Release
0 swift 0x00000000031373f8 llvm::sys::PrintStackTrace(llvm::raw_ostream&) + 40
1 swift 0x0000000003135bf6 llvm::sys::RunSignalHandlers() + 54
2 swift 0x0000000003137f26
3 libpthread.so.0 0x00007f2fa3c20d10
4 libswiftCore.so 0x00007f2fa0b6e9b4 _TTSg5Vs5UInt8___TFSa37_appendElementAssumeUniqueAndCapacityfTSi10newElementx_T_ + 100
5 libPackageDescription.so 0x00007f2fa0fec7c9 _TFC18PackageDescription7PackagecfT4nameGSqSS_7targetsGSaCS_6Target_12dependenciesGSaCS0_10Dependency_16testDependenciesGSaS2__7excludeGSaSS__S0_ + 921
6 libPackageDescription.so 0x00007f2fa0fece08 _TFC18PackageDescription7PackageCfT4nameGSqSS_7targetsGSaCS_6Target_12dependenciesGSaCS0_10Dependency_16testDependenciesGSaS2__7excludeGSaSS__S0_ + 152
7 libPackageDescription.so 0x00007f2fa3e8d0f1 _TFC18PackageDescription7PackageCfT4nameGSqSS_7targetsGSaCS_6Target_12dependenciesGSaCS0_10Dependency_16testDependenciesGSaS2__7excludeGSaSS__S0_ + 48890753
8 swift 0x0000000000d089a4 llvm::MCJIT::runFunction(llvm::Function*, llvm::ArrayRef<llvm::GenericValue>) + 996
9 swift 0x0000000000d0c01f llvm::ExecutionEngine::runFunctionAsMain(llvm::Function*, std::vector<std::__cxx11::basic_string<char, std::char_traits<char>, std::allocator<char> >, std::allocator<std::__cxx11::basic_string<char, std::char_traits<char>, std::allocator<char> > > > const&, char const* const*) + 1263
10 swift 0x0000000000bf3318 swift::RunImmediately(swift::CompilerInstance&, std::vector<std::__cxx11::basic_string<char, std::char_traits<char>, std::allocator<char> >, std::allocator<std::__cxx11::basic_string<char, std::char_traits<char>, std::allocator<char> > > > const&, swift::IRGenOptions&, swift::SILOptions const&) + 2296
11 swift 0x0000000000789502
12 swift 0x0000000000784a73 frontend_main(llvm::ArrayRef<char const*>, char const*, void*) + 2643
13 swift 0x0000000000780056 main + 2518
14 libc.so.6 0x00007f2fa2553a40 __libc_start_main + 240
15 swift 0x000000000077f579 _start + 41
Stack dump:
0. Program arguments: /home/buildnode/jenkins/workspace/oss-swift-incremental-RA-linux-ubuntu-15_10/Ninja-ReleaseAssert/swift-linux-x86_64/bin/swift -frontend -interpret /tmp/InvalidLayouts_Generic4.zlvM40/Generic4/Package.swift -target x86_64-unknown-linux-gnu -disable-objc-interop -I /home/buildnode/jenkins/workspace/oss-swift-incremental-RA-linux-ubuntu-15_10/Ninja-ReleaseAssert/swiftpm-linux-x86_64/lib/swift/pm -module-name Package -lPackageDescription

swift-build: error: Child process exited with signal

/home/buildnode/jenkins/workspace/oss-swift-incremental-RA-linux-ubuntu-15_10/swiftpm/Tests/Functional/TestInvalidLayouts.swift:88: error: InvalidLayoutsTestCase.testInvalidLayout4 : failed - `swift build -c Debug' failed:

exit(1): /home/buildnode/jenkins/workspace/oss-swift-incremental-RA-linux-ubuntu-15_10/Ninja-ReleaseAssert/swiftpm-linux-x86_64/bin/swift-build --chdir /tmp/InvalidLayouts_Generic4.zlvM40/Generic4 --configuration debug

/home/buildnode/jenkins/workspace/oss-swift-incremental-RA-linux-ubuntu-15_10/swiftpm/Tests/Functional/TestInvalidLayouts.swift:88: error: InvalidLayoutsTestCase.testInvalidLayout4 : failed - `swift build -c Release' failed:

exit(1): /home/buildnode/jenkins/workspace/oss-swift-incremental-RA-linux-ubuntu-15_10/Ninja-ReleaseAssert/swiftpm-linux-x86_64/bin/swift-build --chdir /tmp/InvalidLayouts_Generic4.zlvM40/Generic4 --configuration release

Test Case 'InvalidLayoutsTestCase.testInvalidLayout4' failed (0.483 seconds).
Test Case 'InvalidLayoutsTestCase.testInvalidLayout5' started.
    Building Debug
0 swift 0x00000000031373f8 llvm::sys::PrintStackTrace(llvm::raw_ostream&) + 40
1 swift 0x0000000003135bf6 llvm::sys::RunSignalHandlers() + 54
2 swift 0x0000000003137f26
3 libpthread.so.0 0x00007ff9d0321d10
4 libswiftCore.so 0x00007ff9cd26f9b4 _TTSg5Vs5UInt8___TFSa37_appendElementAssumeUniqueAndCapacityfTSi10newElementx_T_ + 100
5 libPackageDescription.so 0x00007ff9cd6ed7c9 _TFC18PackageDescription7PackagecfT4nameGSqSS_7targetsGSaCS_6Target_12dependenciesGSaCS0_10Dependency_16testDependenciesGSaS2__7excludeGSaSS__S0_ + 921
6 libPackageDescription.so 0x00007ff9cd6ede08 _TFC18PackageDescription7PackageCfT4nameGSqSS_7targetsGSaCS_6Target_12dependenciesGSaCS0_10Dependency_16testDependenciesGSaS2__7excludeGSaSS__S0_ + 152
7 libPackageDescription.so 0x00007ff9d058e0f1 _TFC18PackageDescription7PackageCfT4nameGSqSS_7targetsGSaCS_6Target_12dependenciesGSaCS0_10Dependency_16testDependenciesGSaS2__7excludeGSaSS__S0_ + 48890753
8 swift 0x0000000000d089a4 llvm::MCJIT::runFunction(llvm::Function*, llvm::ArrayRef<llvm::GenericValue>) + 996
9 swift 0x0000000000d0c01f llvm::ExecutionEngine::runFunctionAsMain(llvm::Function*, std::vector<std::__cxx11::basic_string<char, std::char_traits<char>, std::allocator<char> >, std::allocator<std::__cxx11::basic_string<char, std::char_traits<char>, std::allocator<char> > > > const&, char const* const*) + 1263
10 swift 0x0000000000bf3318 swift::RunImmediately(swift::CompilerInstance&, std::vector<std::__cxx11::basic_string<char, std::char_traits<char>, std::allocator<char> >, std::allocator<std::__cxx11::basic_string<char, std::char_traits<char>, std::allocator<char> > > > const&, swift::IRGenOptions&, swift::SILOptions const&) + 2296
11 swift 0x0000000000789502
12 swift 0x0000000000784a73 frontend_main(llvm::ArrayRef<char const*>, char const*, void*) + 2643
13 swift 0x0000000000780056 main + 2518
14 libc.so.6 0x00007ff9cec54a40 __libc_start_main + 240
15 swift 0x000000000077f579 _start + 41
Stack dump:
0. Program arguments: /home/buildnode/jenkins/workspace/oss-swift-incremental-RA-linux-ubuntu-15_10/Ninja-ReleaseAssert/swift-linux-x86_64/bin/swift -frontend -interpret /tmp/InvalidLayouts_Generic5.BCH7Tk/Generic5/Package.swift -target x86_64-unknown-linux-gnu -disable-objc-interop -I /home/buildnode/jenkins/workspace/oss-swift-incremental-RA-linux-ubuntu-15_10/Ninja-ReleaseAssert/swiftpm-linux-x86_64/lib/swift/pm -module-name Package -lPackageDescription

swift-build: error: Child process exited with signal

    Building Release
0 swift 0x00000000031373f8 llvm::sys::PrintStackTrace(llvm::raw_ostream&) + 40
1 swift 0x0000000003135bf6 llvm::sys::RunSignalHandlers() + 54
2 swift 0x0000000003137f26
3 libpthread.so.0 0x00007f3e5f44fd10
4 libswiftCore.so 0x00007f3e5c39d9b4 _TTSg5Vs5UInt8___TFSa37_appendElementAssumeUniqueAndCapacityfTSi10newElementx_T_ + 100
5 libPackageDescription.so 0x00007f3e5c81b7c9 _TFC18PackageDescription7PackagecfT4nameGSqSS_7targetsGSaCS_6Target_12dependenciesGSaCS0_10Dependency_16testDependenciesGSaS2__7excludeGSaSS__S0_ + 921
6 libPackageDescription.so 0x00007f3e5c81be08 _TFC18PackageDescription7PackageCfT4nameGSqSS_7targetsGSaCS_6Target_12dependenciesGSaCS0_10Dependency_16testDependenciesGSaS2__7excludeGSaSS__S0_ + 152
7 libPackageDescription.so 0x00007f3e5f6bc0f1 _TFC18PackageDescription7PackageCfT4nameGSqSS_7targetsGSaCS_6Target_12dependenciesGSaCS0_10Dependency_16testDependenciesGSaS2__7excludeGSaSS__S0_ + 48890753
8 swift 0x0000000000d089a4 llvm::MCJIT::runFunction(llvm::Function*, llvm::ArrayRef<llvm::GenericValue>) + 996
9 swift 0x0000000000d0c01f llvm::ExecutionEngine::runFunctionAsMain(llvm::Function*, std::vector<std::__cxx11::basic_string<char, std::char_traits<char>, std::allocator<char> >, std::allocator<std::__cxx11::basic_string<char, std::char_traits<char>, std::allocator<char> > > > const&, char const* const*) + 1263
10 swift 0x0000000000bf3318 swift::RunImmediately(swift::CompilerInstance&, std::vector<std::__cxx11::basic_string<char, std::char_traits<char>, std::allocator<char> >, std::allocator<std::__cxx11::basic_string<char, std::char_traits<char>, std::allocator<char> > > > const&, swift::IRGenOptions&, swift::SILOptions const&) + 2296
11 swift 0x0000000000789502
12 swift 0x0000000000784a73 frontend_main(llvm::ArrayRef<char const*>, char const*, void*) + 2643
13 swift 0x0000000000780056 main + 2518
14 libc.so.6 0x00007f3e5dd82a40 __libc_start_main + 240
15 swift 0x000000000077f579 _start + 41
Stack dump:
0. Program arguments: /home/buildnode/jenkins/workspace/oss-swift-incremental-RA-linux-ubuntu-15_10/Ninja-ReleaseAssert/swift-linux-x86_64/bin/swift -frontend -interpret /tmp/InvalidLayouts_Generic5.BCH7Tk/Generic5/Package.swift -target x86_64-unknown-linux-gnu -disable-objc-interop -I /home/buildnode/jenkins/workspace/oss-swift-incremental-RA-linux-ubuntu-15_10/Ninja-ReleaseAssert/swiftpm-linux-x86_64/lib/swift/pm -module-name Package -lPackageDescription

swift-build: error: Child process exited with signal

/home/buildnode/jenkins/workspace/oss-swift-incremental-RA-linux-ubuntu-15_10/swiftpm/Tests/Functional/TestInvalidLayouts.swift:111: error: InvalidLayoutsTestCase.testInvalidLayout5 : failed - `swift build -c Debug' failed:

exit(1): /home/buildnode/jenkins/workspace/oss-swift-incremental-RA-linux-ubuntu-15_10/Ninja-ReleaseAssert/swiftpm-linux-x86_64/bin/swift-build --chdir /tmp/InvalidLayouts_Generic5.BCH7Tk/Generic5 --configuration debug

/home/buildnode/jenkins/workspace/oss-swift-incremental-RA-linux-ubuntu-15_10/swiftpm/Tests/Functional/TestInvalidLayouts.swift:111: error: InvalidLayoutsTestCase.testInvalidLayout5 : failed - `swift build -c Release' failed:

exit(1): /home/buildnode/jenkins/workspace/oss-swift-incremental-RA-linux-ubuntu-15_10/Ninja-ReleaseAssert/swiftpm-linux-x86_64/bin/swift-build --chdir /tmp/InvalidLayouts_Generic5.BCH7Tk/Generic5 --configuration release

Test Case 'InvalidLayoutsTestCase.testInvalidLayout5' failed (0.492 seconds).
Executed 7 tests, with 10 failures (0 unexpected) in 2.556 (2.557) seconds
Test Case 'ManifestTests.testManifestLoading' started.
0 swift 0x00000000031373f8 llvm::sys::PrintStackTrace(llvm::raw_ostream&) + 40
1 swift 0x0000000003135bf6 llvm::sys::RunSignalHandlers() + 54
2 swift 0x0000000003137f26
3 libpthread.so.0 0x00007f1e148cbd10
4 libswiftCore.so 0x00007f1e118199b4 _TTSg5Vs5UInt8___TFSa37_appendElementAssumeUniqueAndCapacityfTSi10newElementx_T_ + 100
5 libPackageDescription.so 0x00007f1e11c977c9 _TFC18PackageDescription7PackagecfT4nameGSqSS_7targetsGSaCS_6Target_12dependenciesGSaCS0_10Dependency_16testDependenciesGSaS2__7excludeGSaSS__S0_ + 921
6 libPackageDescription.so 0x00007f1e11c97e08 _TFC18PackageDescription7PackageCfT4nameGSqSS_7targetsGSaCS_6Target_12dependenciesGSaCS0_10Dependency_16testDependenciesGSaS2__7excludeGSaSS__S0_ + 152
7 libPackageDescription.so 0x00007f1e14b380f1 _TFC18PackageDescription7PackageCfT4nameGSqSS_7targetsGSaCS_6Target_12dependenciesGSaCS0_10Dependency_16testDependenciesGSaS2__7excludeGSaSS__S0_ + 48890753
8 swift 0x0000000000d089a4 llvm::MCJIT::runFunction(llvm::Function*, llvm::ArrayRef<llvm::GenericValue>) + 996
9 swift 0x0000000000d0c01f llvm::ExecutionEngine::runFunctionAsMain(llvm::Function*, std::vector<std::__cxx11::basic_string<char, std::char_traits<char>, std::allocator<char> >, std::allocator<std::__cxx11::basic_string<char, std::char_traits<char>, std::allocator<char> > > > const&, char const* const*) + 1263
10 swift 0x0000000000bf3318 swift::RunImmediately(swift::CompilerInstance&, std::vector<std::__cxx11::basic_string<char, std::char_traits<char>, std::allocator<char> >, std::allocator<std::__cxx11::basic_string<char, std::char_traits<char>, std::allocator<char> > > > const&, swift::IRGenOptions&, swift::SILOptions const&) + 2296
11 swift 0x0000000000789502
12 swift 0x0000000000784a73 frontend_main(llvm::ArrayRef<char const*>, char const*, void*) + 2643
13 swift 0x0000000000780056 main + 2518
14 libc.so.6 0x00007f1e131fea40 __libc_start_main + 240
15 swift 0x000000000077f579 _start + 41
Stack dump:
0. Program arguments: /home/buildnode/jenkins/workspace/oss-swift-incremental-RA-linux-ubuntu-15_10/Ninja-ReleaseAssert/swift-linux-x86_64/bin/swift -frontend -interpret /home/buildnode/jenkins/workspace/oss-swift-incremental-RA-linux-ubuntu-15_10/swiftpm/Tests/ManifestParser/Inputs/trivial-manifest -target x86_64-unknown-linux-gnu -disable-objc-interop -I /home/buildnode/jenkins/workspace/oss-swift-incremental-RA-linux-ubuntu-15_10/Ninja-ReleaseAssert/swiftpm-linux-x86_64/lib/swift/pm -module-name main -lPackageDescription
0 swift 0x00000000031373f8 llvm::sys::PrintStackTrace(llvm::raw_ostream&) + 40
1 swift 0x0000000003135bf6 llvm::sys::RunSignalHandlers() + 54
2 swift 0x0000000003137f26
3 libpthread.so.0 0x00007f8a13da4d10
4 libswiftCore.so 0x00007f8a10cf29b4 _TTSg5Vs5UInt8___TFSa37_appendElementAssumeUniqueAndCapacityfTSi10newElementx_T_ + 100
5 libPackageDescription.so 0x00007f8a111707c9 _TFC18PackageDescription7PackagecfT4nameGSqSS_7targetsGSaCS_6Target_12dependenciesGSaCS0_10Dependency_16testDependenciesGSaS2__7excludeGSaSS__S0_ + 921
6 libPackageDescription.so 0x00007f8a11170e08 _TFC18PackageDescription7PackageCfT4nameGSqSS_7targetsGSaCS_6Target_12dependenciesGSaCS0_10Dependency_16testDependenciesGSaS2__7excludeGSaSS__S0_ + 152
7 libPackageDescription.so 0x00007f8a14011164 _TFC18PackageDescription7PackageCfT4nameGSqSS_7targetsGSaCS_6Target_12dependenciesGSaCS0_10Dependency_16testDependenciesGSaS2__7excludeGSaSS__S0_ + 48890868
8 swift 0x0000000000d089a4 llvm::MCJIT::runFunction(llvm::Function*, llvm::ArrayRef<llvm::GenericValue>) + 996
9 swift 0x0000000000d0c01f llvm::ExecutionEngine::runFunctionAsMain(llvm::Function*, std::vector<std::__cxx11::basic_string<char, std::char_traits<char>, std::allocator<char> >, std::allocator<std::__cxx11::basic_string<char, std::char_traits<char>, std::allocator<char> > > > const&, char const* const*) + 1263
10 swift 0x0000000000bf3318 swift::RunImmediately(swift::CompilerInstance&, std::vector<std::__cxx11::basic_string<char, std::char_traits<char>, std::allocator<char> >, std::allocator<std::__cxx11::basic_string<char, std::char_traits<char>, std::allocator<char> > > > const&, swift::IRGenOptions&, swift::SILOptions const&) + 2296
11 swift 0x0000000000789502
12 swift 0x0000000000784a73 frontend_main(llvm::ArrayRef<char const*>, char const*, void*) + 2643
13 swift 0x0000000000780056 main + 2518
14 libc.so.6 0x00007f8a126d7a40 __libc_start_main + 240
15 swift 0x000000000077f579 _start + 41
Stack dump:
0. Program arguments: /home/buildnode/jenkins/workspace/oss-swift-incremental-RA-linux-ubuntu-15_10/Ninja-ReleaseAssert/swift-linux-x86_64/bin/swift -frontend -interpret /home/buildnode/jenkins/workspace/oss-swift-incremental-RA-linux-ubuntu-15_10/swiftpm/Tests/ManifestParser/Inputs/package-deps-manifest -target x86_64-unknown-linux-gnu -disable-objc-interop -I /home/buildnode/jenkins/workspace/oss-swift-incremental-RA-linux-ubuntu-15_10/Ninja-ReleaseAssert/swiftpm-linux-x86_64/lib/swift/pm -module-name main -lPackageDescription
0 swift 0x00000000031373f8 llvm::sys::PrintStackTrace(llvm::raw_ostream&) + 40
1 swift 0x0000000003135bf6 llvm::sys::RunSignalHandlers() + 54
2 swift 0x0000000003137f26
3 libpthread.so.0 0x00007f50f9432d10
4 libswiftCore.so 0x00007f50f63809b4 _TTSg5Vs5UInt8___TFSa37_appendElementAssumeUniqueAndCapacityfTSi10newElementx_T_ + 100
5 libPackageDescription.so 0x00007f50f67fe7c9 _TFC18PackageDescription7PackagecfT4nameGSqSS_7targetsGSaCS_6Target_12dependenciesGSaCS0_10Dependency_16testDependenciesGSaS2__7excludeGSaSS__S0_ + 921
6 libPackageDescription.so 0x00007f50f67fee08 _TFC18PackageDescription7PackageCfT4nameGSqSS_7targetsGSaCS_6Target_12dependenciesGSaCS0_10Dependency_16testDependenciesGSaS2__7excludeGSaSS__S0_ + 152
7 libPackageDescription.so 0x00007f50f969f29d _TFC18PackageDescription7PackageCfT4nameGSqSS_7targetsGSaCS_6Target_12dependenciesGSaCS0_10Dependency_16testDependenciesGSaS2__7excludeGSaSS__S0_ + 48891181
8 swift 0x0000000000d089a4 llvm::MCJIT::runFunction(llvm::Function*, llvm::ArrayRef<llvm::GenericValue>) + 996
9 swift 0x0000000000d0c01f llvm::ExecutionEngine::runFunctionAsMain(llvm::Function*, std::vector<std::__cxx11::basic_string<char, std::char_traits<char>, std::allocator<char> >, std::allocator<std::__cxx11::basic_string<char, std::char_traits<char>, std::allocator<char> > > > const&, char const* const*) + 1263
10 swift 0x0000000000bf3318 swift::RunImmediately(swift::CompilerInstance&, std::vector<std::__cxx11::basic_string<char, std::char_traits<char>, std::allocator<char> >, std::allocator<std::__cxx11::basic_string<char, std::char_traits<char>, std::allocator<char> > > > const&, swift::IRGenOptions&, swift::SILOptions const&) + 2296
11 swift 0x0000000000789502
12 swift 0x0000000000784a73 frontend_main(llvm::ArrayRef<char const*>, char const*, void*) + 2643
13 swift 0x0000000000780056 main + 2518
14 libc.so.6 0x00007f50f7d65a40 __libc_start_main + 240
15 swift 0x000000000077f579 _start + 41
Stack dump:
0. Program arguments: /home/buildnode/jenkins/workspace/oss-swift-incremental-RA-linux-ubuntu-15_10/Ninja-ReleaseAssert/swift-linux-x86_64/bin/swift -frontend -interpret /home/buildnode/jenkins/workspace/oss-swift-incremental-RA-linux-ubuntu-15_10/swiftpm/Tests/ManifestParser/Inputs/target-deps-manifest -target x86_64-unknown-linux-gnu -disable-objc-interop -I /home/buildnode/jenkins/workspace/oss-swift-incremental-RA-linux-ubuntu-15_10/Ninja-ReleaseAssert/swiftpm-linux-x86_64/lib/swift/pm -module-name main -lPackageDescription
/home/buildnode/jenkins/workspace/oss-swift-incremental-RA-linux-ubuntu-15_10/swiftpm/Tests/ManifestParser/ManifestTests.swift:30: error: ManifestTests.testManifestLoading : failed - Unexpected error: Child process exited with signal
/home/buildnode/jenkins/workspace/oss-swift-incremental-RA-linux-ubuntu-15_10/swiftpm/Tests/ManifestParser/ManifestTests.swift:37: error: ManifestTests.testManifestLoading : failed - Unexpected error: Child process exited with signal
/home/buildnode/jenkins/workspace/oss-swift-incremental-RA-linux-ubuntu-15_10/swiftpm/Tests/ManifestParser/ManifestTests.swift:44: error: ManifestTests.testManifestLoading : failed - Unexpected error: Child process exited with signal
Test Case 'ManifestTests.testManifestLoading' failed (0.499 seconds).
Executed 1 test, with 3 failures (0 unexpected) in 0.499 (0.499) seconds
Test Case 'MiscellaneousTestCase.testPrintsSelectedDependencyVersion' started.
/home/buildnode/jenkins/workspace/oss-swift-incremental-RA-linux-ubuntu-15_10/swiftpm/Tests/Functional/TestMiscellaneous.swift:27: error: MiscellaneousTestCase.testPrintsSelectedDependencyVersion : failed - exit(1): /home/buildnode/jenkins/workspace/oss-swift-incremental-RA-linux-ubuntu-15_10/Ninja-ReleaseAssert/swiftpm-linux-x86_64/bin/swift-build --chdir /tmp/DependencyResolution_External_Simple.TxsUxH/Bar --configuration debug
Test Case 'MiscellaneousTestCase.testPrintsSelectedDependencyVersion' failed (0.224 seconds).
Test Case 'MiscellaneousTestCase.testManifestExcludes1' started.
    Building Debug
0 swift 0x00000000031373f8 llvm::sys::PrintStackTrace(llvm::raw_ostream&) + 40
1 swift 0x0000000003135bf6 llvm::sys::RunSignalHandlers() + 54
2 swift 0x0000000003137f26
3 libpthread.so.0 0x00007febeeebcd10
4 libswiftCore.so 0x00007febebe0a9b4 _TTSg5Vs5UInt8___TFSa37_appendElementAssumeUniqueAndCapacityfTSi10newElementx_T_ + 100
5 libPackageDescription.so 0x00007febec2887c9 _TFC18PackageDescription7PackagecfT4nameGSqSS_7targetsGSaCS_6Target_12dependenciesGSaCS0_10Dependency_16testDependenciesGSaS2__7excludeGSaSS__S0_ + 921
6 libPackageDescription.so 0x00007febec288e08 _TFC18PackageDescription7PackageCfT4nameGSqSS_7targetsGSaCS_6Target_12dependenciesGSaCS0_10Dependency_16testDependenciesGSaS2__7excludeGSaSS__S0_ + 152
7 libPackageDescription.so 0x00007febef129132 _TFC18PackageDescription7PackageCfT4nameGSqSS_7targetsGSaCS_6Target_12dependenciesGSaCS0_10Dependency_16testDependenciesGSaS2__7excludeGSaSS__S0_ + 48890818
8 swift 0x0000000000d089a4 llvm::MCJIT::runFunction(llvm::Function*, llvm::ArrayRef<llvm::GenericValue>) + 996
9 swift 0x0000000000d0c01f llvm::ExecutionEngine::runFunctionAsMain(llvm::Function*, std::vector<std::__cxx11::basic_string<char, std::char_traits<char>, std::allocator<char> >, std::allocator<std::__cxx11::basic_string<char, std::char_traits<char>, std::allocator<char> > > > const&, char const* const*) + 1263
10 swift 0x0000000000bf3318 swift::RunImmediately(swift::CompilerInstance&, std::vector<std::__cxx11::basic_string<char, std::char_traits<char>, std::allocator<char> >, std::allocator<std::__cxx11::basic_string<char, std::char_traits<char>, std::allocator<char> > > > const&, swift::IRGenOptions&, swift::SILOptions const&) + 2296
11 swift 0x0000000000789502
12 swift 0x0000000000784a73 frontend_main(llvm::ArrayRef<char const*>, char const*, void*) + 2643
13 swift 0x0000000000780056 main + 2518
14 libc.so.6 0x00007febed7efa40 __libc_start_main + 240
15 swift 0x000000000077f579 _start + 41
Stack dump:
0. Program arguments: /home/buildnode/jenkins/workspace/oss-swift-incremental-RA-linux-ubuntu-15_10/Ninja-ReleaseAssert/swift-linux-x86_64/bin/swift -frontend -interpret /tmp/Miscellaneous_ExcludeDiagnostic1.Xzu2O4/ExcludeDiagnostic1/Package.swift -target x86_64-unknown-linux-gnu -disable-objc-interop -I /home/buildnode/jenkins/workspace/oss-swift-incremental-RA-linux-ubuntu-15_10/Ninja-ReleaseAssert/swiftpm-linux-x86_64/lib/swift/pm -module-name Package -lPackageDescription

swift-build: error: Child process exited with signal

    Building Release
0 swift 0x00000000031373f8 llvm::sys::PrintStackTrace(llvm::raw_ostream&) + 40
1 swift 0x0000000003135bf6 llvm::sys::RunSignalHandlers() + 54
2 swift 0x0000000003137f26
3 libpthread.so.0 0x00007fc766c51d10
4 libswiftCore.so 0x00007fc763b9f9b4 _TTSg5Vs5UInt8___TFSa37_appendElementAssumeUniqueAndCapacityfTSi10newElementx_T_ + 100
5 libPackageDescription.so 0x00007fc76401d7c9 _TFC18PackageDescription7PackagecfT4nameGSqSS_7targetsGSaCS_6Target_12dependenciesGSaCS0_10Dependency_16testDependenciesGSaS2__7excludeGSaSS__S0_ + 921
6 libPackageDescription.so 0x00007fc76401de08 _TFC18PackageDescription7PackageCfT4nameGSqSS_7targetsGSaCS_6Target_12dependenciesGSaCS0_10Dependency_16testDependenciesGSaS2__7excludeGSaSS__S0_ + 152
7 libPackageDescription.so 0x00007fc766ebe132 _TFC18PackageDescription7PackageCfT4nameGSqSS_7targetsGSaCS_6Target_12dependenciesGSaCS0_10Dependency_16testDependenciesGSaS2__7excludeGSaSS__S0_ + 48890818
8 swift 0x0000000000d089a4 llvm::MCJIT::runFunction(llvm::Function*, llvm::ArrayRef<llvm::GenericValue>) + 996
9 swift 0x0000000000d0c01f llvm::ExecutionEngine::runFunctionAsMain(llvm::Function*, std::vector<std::__cxx11::basic_string<char, std::char_traits<char>, std::allocator<char> >, std::allocator<std::__cxx11::basic_string<char, std::char_traits<char>, std::allocator<char> > > > const&, char const* const*) + 1263
10 swift 0x0000000000bf3318 swift::RunImmediately(swift::CompilerInstance&, std::vector<std::__cxx11::basic_string<char, std::char_traits<char>, std::allocator<char> >, std::allocator<std::__cxx11::basic_string<char, std::char_traits<char>, std::allocator<char> > > > const&, swift::IRGenOptions&, swift::SILOptions const&) + 2296
11 swift 0x0000000000789502
12 swift 0x0000000000784a73 frontend_main(llvm::ArrayRef<char const*>, char const*, void*) + 2643
13 swift 0x0000000000780056 main + 2518
14 libc.so.6 0x00007fc765584a40 __libc_start_main + 240
15 swift 0x000000000077f579 _start + 41
Stack dump:
0. Program arguments: /home/buildnode/jenkins/workspace/oss-swift-incremental-RA-linux-ubuntu-15_10/Ninja-ReleaseAssert/swift-linux-x86_64/bin/swift -frontend -interpret /tmp/Miscellaneous_ExcludeDiagnostic1.Xzu2O4/ExcludeDiagnostic1/Package.swift -target x86_64-unknown-linux-gnu -disable-objc-interop -I /home/buildnode/jenkins/workspace/oss-swift-incremental-RA-linux-ubuntu-15_10/Ninja-ReleaseAssert/swiftpm-linux-x86_64/lib/swift/pm -module-name Package -lPackageDescription

swift-build: error: Child process exited with signal

/home/buildnode/jenkins/workspace/oss-swift-incremental-RA-linux-ubuntu-15_10/swiftpm/Tests/Functional/TestMiscellaneous.swift:39: error: MiscellaneousTestCase.testManifestExcludes1 : failed - `swift build -c Debug' failed:

exit(1): /home/buildnode/jenkins/workspace/oss-swift-incremental-RA-linux-ubuntu-15_10/Ninja-ReleaseAssert/swiftpm-linux-x86_64/bin/swift-build --chdir /tmp/Miscellaneous_ExcludeDiagnostic1.Xzu2O4/ExcludeDiagnostic1 --configuration debug

/home/buildnode/jenkins/workspace/oss-swift-incremental-RA-linux-ubuntu-15_10/swiftpm/Tests/Functional/TestMiscellaneous.swift:39: error: MiscellaneousTestCase.testManifestExcludes1 : failed - `swift build -c Release' failed:

exit(1): /home/buildnode/jenkins/workspace/oss-swift-incremental-RA-linux-ubuntu-15_10/Ninja-ReleaseAssert/swiftpm-linux-x86_64/bin/swift-build --chdir /tmp/Miscellaneous_ExcludeDiagnostic1.Xzu2O4/ExcludeDiagnostic1 --configuration release

/home/buildnode/jenkins/workspace/oss-swift-incremental-RA-linux-ubuntu-15_10/swiftpm/Tests/Functional/TestMiscellaneous.swift:40: error: MiscellaneousTestCase.testManifestExcludes1 : failed - Expected file doesn’t exist: /tmp/Miscellaneous_ExcludeDiagnostic1.Xzu2O4/ExcludeDiagnostic1/.build/debug/BarLib.swiftmodule
/home/buildnode/jenkins/workspace/oss-swift-incremental-RA-linux-ubuntu-15_10/swiftpm/Tests/Functional/TestMiscellaneous.swift:41: error: MiscellaneousTestCase.testManifestExcludes1 : failed - Expected file doesn’t exist: /tmp/Miscellaneous_ExcludeDiagnostic1.Xzu2O4/ExcludeDiagnostic1/.build/debug/FooBarLib.swiftmodule
Test Case 'MiscellaneousTestCase.testManifestExcludes1' failed (0.372 seconds).
Test Case 'MiscellaneousTestCase.testManifestExcludes2' started.
    Building Debug
0 swift 0x00000000031373f8 llvm::sys::PrintStackTrace(llvm::raw_ostream&) + 40
1 swift 0x0000000003135bf6 llvm::sys::RunSignalHandlers() + 54
2 swift 0x0000000003137f26
3 libpthread.so.0 0x00007f5f48c42d10
4 libswiftCore.so 0x00007f5f45b909b4 _TTSg5Vs5UInt8___TFSa37_appendElementAssumeUniqueAndCapacityfTSi10newElementx_T_ + 100
5 libPackageDescription.so 0x00007f5f4600e7c9 _TFC18PackageDescription7PackagecfT4nameGSqSS_7targetsGSaCS_6Target_12dependenciesGSaCS0_10Dependency_16testDependenciesGSaS2__7excludeGSaSS__S0_ + 921
6 libPackageDescription.so 0x00007f5f4600ee08 _TFC18PackageDescription7PackageCfT4nameGSqSS_7targetsGSaCS_6Target_12dependenciesGSaCS0_10Dependency_16testDependenciesGSaS2__7excludeGSaSS__S0_ + 152
7 libPackageDescription.so 0x00007f5f48eaf1c4 _TFC18PackageDescription7PackageCfT4nameGSqSS_7targetsGSaCS_6Target_12dependenciesGSaCS0_10Dependency_16testDependenciesGSaS2__7excludeGSaSS__S0_ + 48890964
8 swift 0x0000000000d089a4 llvm::MCJIT::runFunction(llvm::Function*, llvm::ArrayRef<llvm::GenericValue>) + 996
9 swift 0x0000000000d0c01f llvm::ExecutionEngine::runFunctionAsMain(llvm::Function*, std::vector<std::__cxx11::basic_string<char, std::char_traits<char>, std::allocator<char> >, std::allocator<std::__cxx11::basic_string<char, std::char_traits<char>, std::allocator<char> > > > const&, char const* const*) + 1263
10 swift 0x0000000000bf3318 swift::RunImmediately(swift::CompilerInstance&, std::vector<std::__cxx11::basic_string<char, std::char_traits<char>, std::allocator<char> >, std::allocator<std::__cxx11::basic_string<char, std::char_traits<char>, std::allocator<char> > > > const&, swift::IRGenOptions&, swift::SILOptions const&) + 2296
11 swift 0x0000000000789502
12 swift 0x0000000000784a73 frontend_main(llvm::ArrayRef<char const*>, char const*, void*) + 2643
13 swift 0x0000000000780056 main + 2518
14 libc.so.6 0x00007f5f47575a40 __libc_start_main + 240
15 swift 0x000000000077f579 _start + 41
Stack dump:
0. Program arguments: /home/buildnode/jenkins/workspace/oss-swift-incremental-RA-linux-ubuntu-15_10/Ninja-ReleaseAssert/swift-linux-x86_64/bin/swift -frontend -interpret /tmp/Miscellaneous_ExcludeDiagnostic2.lfxG9s/ExcludeDiagnostic2/Package.swift -target x86_64-unknown-linux-gnu -disable-objc-interop -I /home/buildnode/jenkins/workspace/oss-swift-incremental-RA-linux-ubuntu-15_10/Ninja-ReleaseAssert/swiftpm-linux-x86_64/lib/swift/pm -module-name Package -lPackageDescription

swift-build: error: Child process exited with signal

    Building Release
0 swift 0x00000000031373f8 llvm::sys::PrintStackTrace(llvm::raw_ostream&) + 40
1 swift 0x0000000003135bf6 llvm::sys::RunSignalHandlers() + 54
2 swift 0x0000000003137f26
3 libpthread.so.0 0x00007f304c31bd10
4 libswiftCore.so 0x00007f30492699b4 _TTSg5Vs5UInt8___TFSa37_appendElementAssumeUniqueAndCapacityfTSi10newElementx_T_ + 100
5 libPackageDescription.so 0x00007f30496e77c9 _TFC18PackageDescription7PackagecfT4nameGSqSS_7targetsGSaCS_6Target_12dependenciesGSaCS0_10Dependency_16testDependenciesGSaS2__7excludeGSaSS__S0_ + 921
6 libPackageDescription.so 0x00007f30496e7e08 _TFC18PackageDescription7PackageCfT4nameGSqSS_7targetsGSaCS_6Target_12dependenciesGSaCS0_10Dependency_16testDependenciesGSaS2__7excludeGSaSS__S0_ + 152
7 libPackageDescription.so 0x00007f304c5881c4 _TFC18PackageDescription7PackageCfT4nameGSqSS_7targetsGSaCS_6Target_12dependenciesGSaCS0_10Dependency_16testDependenciesGSaS2__7excludeGSaSS__S0_ + 48890964
8 swift 0x0000000000d089a4 llvm::MCJIT::runFunction(llvm::Function*, llvm::ArrayRef<llvm::GenericValue>) + 996
9 swift 0x0000000000d0c01f llvm::ExecutionEngine::runFunctionAsMain(llvm::Function*, std::vector<std::__cxx11::basic_string<char, std::char_traits<char>, std::allocator<char> >, std::allocator<std::__cxx11::basic_string<char, std::char_traits<char>, std::allocator<char> > > > const&, char const* const*) + 1263
10 swift 0x0000000000bf3318 swift::RunImmediately(swift::CompilerInstance&, std::vector<std::__cxx11::basic_string<char, std::char_traits<char>, std::allocator<char> >, std::allocator<std::__cxx11::basic_string<char, std::char_traits<char>, std::allocator<char> > > > const&, swift::IRGenOptions&, swift::SILOptions const&) + 2296
11 swift 0x0000000000789502
12 swift 0x0000000000784a73 frontend_main(llvm::ArrayRef<char const*>, char const*, void*) + 2643
13 swift 0x0000000000780056 main + 2518
14 libc.so.6 0x00007f304ac4ea40 __libc_start_main + 240
15 swift 0x000000000077f579 _start + 41
Stack dump:
0. Program arguments: /home/buildnode/jenkins/workspace/oss-swift-incremental-RA-linux-ubuntu-15_10/Ninja-ReleaseAssert/swift-linux-x86_64/bin/swift -frontend -interpret /tmp/Miscellaneous_ExcludeDiagnostic2.lfxG9s/ExcludeDiagnostic2/Package.swift -target x86_64-unknown-linux-gnu -disable-objc-interop -I /home/buildnode/jenkins/workspace/oss-swift-incremental-RA-linux-ubuntu-15_10/Ninja-ReleaseAssert/swiftpm-linux-x86_64/lib/swift/pm -module-name Package -lPackageDescription

swift-build: error: Child process exited with signal

/home/buildnode/jenkins/workspace/oss-swift-incremental-RA-linux-ubuntu-15_10/swiftpm/Tests/Functional/TestMiscellaneous.swift:52: error: MiscellaneousTestCase.testManifestExcludes2 : failed - `swift build -c Debug' failed:

exit(1): /home/buildnode/jenkins/workspace/oss-swift-incremental-RA-linux-ubuntu-15_10/Ninja-ReleaseAssert/swiftpm-linux-x86_64/bin/swift-build --chdir /tmp/Miscellaneous_ExcludeDiagnostic2.lfxG9s/ExcludeDiagnostic2 --configuration debug

/home/buildnode/jenkins/workspace/oss-swift-incremental-RA-linux-ubuntu-15_10/swiftpm/Tests/Functional/TestMiscellaneous.swift:52: error: MiscellaneousTestCase.testManifestExcludes2 : failed - `swift build -c Release' failed:

exit(1): /home/buildnode/jenkins/workspace/oss-swift-incremental-RA-linux-ubuntu-15_10/Ninja-ReleaseAssert/swiftpm-linux-x86_64/bin/swift-build --chdir /tmp/Miscellaneous_ExcludeDiagnostic2.lfxG9s/ExcludeDiagnostic2 --configuration release

/home/buildnode/jenkins/workspace/oss-swift-incremental-RA-linux-ubuntu-15_10/swiftpm/Tests/Functional/TestMiscellaneous.swift:53: error: MiscellaneousTestCase.testManifestExcludes2 : failed - Expected file doesn’t exist: /tmp/Miscellaneous_ExcludeDiagnostic2.lfxG9s/ExcludeDiagnostic2/.build/debug/BarLib.swiftmodule
/home/buildnode/jenkins/workspace/oss-swift-incremental-RA-linux-ubuntu-15_10/swiftpm/Tests/Functional/TestMiscellaneous.swift:54: error: MiscellaneousTestCase.testManifestExcludes2 : failed - Expected file doesn’t exist: /tmp/Miscellaneous_ExcludeDiagnostic2.lfxG9s/ExcludeDiagnostic2/.build/debug/FooBarLib.swiftmodule
Test Case 'MiscellaneousTestCase.testManifestExcludes2' failed (0.366 seconds).
Test Case 'MiscellaneousTestCase.testManifestExcludes3' started.
    Building Debug
0 swift 0x00000000031373f8 llvm::sys::PrintStackTrace(llvm::raw_ostream&) + 40
1 swift 0x0000000003135bf6 llvm::sys::RunSignalHandlers() + 54
2 swift 0x0000000003137f26
3 libpthread.so.0 0x00007f823bdc7d10
4 libswiftCore.so 0x00007f8238d159b4 _TTSg5Vs5UInt8___TFSa37_appendElementAssumeUniqueAndCapacityfTSi10newElementx_T_ + 100
5 libPackageDescription.so 0x00007f82391937c9 _TFC18PackageDescription7PackagecfT4nameGSqSS_7targetsGSaCS_6Target_12dependenciesGSaCS0_10Dependency_16testDependenciesGSaS2__7excludeGSaSS__S0_ + 921
6 libPackageDescription.so 0x00007f8239193e08 _TFC18PackageDescription7PackageCfT4nameGSqSS_7targetsGSaCS_6Target_12dependenciesGSaCS0_10Dependency_16testDependenciesGSaS2__7excludeGSaSS__S0_ + 152
7 libPackageDescription.so 0x00007f823c034164 _TFC18PackageDescription7PackageCfT4nameGSqSS_7targetsGSaCS_6Target_12dependenciesGSaCS0_10Dependency_16testDependenciesGSaS2__7excludeGSaSS__S0_ + 48890868
8 swift 0x0000000000d089a4 llvm::MCJIT::runFunction(llvm::Function*, llvm::ArrayRef<llvm::GenericValue>) + 996
9 swift 0x0000000000d0c01f llvm::ExecutionEngine::runFunctionAsMain(llvm::Function*, std::vector<std::__cxx11::basic_string<char, std::char_traits<char>, std::allocator<char> >, std::allocator<std::__cxx11::basic_string<char, std::char_traits<char>, std::allocator<char> > > > const&, char const* const*) + 1263
10 swift 0x0000000000bf3318 swift::RunImmediately(swift::CompilerInstance&, std::vector<std::__cxx11::basic_string<char, std::char_traits<char>, std::allocator<char> >, std::allocator<std::__cxx11::basic_string<char, std::char_traits<char>, std::allocator<char> > > > const&, swift::IRGenOptions&, swift::SILOptions const&) + 2296
11 swift 0x0000000000789502
12 swift 0x0000000000784a73 frontend_main(llvm::ArrayRef<char const*>, char const*, void*) + 2643
13 swift 0x0000000000780056 main + 2518
14 libc.so.6 0x00007f823a6faa40 __libc_start_main + 240
15 swift 0x000000000077f579 _start + 41
Stack dump:
0. Program arguments: /home/buildnode/jenkins/workspace/oss-swift-incremental-RA-linux-ubuntu-15_10/Ninja-ReleaseAssert/swift-linux-x86_64/bin/swift -frontend -interpret /tmp/Miscellaneous_ExcludeDiagnostic3.btAKwS/App/Package.swift -target x86_64-unknown-linux-gnu -disable-objc-interop -I /home/buildnode/jenkins/workspace/oss-swift-incremental-RA-linux-ubuntu-15_10/Ninja-ReleaseAssert/swiftpm-linux-x86_64/lib/swift/pm -module-name Package -lPackageDescription

swift-build: error: Child process exited with signal

    Building Release
0 swift 0x00000000031373f8 llvm::sys::PrintStackTrace(llvm::raw_ostream&) + 40
1 swift 0x0000000003135bf6 llvm::sys::RunSignalHandlers() + 54
2 swift 0x0000000003137f26
3 libpthread.so.0 0x00007f5c82bb0d10
4 libswiftCore.so 0x00007f5c7fafe9b4 _TTSg5Vs5UInt8___TFSa37_appendElementAssumeUniqueAndCapacityfTSi10newElementx_T_ + 100
5 libPackageDescription.so 0x00007f5c7ff7c7c9 _TFC18PackageDescription7PackagecfT4nameGSqSS_7targetsGSaCS_6Target_12dependenciesGSaCS0_10Dependency_16testDependenciesGSaS2__7excludeGSaSS__S0_ + 921
6 libPackageDescription.so 0x00007f5c7ff7ce08 _TFC18PackageDescription7PackageCfT4nameGSqSS_7targetsGSaCS_6Target_12dependenciesGSaCS0_10Dependency_16testDependenciesGSaS2__7excludeGSaSS__S0_ + 152
7 libPackageDescription.so 0x00007f5c82e1d164 _TFC18PackageDescription7PackageCfT4nameGSqSS_7targetsGSaCS_6Target_12dependenciesGSaCS0_10Dependency_16testDependenciesGSaS2__7excludeGSaSS__S0_ + 48890868
8 swift 0x0000000000d089a4 llvm::MCJIT::runFunction(llvm::Function*, llvm::ArrayRef<llvm::GenericValue>) + 996
9 swift 0x0000000000d0c01f llvm::ExecutionEngine::runFunctionAsMain(llvm::Function*, std::vector<std::__cxx11::basic_string<char, std::char_traits<char>, std::allocator<char> >, std::allocator<std::__cxx11::basic_string<char, std::char_traits<char>, std::allocator<char> > > > const&, char const* const*) + 1263
10 swift 0x0000000000bf3318 swift::RunImmediately(swift::CompilerInstance&, std::vector<std::__cxx11::basic_string<char, std::char_traits<char>, std::allocator<char> >, std::allocator<std::__cxx11::basic_string<char, std::char_traits<char>, std::allocator<char> > > > const&, swift::IRGenOptions&, swift::SILOptions const&) + 2296
11 swift 0x0000000000789502
12 swift 0x0000000000784a73 frontend_main(llvm::ArrayRef<char const*>, char const*, void*) + 2643
13 swift 0x0000000000780056 main + 2518
14 libc.so.6 0x00007f5c814e3a40 __libc_start_main + 240
15 swift 0x000000000077f579 _start + 41
Stack dump:
0. Program arguments: /home/buildnode/jenkins/workspace/oss-swift-incremental-RA-linux-ubuntu-15_10/Ninja-ReleaseAssert/swift-linux-x86_64/bin/swift -frontend -interpret /tmp/Miscellaneous_ExcludeDiagnostic3.btAKwS/App/Package.swift -target x86_64-unknown-linux-gnu -disable-objc-interop -I /home/buildnode/jenkins/workspace/oss-swift-incremental-RA-linux-ubuntu-15_10/Ninja-ReleaseAssert/swiftpm-linux-x86_64/lib/swift/pm -module-name Package -lPackageDescription

swift-build: error: Child process exited with signal

/home/buildnode/jenkins/workspace/oss-swift-incremental-RA-linux-ubuntu-15_10/swiftpm/Tests/Functional/TestMiscellaneous.swift:65: error: MiscellaneousTestCase.testManifestExcludes3 : failed - `swift build -c Debug' failed:

exit(1): /home/buildnode/jenkins/workspace/oss-swift-incremental-RA-linux-ubuntu-15_10/Ninja-ReleaseAssert/swiftpm-linux-x86_64/bin/swift-build --chdir /tmp/Miscellaneous_ExcludeDiagnostic3.btAKwS/App --configuration debug

/home/buildnode/jenkins/workspace/oss-swift-incremental-RA-linux-ubuntu-15_10/swiftpm/Tests/Functional/TestMiscellaneous.swift:65: error: MiscellaneousTestCase.testManifestExcludes3 : failed - `swift build -c Release' failed:

exit(1): /home/buildnode/jenkins/workspace/oss-swift-incremental-RA-linux-ubuntu-15_10/Ninja-ReleaseAssert/swiftpm-linux-x86_64/bin/swift-build --chdir /tmp/Miscellaneous_ExcludeDiagnostic3.btAKwS/App --configuration release

/home/buildnode/jenkins/workspace/oss-swift-incremental-RA-linux-ubuntu-15_10/swiftpm/Tests/Functional/TestMiscellaneous.swift:66: error: MiscellaneousTestCase.testManifestExcludes3 : failed - Expected file doesn’t exist: /tmp/Miscellaneous_ExcludeDiagnostic3.btAKwS/App/.build/debug/App
/home/buildnode/jenkins/workspace/oss-swift-incremental-RA-linux-ubuntu-15_10/swiftpm/Tests/Functional/TestMiscellaneous.swift:67: error: MiscellaneousTestCase.testManifestExcludes3 : failed - Expected file doesn’t exist: /tmp/Miscellaneous_ExcludeDiagnostic3.btAKwS/App/.build/debug/top
/home/buildnode/jenkins/workspace/oss-swift-incremental-RA-linux-ubuntu-15_10/swiftpm/Tests/Functional/TestMiscellaneous.swift:68: error: MiscellaneousTestCase.testManifestExcludes3 : failed - Expected file doesn’t exist: /tmp/Miscellaneous_ExcludeDiagnostic3.btAKwS/App/.build/debug/bottom.swiftmodule
Test Case 'MiscellaneousTestCase.testManifestExcludes3' failed (0.391 seconds).
Test Case 'MiscellaneousTestCase.testTestDependenciesSimple' started.
Test Case 'MiscellaneousTestCase.testTestDependenciesSimple' passed (0.0 seconds).
Test Case 'MiscellaneousTestCase.testTestDependenciesComplex' started.
Test Case 'MiscellaneousTestCase.testTestDependenciesComplex' passed (0.0 seconds).
Test Case 'MiscellaneousTestCase.testPassExactDependenciesToBuildCommand' started.
    Building Debug
0 swift 0x00000000031373f8 llvm::sys::PrintStackTrace(llvm::raw_ostream&) + 40
1 swift 0x0000000003135bf6 llvm::sys::RunSignalHandlers() + 54
2 swift 0x0000000003137f26
3 libpthread.so.0 0x00007f7b715c5d10
4 libswiftCore.so 0x00007f7b6e5139b4 _TTSg5Vs5UInt8___TFSa37_appendElementAssumeUniqueAndCapacityfTSi10newElementx_T_ + 100
5 libPackageDescription.so 0x00007f7b6e9917c9 _TFC18PackageDescription7PackagecfT4nameGSqSS_7targetsGSaCS_6Target_12dependenciesGSaCS0_10Dependency_16testDependenciesGSaS2__7excludeGSaSS__S0_ + 921
6 libPackageDescription.so 0x00007f7b6e991e08 _TFC18PackageDescription7PackageCfT4nameGSqSS_7targetsGSaCS_6Target_12dependenciesGSaCS0_10Dependency_16testDependenciesGSaS2__7excludeGSaSS__S0_ + 152
7 libPackageDescription.so 0x00007f7b71832164 _TFC18PackageDescription7PackageCfT4nameGSqSS_7targetsGSaCS_6Target_12dependenciesGSaCS0_10Dependency_16testDependenciesGSaS2__7excludeGSaSS__S0_ + 48890868
8 swift 0x0000000000d089a4 llvm::MCJIT::runFunction(llvm::Function*, llvm::ArrayRef<llvm::GenericValue>) + 996
9 swift 0x0000000000d0c01f llvm::ExecutionEngine::runFunctionAsMain(llvm::Function*, std::vector<std::__cxx11::basic_string<char, std::char_traits<char>, std::allocator<char> >, std::allocator<std::__cxx11::basic_string<char, std::char_traits<char>, std::allocator<char> > > > const&, char const* const*) + 1263
10 swift 0x0000000000bf3318 swift::RunImmediately(swift::CompilerInstance&, std::vector<std::__cxx11::basic_string<char, std::char_traits<char>, std::allocator<char> >, std::allocator<std::__cxx11::basic_string<char, std::char_traits<char>, std::allocator<char> > > > const&, swift::IRGenOptions&, swift::SILOptions const&) + 2296
11 swift 0x0000000000789502
12 swift 0x0000000000784a73 frontend_main(llvm::ArrayRef<char const*>, char const*, void*) + 2643
13 swift 0x0000000000780056 main + 2518
14 libc.so.6 0x00007f7b6fef8a40 __libc_start_main + 240
15 swift 0x000000000077f579 _start + 41
Stack dump:
0. Program arguments: /home/buildnode/jenkins/workspace/oss-swift-incremental-RA-linux-ubuntu-15_10/Ninja-ReleaseAssert/swift-linux-x86_64/bin/swift -frontend -interpret /tmp/Miscellaneous_ExactDependencies.7ltG0i/app/Package.swift -target x86_64-unknown-linux-gnu -disable-objc-interop -I /home/buildnode/jenkins/workspace/oss-swift-incremental-RA-linux-ubuntu-15_10/Ninja-ReleaseAssert/swiftpm-linux-x86_64/lib/swift/pm -module-name Package -lPackageDescription

swift-build: error: Child process exited with signal

    Building Release
0 swift 0x00000000031373f8 llvm::sys::PrintStackTrace(llvm::raw_ostream&) + 40
1 swift 0x0000000003135bf6 llvm::sys::RunSignalHandlers() + 54
2 swift 0x0000000003137f26
3 libpthread.so.0 0x00007f1d64ab4d10
4 libswiftCore.so 0x00007f1d61a029b4 _TTSg5Vs5UInt8___TFSa37_appendElementAssumeUniqueAndCapacityfTSi10newElementx_T_ + 100
5 libPackageDescription.so 0x00007f1d61e807c9 _TFC18PackageDescription7PackagecfT4nameGSqSS_7targetsGSaCS_6Target_12dependenciesGSaCS0_10Dependency_16testDependenciesGSaS2__7excludeGSaSS__S0_ + 921
6 libPackageDescription.so 0x00007f1d61e80e08 _TFC18PackageDescription7PackageCfT4nameGSqSS_7targetsGSaCS_6Target_12dependenciesGSaCS0_10Dependency_16testDependenciesGSaS2__7excludeGSaSS__S0_ + 152
7 libPackageDescription.so 0x00007f1d64d21164 _TFC18PackageDescription7PackageCfT4nameGSqSS_7targetsGSaCS_6Target_12dependenciesGSaCS0_10Dependency_16testDependenciesGSaS2__7excludeGSaSS__S0_ + 48890868
8 swift 0x0000000000d089a4 llvm::MCJIT::runFunction(llvm::Function*, llvm::ArrayRef<llvm::GenericValue>) + 996
9 swift 0x0000000000d0c01f llvm::ExecutionEngine::runFunctionAsMain(llvm::Function*, std::vector<std::__cxx11::basic_string<char, std::char_traits<char>, std::allocator<char> >, std::allocator<std::__cxx11::basic_string<char, std::char_traits<char>, std::allocator<char> > > > const&, char const* const*) + 1263
10 swift 0x0000000000bf3318 swift::RunImmediately(swift::CompilerInstance&, std::vector<std::__cxx11::basic_string<char, std::char_traits<char>, std::allocator<char> >, std::allocator<std::__cxx11::basic_string<char, std::char_traits<char>, std::allocator<char> > > > const&, swift::IRGenOptions&, swift::SILOptions const&) + 2296
11 swift 0x0000000000789502
12 swift 0x0000000000784a73 frontend_main(llvm::ArrayRef<char const*>, char const*, void*) + 2643
13 swift 0x0000000000780056 main + 2518
14 libc.so.6 0x00007f1d633e7a40 __libc_start_main + 240
15 swift 0x000000000077f579 _start + 41
Stack dump:
0. Program arguments: /home/buildnode/jenkins/workspace/oss-swift-incremental-RA-linux-ubuntu-15_10/Ninja-ReleaseAssert/swift-linux-x86_64/bin/swift -frontend -interpret /tmp/Miscellaneous_ExactDependencies.7ltG0i/app/Package.swift -target x86_64-unknown-linux-gnu -disable-objc-interop -I /home/buildnode/jenkins/workspace/oss-swift-incremental-RA-linux-ubuntu-15_10/Ninja-ReleaseAssert/swiftpm-linux-x86_64/lib/swift/pm -module-name Package -lPackageDescription

swift-build: error: Child process exited with signal

/home/buildnode/jenkins/workspace/oss-swift-incremental-RA-linux-ubuntu-15_10/swiftpm/Tests/Functional/TestMiscellaneous.swift:116: error: MiscellaneousTestCase.testPassExactDependenciesToBuildCommand : failed - `swift build -c Debug' failed:

exit(1): /home/buildnode/jenkins/workspace/oss-swift-incremental-RA-linux-ubuntu-15_10/Ninja-ReleaseAssert/swiftpm-linux-x86_64/bin/swift-build --chdir /tmp/Miscellaneous_ExactDependencies.7ltG0i/app --configuration debug

/home/buildnode/jenkins/workspace/oss-swift-incremental-RA-linux-ubuntu-15_10/swiftpm/Tests/Functional/TestMiscellaneous.swift:116: error: MiscellaneousTestCase.testPassExactDependenciesToBuildCommand : failed - `swift build -c Release' failed:

exit(1): /home/buildnode/jenkins/workspace/oss-swift-incremental-RA-linux-ubuntu-15_10/Ninja-ReleaseAssert/swiftpm-linux-x86_64/bin/swift-build --chdir /tmp/Miscellaneous_ExactDependencies.7ltG0i/app --configuration release

/home/buildnode/jenkins/workspace/oss-swift-incremental-RA-linux-ubuntu-15_10/swiftpm/Tests/Functional/TestMiscellaneous.swift:117: error: MiscellaneousTestCase.testPassExactDependenciesToBuildCommand : failed - Expected file doesn’t exist: /tmp/Miscellaneous_ExactDependencies.7ltG0i/app/.build/debug/FooExec
/home/buildnode/jenkins/workspace/oss-swift-incremental-RA-linux-ubuntu-15_10/swiftpm/Tests/Functional/TestMiscellaneous.swift:118: error: MiscellaneousTestCase.testPassExactDependenciesToBuildCommand : failed - Expected file doesn’t exist: /tmp/Miscellaneous_ExactDependencies.7ltG0i/app/.build/debug/FooLib1.swiftmodule
/home/buildnode/jenkins/workspace/oss-swift-incremental-RA-linux-ubuntu-15_10/swiftpm/Tests/Functional/TestMiscellaneous.swift:119: error: MiscellaneousTestCase.testPassExactDependenciesToBuildCommand : failed - Expected file doesn’t exist: /tmp/Miscellaneous_ExactDependencies.7ltG0i/app/.build/debug/FooLib2.swiftmodule
Test Case 'MiscellaneousTestCase.testPassExactDependenciesToBuildCommand' failed (0.421 seconds).
Test Case 'MiscellaneousTestCase.testCanBuildMoreThanTwiceWithExternalDependencies' started.
    Building Debug
0 swift 0x00000000031373f8 llvm::sys::PrintStackTrace(llvm::raw_ostream&) + 40
1 swift 0x0000000003135bf6 llvm::sys::RunSignalHandlers() + 54
2 swift 0x0000000003137f26
3 libpthread.so.0 0x00007fa1c7cf0d10
4 libswiftCore.so 0x00007fa1c4c3e9b4 _TTSg5Vs5UInt8___TFSa37_appendElementAssumeUniqueAndCapacityfTSi10newElementx_T_ + 100
5 libPackageDescription.so 0x00007fa1c50bc7c9 _TFC18PackageDescription7PackagecfT4nameGSqSS_7targetsGSaCS_6Target_12dependenciesGSaCS0_10Dependency_16testDependenciesGSaS2__7excludeGSaSS__S0_ + 921
6 libPackageDescription.so 0x00007fa1c50bce08 _TFC18PackageDescription7PackageCfT4nameGSqSS_7targetsGSaCS_6Target_12dependenciesGSaCS0_10Dependency_16testDependenciesGSaS2__7excludeGSaSS__S0_ + 152
7 libPackageDescription.so 0x00007fa1c7f5d5e3 _TFC18PackageDescription7PackageCfT4nameGSqSS_7targetsGSaCS_6Target_12dependenciesGSaCS0_10Dependency_16testDependenciesGSaS2__7excludeGSaSS__S0_ + 48892019
8 swift 0x0000000000d089a4 llvm::MCJIT::runFunction(llvm::Function*, llvm::ArrayRef<llvm::GenericValue>) + 996
9 swift 0x0000000000d0c01f llvm::ExecutionEngine::runFunctionAsMain(llvm::Function*, std::vector<std::__cxx11::basic_string<char, std::char_traits<char>, std::allocator<char> >, std::allocator<std::__cxx11::basic_string<char, std::char_traits<char>, std::allocator<char> > > > const&, char const* const*) + 1263
10 swift 0x0000000000bf3318 swift::RunImmediately(swift::CompilerInstance&, std::vector<std::__cxx11::basic_string<char, std::char_traits<char>, std::allocator<char> >, std::allocator<std::__cxx11::basic_string<char, std::char_traits<char>, std::allocator<char> > > > const&, swift::IRGenOptions&, swift::SILOptions const&) + 2296
11 swift 0x0000000000789502
12 swift 0x0000000000784a73 frontend_main(llvm::ArrayRef<char const*>, char const*, void*) + 2643
13 swift 0x0000000000780056 main + 2518
14 libc.so.6 0x00007fa1c6623a40 __libc_start_main + 240
15 swift 0x000000000077f579 _start + 41
Stack dump:
0. Program arguments: /home/buildnode/jenkins/workspace/oss-swift-incremental-RA-linux-ubuntu-15_10/Ninja-ReleaseAssert/swift-linux-x86_64/bin/swift -frontend -interpret /tmp/DependencyResolution_External_Complex.3ENFGK/app/Package.swift -target x86_64-unknown-linux-gnu -disable-objc-interop -I /home/buildnode/jenkins/workspace/oss-swift-incremental-RA-linux-ubuntu-15_10/Ninja-ReleaseAssert/swiftpm-linux-x86_64/lib/swift/pm -module-name Package -lPackageDescription

swift-build: error: Child process exited with signal

    Building Release
0 swift 0x00000000031373f8 llvm::sys::PrintStackTrace(llvm::raw_ostream&) + 40
1 swift 0x0000000003135bf6 llvm::sys::RunSignalHandlers() + 54
2 swift 0x0000000003137f26
3 libpthread.so.0 0x00007f86e2a2cd10
4 libswiftCore.so 0x00007f86df97a9b4 _TTSg5Vs5UInt8___TFSa37_appendElementAssumeUniqueAndCapacityfTSi10newElementx_T_ + 100
5 libPackageDescription.so 0x00007f86dfdf87c9 _TFC18PackageDescription7PackagecfT4nameGSqSS_7targetsGSaCS_6Target_12dependenciesGSaCS0_10Dependency_16testDependenciesGSaS2__7excludeGSaSS__S0_ + 921
6 libPackageDescription.so 0x00007f86dfdf8e08 _TFC18PackageDescription7PackageCfT4nameGSqSS_7targetsGSaCS_6Target_12dependenciesGSaCS0_10Dependency_16testDependenciesGSaS2__7excludeGSaSS__S0_ + 152
7 libPackageDescription.so 0x00007f86e2c995e3 _TFC18PackageDescription7PackageCfT4nameGSqSS_7targetsGSaCS_6Target_12dependenciesGSaCS0_10Dependency_16testDependenciesGSaS2__7excludeGSaSS__S0_ + 48892019
8 swift 0x0000000000d089a4 llvm::MCJIT::runFunction(llvm::Function*, llvm::ArrayRef<llvm::GenericValue>) + 996
9 swift 0x0000000000d0c01f llvm::ExecutionEngine::runFunctionAsMain(llvm::Function*, std::vector<std::__cxx11::basic_string<char, std::char_traits<char>, std::allocator<char> >, std::allocator<std::__cxx11::basic_string<char, std::char_traits<char>, std::allocator<char> > > > const&, char const* const*) + 1263
10 swift 0x0000000000bf3318 swift::RunImmediately(swift::CompilerInstance&, std::vector<std::__cxx11::basic_string<char, std::char_traits<char>, std::allocator<char> >, std::allocator<std::__cxx11::basic_string<char, std::char_traits<char>, std::allocator<char> > > > const&, swift::IRGenOptions&, swift::SILOptions const&) + 2296
11 swift 0x0000000000789502
12 swift 0x0000000000784a73 frontend_main(llvm::ArrayRef<char const*>, char const*, void*) + 2643
13 swift 0x0000000000780056 main + 2518
14 libc.so.6 0x00007f86e135fa40 __libc_start_main + 240
15 swift 0x000000000077f579 _start + 41
Stack dump:
0. Program arguments: /home/buildnode/jenkins/workspace/oss-swift-incremental-RA-linux-ubuntu-15_10/Ninja-ReleaseAssert/swift-linux-x86_64/bin/swift -frontend -interpret /tmp/DependencyResolution_External_Complex.3ENFGK/app/Package.swift -target x86_64-unknown-linux-gnu -disable-objc-interop -I /home/buildnode/jenkins/workspace/oss-swift-incremental-RA-linux-ubuntu-15_10/Ninja-ReleaseAssert/swiftpm-linux-x86_64/lib/swift/pm -module-name Package -lPackageDescription

swift-build: error: Child process exited with signal

    Building Debug
0 swift 0x00000000031373f8 llvm::sys::PrintStackTrace(llvm::raw_ostream&) + 40
1 swift 0x0000000003135bf6 llvm::sys::RunSignalHandlers() + 54
2 swift 0x0000000003137f26
3 libpthread.so.0 0x00007f4f9e0d3d10
4 libswiftCore.so 0x00007f4f9b0219b4 _TTSg5Vs5UInt8___TFSa37_appendElementAssumeUniqueAndCapacityfTSi10newElementx_T_ + 100
5 libPackageDescription.so 0x00007f4f9b49f7c9 _TFC18PackageDescription7PackagecfT4nameGSqSS_7targetsGSaCS_6Target_12dependenciesGSaCS0_10Dependency_16testDependenciesGSaS2__7excludeGSaSS__S0_ + 921
6 libPackageDescription.so 0x00007f4f9b49fe08 _TFC18PackageDescription7PackageCfT4nameGSqSS_7targetsGSaCS_6Target_12dependenciesGSaCS0_10Dependency_16testDependenciesGSaS2__7excludeGSaSS__S0_ + 152
7 libPackageDescription.so 0x00007f4f9e3405e3 _TFC18PackageDescription7PackageCfT4nameGSqSS_7targetsGSaCS_6Target_12dependenciesGSaCS0_10Dependency_16testDependenciesGSaS2__7excludeGSaSS__S0_ + 48892019
8 swift 0x0000000000d089a4 llvm::MCJIT::runFunction(llvm::Function*, llvm::ArrayRef<llvm::GenericValue>) + 996
9 swift 0x0000000000d0c01f llvm::ExecutionEngine::runFunctionAsMain(llvm::Function*, std::vector<std::__cxx11::basic_string<char, std::char_traits<char>, std::allocator<char> >, std::allocator<std::__cxx11::basic_string<char, std::char_traits<char>, std::allocator<char> > > > const&, char const* const*) + 1263
10 swift 0x0000000000bf3318 swift::RunImmediately(swift::CompilerInstance&, std::vector<std::__cxx11::basic_string<char, std::char_traits<char>, std::allocator<char> >, std::allocator<std::__cxx11::basic_string<char, std::char_traits<char>, std::allocator<char> > > > const&, swift::IRGenOptions&, swift::SILOptions const&) + 2296
11 swift 0x0000000000789502
12 swift 0x0000000000784a73 frontend_main(llvm::ArrayRef<char const*>, char const*, void*) + 2643
13 swift 0x0000000000780056 main + 2518
14 libc.so.6 0x00007f4f9ca06a40 __libc_start_main + 240
15 swift 0x000000000077f579 _start + 41
Stack dump:
0. Program arguments: /home/buildnode/jenkins/workspace/oss-swift-incremental-RA-linux-ubuntu-15_10/Ninja-ReleaseAssert/swift-linux-x86_64/bin/swift -frontend -interpret /tmp/DependencyResolution_External_Complex.3ENFGK/app/Package.swift -target x86_64-unknown-linux-gnu -disable-objc-interop -I /home/buildnode/jenkins/workspace/oss-swift-incremental-RA-linux-ubuntu-15_10/Ninja-ReleaseAssert/swiftpm-linux-x86_64/lib/swift/pm -module-name Package -lPackageDescription

swift-build: error: Child process exited with signal

    Building Release
0 swift 0x00000000031373f8 llvm::sys::PrintStackTrace(llvm::raw_ostream&) + 40
1 swift 0x0000000003135bf6 llvm::sys::RunSignalHandlers() + 54
2 swift 0x0000000003137f26
3 libpthread.so.0 0x00007f421fb9cd10
4 libswiftCore.so 0x00007f421caea9b4 _TTSg5Vs5UInt8___TFSa37_appendElementAssumeUniqueAndCapacityfTSi10newElementx_T_ + 100
5 libPackageDescription.so 0x00007f421cf687c9 _TFC18PackageDescription7PackagecfT4nameGSqSS_7targetsGSaCS_6Target_12dependenciesGSaCS0_10Dependency_16testDependenciesGSaS2__7excludeGSaSS__S0_ + 921
6 libPackageDescription.so 0x00007f421cf68e08 _TFC18PackageDescription7PackageCfT4nameGSqSS_7targetsGSaCS_6Target_12dependenciesGSaCS0_10Dependency_16testDependenciesGSaS2__7excludeGSaSS__S0_ + 152
7 libPackageDescription.so 0x00007f421fe095e3 _TFC18PackageDescription7PackageCfT4nameGSqSS_7targetsGSaCS_6Target_12dependenciesGSaCS0_10Dependency_16testDependenciesGSaS2__7excludeGSaSS__S0_ + 48892019
8 swift 0x0000000000d089a4 llvm::MCJIT::runFunction(llvm::Function*, llvm::ArrayRef<llvm::GenericValue>) + 996
9 swift 0x0000000000d0c01f llvm::ExecutionEngine::runFunctionAsMain(llvm::Function*, std::vector<std::__cxx11::basic_string<char, std::char_traits<char>, std::allocator<char> >, std::allocator<std::__cxx11::basic_string<char, std::char_traits<char>, std::allocator<char> > > > const&, char const* const*) + 1263
10 swift 0x0000000000bf3318 swift::RunImmediately(swift::CompilerInstance&, std::vector<std::__cxx11::basic_string<char, std::char_traits<char>, std::allocator<char> >, std::allocator<std::__cxx11::basic_string<char, std::char_traits<char>, std::allocator<char> > > > const&, swift::IRGenOptions&, swift::SILOptions const&) + 2296
11 swift 0x0000000000789502
12 swift 0x0000000000784a73 frontend_main(llvm::ArrayRef<char const*>, char const*, void*) + 2643
13 swift 0x0000000000780056 main + 2518
14 libc.so.6 0x00007f421e4cfa40 __libc_start_main + 240
15 swift 0x000000000077f579 _start + 41
Stack dump:
0. Program arguments: /home/buildnode/jenkins/workspace/oss-swift-incremental-RA-linux-ubuntu-15_10/Ninja-ReleaseAssert/swift-linux-x86_64/bin/swift -frontend -interpret /tmp/DependencyResolution_External_Complex.3ENFGK/app/Package.swift -target x86_64-unknown-linux-gnu -disable-objc-interop -I /home/buildnode/jenkins/workspace/oss-swift-incremental-RA-linux-ubuntu-15_10/Ninja-ReleaseAssert/swiftpm-linux-x86_64/lib/swift/pm -module-name Package -lPackageDescription

swift-build: error: Child process exited with signal

    Building Debug
0 swift 0x00000000031373f8 llvm::sys::PrintStackTrace(llvm::raw_ostream&) + 40
1 swift 0x0000000003135bf6 llvm::sys::RunSignalHandlers() + 54
2 swift 0x0000000003137f26
3 libpthread.so.0 0x00007f9cc6885d10
4 libswiftCore.so 0x00007f9cc37d39b4 _TTSg5Vs5UInt8___TFSa37_appendElementAssumeUniqueAndCapacityfTSi10newElementx_T_ + 100
5 libPackageDescription.so 0x00007f9cc3c517c9 _TFC18PackageDescription7PackagecfT4nameGSqSS_7targetsGSaCS_6Target_12dependenciesGSaCS0_10Dependency_16testDependenciesGSaS2__7excludeGSaSS__S0_ + 921
6 libPackageDescription.so 0x00007f9cc3c51e08 _TFC18PackageDescription7PackageCfT4nameGSqSS_7targetsGSaCS_6Target_12dependenciesGSaCS0_10Dependency_16testDependenciesGSaS2__7excludeGSaSS__S0_ + 152
7 libPackageDescription.so 0x00007f9cc6af25e3 _TFC18PackageDescription7PackageCfT4nameGSqSS_7targetsGSaCS_6Target_12dependenciesGSaCS0_10Dependency_16testDependenciesGSaS2__7excludeGSaSS__S0_ + 48892019
8 swift 0x0000000000d089a4 llvm::MCJIT::runFunction(llvm::Function*, llvm::ArrayRef<llvm::GenericValue>) + 996
9 swift 0x0000000000d0c01f llvm::ExecutionEngine::runFunctionAsMain(llvm::Function*, std::vector<std::__cxx11::basic_string<char, std::char_traits<char>, std::allocator<char> >, std::allocator<std::__cxx11::basic_string<char, std::char_traits<char>, std::allocator<char> > > > const&, char const* const*) + 1263
10 swift 0x0000000000bf3318 swift::RunImmediately(swift::CompilerInstance&, std::vector<std::__cxx11::basic_string<char, std::char_traits<char>, std::allocator<char> >, std::allocator<std::__cxx11::basic_string<char, std::char_traits<char>, std::allocator<char> > > > const&, swift::IRGenOptions&, swift::SILOptions const&) + 2296
11 swift 0x0000000000789502
12 swift 0x0000000000784a73 frontend_main(llvm::ArrayRef<char const*>, char const*, void*) + 2643
13 swift 0x0000000000780056 main + 2518
14 libc.so.6 0x00007f9cc51b8a40 __libc_start_main + 240
15 swift 0x000000000077f579 _start + 41
Stack dump:
0. Program arguments: /home/buildnode/jenkins/workspace/oss-swift-incremental-RA-linux-ubuntu-15_10/Ninja-ReleaseAssert/swift-linux-x86_64/bin/swift -frontend -interpret /tmp/DependencyResolution_External_Complex.3ENFGK/app/Package.swift -target x86_64-unknown-linux-gnu -disable-objc-interop -I /home/buildnode/jenkins/workspace/oss-swift-incremental-RA-linux-ubuntu-15_10/Ninja-ReleaseAssert/swiftpm-linux-x86_64/lib/swift/pm -module-name Package -lPackageDescription

swift-build: error: Child process exited with signal

    Building Release
0 swift 0x00000000031373f8 llvm::sys::PrintStackTrace(llvm::raw_ostream&) + 40
1 swift 0x0000000003135bf6 llvm::sys::RunSignalHandlers() + 54
2 swift 0x0000000003137f26
3 libpthread.so.0 0x00007fc3cc58dd10
4 libswiftCore.so 0x00007fc3c94db9b4 _TTSg5Vs5UInt8___TFSa37_appendElementAssumeUniqueAndCapacityfTSi10newElementx_T_ + 100
5 libPackageDescription.so 0x00007fc3c99597c9 _TFC18PackageDescription7PackagecfT4nameGSqSS_7targetsGSaCS_6Target_12dependenciesGSaCS0_10Dependency_16testDependenciesGSaS2__7excludeGSaSS__S0_ + 921
6 libPackageDescription.so 0x00007fc3c9959e08 _TFC18PackageDescription7PackageCfT4nameGSqSS_7targetsGSaCS_6Target_12dependenciesGSaCS0_10Dependency_16testDependenciesGSaS2__7excludeGSaSS__S0_ + 152
7 libPackageDescription.so 0x00007fc3cc7fa5e3 _TFC18PackageDescription7PackageCfT4nameGSqSS_7targetsGSaCS_6Target_12dependenciesGSaCS0_10Dependency_16testDependenciesGSaS2__7excludeGSaSS__S0_ + 48892019
8 swift 0x0000000000d089a4 llvm::MCJIT::runFunction(llvm::Function*, llvm::ArrayRef<llvm::GenericValue>) + 996
9 swift 0x0000000000d0c01f llvm::ExecutionEngine::runFunctionAsMain(llvm::Function*, std::vector<std::__cxx11::basic_string<char, std::char_traits<char>, std::allocator<char> >, std::allocator<std::__cxx11::basic_string<char, std::char_traits<char>, std::allocator<char> > > > const&, char const* const*) + 1263
10 swift 0x0000000000bf3318 swift::RunImmediately(swift::CompilerInstance&, std::vector<std::__cxx11::basic_string<char, std::char_traits<char>, std::allocator<char> >, std::allocator<std::__cxx11::basic_string<char, std::char_traits<char>, std::allocator<char> > > > const&, swift::IRGenOptions&, swift::SILOptions const&) + 2296
11 swift 0x0000000000789502
12 swift 0x0000000000784a73 frontend_main(llvm::ArrayRef<char const*>, char const*, void*) + 2643
13 swift 0x0000000000780056 main + 2518
14 libc.so.6 0x00007fc3caec0a40 __libc_start_main + 240
15 swift 0x000000000077f579 _start + 41
Stack dump:
0. Program arguments: /home/buildnode/jenkins/workspace/oss-swift-incremental-RA-linux-ubuntu-15_10/Ninja-ReleaseAssert/swift-linux-x86_64/bin/swift -frontend -interpret /tmp/DependencyResolution_External_Complex.3ENFGK/app/Package.swift -target x86_64-unknown-linux-gnu -disable-objc-interop -I /home/buildnode/jenkins/workspace/oss-swift-incremental-RA-linux-ubuntu-15_10/Ninja-ReleaseAssert/swiftpm-linux-x86_64/lib/swift/pm -module-name Package -lPackageDescription

swift-build: error: Child process exited with signal

/home/buildnode/jenkins/workspace/oss-swift-incremental-RA-linux-ubuntu-15_10/swiftpm/Tests/Functional/TestMiscellaneous.swift:130: error: MiscellaneousTestCase.testCanBuildMoreThanTwiceWithExternalDependencies : failed - `swift build -c Debug' failed:

exit(1): /home/buildnode/jenkins/workspace/oss-swift-incremental-RA-linux-ubuntu-15_10/Ninja-ReleaseAssert/swiftpm-linux-x86_64/bin/swift-build --chdir /tmp/DependencyResolution_External_Complex.3ENFGK/app --configuration debug

/home/buildnode/jenkins/workspace/oss-swift-incremental-RA-linux-ubuntu-15_10/swiftpm/Tests/Functional/TestMiscellaneous.swift:130: error: MiscellaneousTestCase.testCanBuildMoreThanTwiceWithExternalDependencies : failed - `swift build -c Release' failed:

exit(1): /home/buildnode/jenkins/workspace/oss-swift-incremental-RA-linux-ubuntu-15_10/Ninja-ReleaseAssert/swiftpm-linux-x86_64/bin/swift-build --chdir /tmp/DependencyResolution_External_Complex.3ENFGK/app --configuration release

/home/buildnode/jenkins/workspace/oss-swift-incremental-RA-linux-ubuntu-15_10/swiftpm/Tests/Functional/TestMiscellaneous.swift:131: error: MiscellaneousTestCase.testCanBuildMoreThanTwiceWithExternalDependencies : failed - `swift build -c Debug' failed:

exit(1): /home/buildnode/jenkins/workspace/oss-swift-incremental-RA-linux-ubuntu-15_10/Ninja-ReleaseAssert/swiftpm-linux-x86_64/bin/swift-build --chdir /tmp/DependencyResolution_External_Complex.3ENFGK/app --configuration debug

/home/buildnode/jenkins/workspace/oss-swift-incremental-RA-linux-ubuntu-15_10/swiftpm/Tests/Functional/TestMiscellaneous.swift:131: error: MiscellaneousTestCase.testCanBuildMoreThanTwiceWithExternalDependencies : failed - `swift build -c Release' failed:

exit(1): /home/buildnode/jenkins/workspace/oss-swift-incremental-RA-linux-ubuntu-15_10/Ninja-ReleaseAssert/swiftpm-linux-x86_64/bin/swift-build --chdir /tmp/DependencyResolution_External_Complex.3ENFGK/app --configuration release

/home/buildnode/jenkins/workspace/oss-swift-incremental-RA-linux-ubuntu-15_10/swiftpm/Tests/Functional/TestMiscellaneous.swift:132: error: MiscellaneousTestCase.testCanBuildMoreThanTwiceWithExternalDependencies : failed - `swift build -c Debug' failed:

exit(1): /home/buildnode/jenkins/workspace/oss-swift-incremental-RA-linux-ubuntu-15_10/Ninja-ReleaseAssert/swiftpm-linux-x86_64/bin/swift-build --chdir /tmp/DependencyResolution_External_Complex.3ENFGK/app --configuration debug

/home/buildnode/jenkins/workspace/oss-swift-incremental-RA-linux-ubuntu-15_10/swiftpm/Tests/Functional/TestMiscellaneous.swift:132: error: MiscellaneousTestCase.testCanBuildMoreThanTwiceWithExternalDependencies : failed - `swift build -c Release' failed:

exit(1): /home/buildnode/jenkins/workspace/oss-swift-incremental-RA-linux-ubuntu-15_10/Ninja-ReleaseAssert/swiftpm-linux-x86_64/bin/swift-build --chdir /tmp/DependencyResolution_External_Complex.3ENFGK/app --configuration release

Test Case 'MiscellaneousTestCase.testCanBuildMoreThanTwiceWithExternalDependencies' failed (1.231 seconds).
Test Case 'MiscellaneousTestCase.testNoArgumentsExitsWithOne' started.
Test Case 'MiscellaneousTestCase.testNoArgumentsExitsWithOne' passed (0.006 seconds).
Test Case 'MiscellaneousTestCase.testCompileFailureExitsGracefully' started.
Test Case 'MiscellaneousTestCase.testCompileFailureExitsGracefully' passed (0.347 seconds).
Test Case 'MiscellaneousTestCase.testDependenciesWithVPrefixTagsWork' started.
    Building Debug
0 swift 0x00000000031373f8 llvm::sys::PrintStackTrace(llvm::raw_ostream&) + 40
1 swift 0x0000000003135bf6 llvm::sys::RunSignalHandlers() + 54
2 swift 0x0000000003137f26
3 libpthread.so.0 0x00007f0e40e07d10
4 libswiftCore.so 0x00007f0e3dd559b4 _TTSg5Vs5UInt8___TFSa37_appendElementAssumeUniqueAndCapacityfTSi10newElementx_T_ + 100
5 libPackageDescription.so 0x00007f0e3e1d37c9 _TFC18PackageDescription7PackagecfT4nameGSqSS_7targetsGSaCS_6Target_12dependenciesGSaCS0_10Dependency_16testDependenciesGSaS2__7excludeGSaSS__S0_ + 921
6 libPackageDescription.so 0x00007f0e3e1d3e08 _TFC18PackageDescription7PackageCfT4nameGSqSS_7targetsGSaCS_6Target_12dependenciesGSaCS0_10Dependency_16testDependenciesGSaS2__7excludeGSaSS__S0_ + 152
7 libPackageDescription.so 0x00007f0e410745e3 _TFC18PackageDescription7PackageCfT4nameGSqSS_7targetsGSaCS_6Target_12dependenciesGSaCS0_10Dependency_16testDependenciesGSaS2__7excludeGSaSS__S0_ + 48892019
8 swift 0x0000000000d089a4 llvm::MCJIT::runFunction(llvm::Function*, llvm::ArrayRef<llvm::GenericValue>) + 996
9 swift 0x0000000000d0c01f llvm::ExecutionEngine::runFunctionAsMain(llvm::Function*, std::vector<std::__cxx11::basic_string<char, std::char_traits<char>, std::allocator<char> >, std::allocator<std::__cxx11::basic_string<char, std::char_traits<char>, std::allocator<char> > > > const&, char const* const*) + 1263
10 swift 0x0000000000bf3318 swift::RunImmediately(swift::CompilerInstance&, std::vector<std::__cxx11::basic_string<char, std::char_traits<char>, std::allocator<char> >, std::allocator<std::__cxx11::basic_string<char, std::char_traits<char>, std::allocator<char> > > > const&, swift::IRGenOptions&, swift::SILOptions const&) + 2296
11 swift 0x0000000000789502
12 swift 0x0000000000784a73 frontend_main(llvm::ArrayRef<char const*>, char const*, void*) + 2643
13 swift 0x0000000000780056 main + 2518
14 libc.so.6 0x00007f0e3f73aa40 __libc_start_main + 240
15 swift 0x000000000077f579 _start + 41
Stack dump:
0. Program arguments: /home/buildnode/jenkins/workspace/oss-swift-incremental-RA-linux-ubuntu-15_10/Ninja-ReleaseAssert/swift-linux-x86_64/bin/swift -frontend -interpret /tmp/DependencyResolution_External_Complex.5Mtg3L/app/Package.swift -target x86_64-unknown-linux-gnu -disable-objc-interop -I /home/buildnode/jenkins/workspace/oss-swift-incremental-RA-linux-ubuntu-15_10/Ninja-ReleaseAssert/swiftpm-linux-x86_64/lib/swift/pm -module-name Package -lPackageDescription

swift-build: error: Child process exited with signal

    Building Release
0 swift 0x00000000031373f8 llvm::sys::PrintStackTrace(llvm::raw_ostream&) + 40
1 swift 0x0000000003135bf6 llvm::sys::RunSignalHandlers() + 54
2 swift 0x0000000003137f26
3 libpthread.so.0 0x00007fb3477ead10
4 libswiftCore.so 0x00007fb3447389b4 _TTSg5Vs5UInt8___TFSa37_appendElementAssumeUniqueAndCapacityfTSi10newElementx_T_ + 100
5 libPackageDescription.so 0x00007fb344bb67c9 _TFC18PackageDescription7PackagecfT4nameGSqSS_7targetsGSaCS_6Target_12dependenciesGSaCS0_10Dependency_16testDependenciesGSaS2__7excludeGSaSS__S0_ + 921
6 libPackageDescription.so 0x00007fb344bb6e08 _TFC18PackageDescription7PackageCfT4nameGSqSS_7targetsGSaCS_6Target_12dependenciesGSaCS0_10Dependency_16testDependenciesGSaS2__7excludeGSaSS__S0_ + 152
7 libPackageDescription.so 0x00007fb347a575e3 _TFC18PackageDescription7PackageCfT4nameGSqSS_7targetsGSaCS_6Target_12dependenciesGSaCS0_10Dependency_16testDependenciesGSaS2__7excludeGSaSS__S0_ + 48892019
8 swift 0x0000000000d089a4 llvm::MCJIT::runFunction(llvm::Function*, llvm::ArrayRef<llvm::GenericValue>) + 996
9 swift 0x0000000000d0c01f llvm::ExecutionEngine::runFunctionAsMain(llvm::Function*, std::vector<std::__cxx11::basic_string<char, std::char_traits<char>, std::allocator<char> >, std::allocator<std::__cxx11::basic_string<char, std::char_traits<char>, std::allocator<char> > > > const&, char const* const*) + 1263
10 swift 0x0000000000bf3318 swift::RunImmediately(swift::CompilerInstance&, std::vector<std::__cxx11::basic_string<char, std::char_traits<char>, std::allocator<char> >, std::allocator<std::__cxx11::basic_string<char, std::char_traits<char>, std::allocator<char> > > > const&, swift::IRGenOptions&, swift::SILOptions const&) + 2296
11 swift 0x0000000000789502
12 swift 0x0000000000784a73 frontend_main(llvm::ArrayRef<char const*>, char const*, void*) + 2643
13 swift 0x0000000000780056 main + 2518
14 libc.so.6 0x00007fb34611da40 __libc_start_main + 240
15 swift 0x000000000077f579 _start + 41
Stack dump:
0. Program arguments: /home/buildnode/jenkins/workspace/oss-swift-incremental-RA-linux-ubuntu-15_10/Ninja-ReleaseAssert/swift-linux-x86_64/bin/swift -frontend -interpret /tmp/DependencyResolution_External_Complex.5Mtg3L/app/Package.swift -target x86_64-unknown-linux-gnu -disable-objc-interop -I /home/buildnode/jenkins/workspace/oss-swift-incremental-RA-linux-ubuntu-15_10/Ninja-ReleaseAssert/swiftpm-linux-x86_64/lib/swift/pm -module-name Package -lPackageDescription

swift-build: error: Child process exited with signal

/home/buildnode/jenkins/workspace/oss-swift-incremental-RA-linux-ubuntu-15_10/swiftpm/Tests/Functional/TestMiscellaneous.swift:138: error: MiscellaneousTestCase.testDependenciesWithVPrefixTagsWork : failed - `swift build -c Debug' failed:

exit(1): /home/buildnode/jenkins/workspace/oss-swift-incremental-RA-linux-ubuntu-15_10/Ninja-ReleaseAssert/swiftpm-linux-x86_64/bin/swift-build --chdir /tmp/DependencyResolution_External_Complex.5Mtg3L/app --configuration debug

/home/buildnode/jenkins/workspace/oss-swift-incremental-RA-linux-ubuntu-15_10/swiftpm/Tests/Functional/TestMiscellaneous.swift:138: error: MiscellaneousTestCase.testDependenciesWithVPrefixTagsWork : failed - `swift build -c Release' failed:

exit(1): /home/buildnode/jenkins/workspace/oss-swift-incremental-RA-linux-ubuntu-15_10/Ninja-ReleaseAssert/swiftpm-linux-x86_64/bin/swift-build --chdir /tmp/DependencyResolution_External_Complex.5Mtg3L/app --configuration release

Test Case 'MiscellaneousTestCase.testDependenciesWithVPrefixTagsWork' failed (0.459 seconds).
Test Case 'MiscellaneousTestCase.testCanBuildIfADependencyAlreadyCheckedOut' started.
    Building Debug
0 swift 0x00000000031373f8 llvm::sys::PrintStackTrace(llvm::raw_ostream&) + 40
1 swift 0x0000000003135bf6 llvm::sys::RunSignalHandlers() + 54
2 swift 0x0000000003137f26
3 libpthread.so.0 0x00007fdca98e6d10
4 libswiftCore.so 0x00007fdca68349b4 _TTSg5Vs5UInt8___TFSa37_appendElementAssumeUniqueAndCapacityfTSi10newElementx_T_ + 100
5 libPackageDescription.so 0x00007fdca6cb27c9 _TFC18PackageDescription7PackagecfT4nameGSqSS_7targetsGSaCS_6Target_12dependenciesGSaCS0_10Dependency_16testDependenciesGSaS2__7excludeGSaSS__S0_ + 921
6 libPackageDescription.so 0x00007fdca6cb2e08 _TFC18PackageDescription7PackageCfT4nameGSqSS_7targetsGSaCS_6Target_12dependenciesGSaCS0_10Dependency_16testDependenciesGSaS2__7excludeGSaSS__S0_ + 152
7 libPackageDescription.so 0x00007fdca9b535e3 _TFC18PackageDescription7PackageCfT4nameGSqSS_7targetsGSaCS_6Target_12dependenciesGSaCS0_10Dependency_16testDependenciesGSaS2__7excludeGSaSS__S0_ + 48892019
8 swift 0x0000000000d089a4 llvm::MCJIT::runFunction(llvm::Function*, llvm::ArrayRef<llvm::GenericValue>) + 996
9 swift 0x0000000000d0c01f llvm::ExecutionEngine::runFunctionAsMain(llvm::Function*, std::vector<std::__cxx11::basic_string<char, std::char_traits<char>, std::allocator<char> >, std::allocator<std::__cxx11::basic_string<char, std::char_traits<char>, std::allocator<char> > > > const&, char const* const*) + 1263
10 swift 0x0000000000bf3318 swift::RunImmediately(swift::CompilerInstance&, std::vector<std::__cxx11::basic_string<char, std::char_traits<char>, std::allocator<char> >, std::allocator<std::__cxx11::basic_string<char, std::char_traits<char>, std::allocator<char> > > > const&, swift::IRGenOptions&, swift::SILOptions const&) + 2296
11 swift 0x0000000000789502
12 swift 0x0000000000784a73 frontend_main(llvm::ArrayRef<char const*>, char const*, void*) + 2643
13 swift 0x0000000000780056 main + 2518
14 libc.so.6 0x00007fdca8219a40 __libc_start_main + 240
15 swift 0x000000000077f579 _start + 41
Stack dump:
0. Program arguments: /home/buildnode/jenkins/workspace/oss-swift-incremental-RA-linux-ubuntu-15_10/Ninja-ReleaseAssert/swift-linux-x86_64/bin/swift -frontend -interpret /tmp/DependencyResolution_External_Complex.r6DWwj/app/Package.swift -target x86_64-unknown-linux-gnu -disable-objc-interop -I /home/buildnode/jenkins/workspace/oss-swift-incremental-RA-linux-ubuntu-15_10/Ninja-ReleaseAssert/swiftpm-linux-x86_64/lib/swift/pm -module-name Package -lPackageDescription

swift-build: error: Child process exited with signal

    Building Release
0 swift 0x00000000031373f8 llvm::sys::PrintStackTrace(llvm::raw_ostream&) + 40
1 swift 0x0000000003135bf6 llvm::sys::RunSignalHandlers() + 54
2 swift 0x0000000003137f26
3 libpthread.so.0 0x00007f0613fd9d10
4 libswiftCore.so 0x00007f0610f279b4 _TTSg5Vs5UInt8___TFSa37_appendElementAssumeUniqueAndCapacityfTSi10newElementx_T_ + 100
5 libPackageDescription.so 0x00007f06113a57c9 _TFC18PackageDescription7PackagecfT4nameGSqSS_7targetsGSaCS_6Target_12dependenciesGSaCS0_10Dependency_16testDependenciesGSaS2__7excludeGSaSS__S0_ + 921
6 libPackageDescription.so 0x00007f06113a5e08 _TFC18PackageDescription7PackageCfT4nameGSqSS_7targetsGSaCS_6Target_12dependenciesGSaCS0_10Dependency_16testDependenciesGSaS2__7excludeGSaSS__S0_ + 152
7 libPackageDescription.so 0x00007f06142465e3 _TFC18PackageDescription7PackageCfT4nameGSqSS_7targetsGSaCS_6Target_12dependenciesGSaCS0_10Dependency_16testDependenciesGSaS2__7excludeGSaSS__S0_ + 48892019
8 swift 0x0000000000d089a4 llvm::MCJIT::runFunction(llvm::Function*, llvm::ArrayRef<llvm::GenericValue>) + 996
9 swift 0x0000000000d0c01f llvm::ExecutionEngine::runFunctionAsMain(llvm::Function*, std::vector<std::__cxx11::basic_string<char, std::char_traits<char>, std::allocator<char> >, std::allocator<std::__cxx11::basic_string<char, std::char_traits<char>, std::allocator<char> > > > const&, char const* const*) + 1263
10 swift 0x0000000000bf3318 swift::RunImmediately(swift::CompilerInstance&, std::vector<std::__cxx11::basic_string<char, std::char_traits<char>, std::allocator<char> >, std::allocator<std::__cxx11::basic_string<char, std::char_traits<char>, std::allocator<char> > > > const&, swift::IRGenOptions&, swift::SILOptions const&) + 2296
11 swift 0x0000000000789502
12 swift 0x0000000000784a73 frontend_main(llvm::ArrayRef<char const*>, char const*, void*) + 2643
13 swift 0x0000000000780056 main + 2518
14 libc.so.6 0x00007f061290ca40 __libc_start_main + 240
15 swift 0x000000000077f579 _start + 41
Stack dump:
0. Program arguments: /home/buildnode/jenkins/workspace/oss-swift-incremental-RA-linux-ubuntu-15_10/Ninja-ReleaseAssert/swift-linux-x86_64/bin/swift -frontend -interpret /tmp/DependencyResolution_External_Complex.r6DWwj/app/Package.swift -target x86_64-unknown-linux-gnu -disable-objc-interop -I /home/buildnode/jenkins/workspace/oss-swift-incremental-RA-linux-ubuntu-15_10/Ninja-ReleaseAssert/swiftpm-linux-x86_64/lib/swift/pm -module-name Package -lPackageDescription

swift-build: error: Child process exited with signal

/home/buildnode/jenkins/workspace/oss-swift-incremental-RA-linux-ubuntu-15_10/swiftpm/Tests/Functional/TestMiscellaneous.swift:180: error: MiscellaneousTestCase.testCanBuildIfADependencyAlreadyCheckedOut : failed - `swift build -c Debug' failed:

exit(1): /home/buildnode/jenkins/workspace/oss-swift-incremental-RA-linux-ubuntu-15_10/Ninja-ReleaseAssert/swiftpm-linux-x86_64/bin/swift-build --chdir /tmp/DependencyResolution_External_Complex.r6DWwj/app --configuration debug

/home/buildnode/jenkins/workspace/oss-swift-incremental-RA-linux-ubuntu-15_10/swiftpm/Tests/Functional/TestMiscellaneous.swift:180: error: MiscellaneousTestCase.testCanBuildIfADependencyAlreadyCheckedOut : failed - `swift build -c Release' failed:

exit(1): /home/buildnode/jenkins/workspace/oss-swift-incremental-RA-linux-ubuntu-15_10/Ninja-ReleaseAssert/swiftpm-linux-x86_64/bin/swift-build --chdir /tmp/DependencyResolution_External_Complex.r6DWwj/app --configuration release

Test Case 'MiscellaneousTestCase.testCanBuildIfADependencyAlreadyCheckedOut' failed (0.474 seconds).
Test Case 'MiscellaneousTestCase.testCanBuildIfADependencyClonedButThenAborted' started.
    Building Debug
0 swift 0x00000000031373f8 llvm::sys::PrintStackTrace(llvm::raw_ostream&) + 40
1 swift 0x0000000003135bf6 llvm::sys::RunSignalHandlers() + 54
2 swift 0x0000000003137f26
3 libpthread.so.0 0x00007eff703f6d10
4 libswiftCore.so 0x00007eff6d3449b4 _TTSg5Vs5UInt8___TFSa37_appendElementAssumeUniqueAndCapacityfTSi10newElementx_T_ + 100
5 libPackageDescription.so 0x00007eff6d7c27c9 _TFC18PackageDescription7PackagecfT4nameGSqSS_7targetsGSaCS_6Target_12dependenciesGSaCS0_10Dependency_16testDependenciesGSaS2__7excludeGSaSS__S0_ + 921
6 libPackageDescription.so 0x00007eff6d7c2e08 _TFC18PackageDescription7PackageCfT4nameGSqSS_7targetsGSaCS_6Target_12dependenciesGSaCS0_10Dependency_16testDependenciesGSaS2__7excludeGSaSS__S0_ + 152
7 libPackageDescription.so 0x00007eff706635e3 _TFC18PackageDescription7PackageCfT4nameGSqSS_7targetsGSaCS_6Target_12dependenciesGSaCS0_10Dependency_16testDependenciesGSaS2__7excludeGSaSS__S0_ + 48892019
8 swift 0x0000000000d089a4 llvm::MCJIT::runFunction(llvm::Function*, llvm::ArrayRef<llvm::GenericValue>) + 996
9 swift 0x0000000000d0c01f llvm::ExecutionEngine::runFunctionAsMain(llvm::Function*, std::vector<std::__cxx11::basic_string<char, std::char_traits<char>, std::allocator<char> >, std::allocator<std::__cxx11::basic_string<char, std::char_traits<char>, std::allocator<char> > > > const&, char const* const*) + 1263
10 swift 0x0000000000bf3318 swift::RunImmediately(swift::CompilerInstance&, std::vector<std::__cxx11::basic_string<char, std::char_traits<char>, std::allocator<char> >, std::allocator<std::__cxx11::basic_string<char, std::char_traits<char>, std::allocator<char> > > > const&, swift::IRGenOptions&, swift::SILOptions const&) + 2296
11 swift 0x0000000000789502
12 swift 0x0000000000784a73 frontend_main(llvm::ArrayRef<char const*>, char const*, void*) + 2643
13 swift 0x0000000000780056 main + 2518
14 libc.so.6 0x00007eff6ed29a40 __libc_start_main + 240
15 swift 0x000000000077f579 _start + 41
Stack dump:
0. Program arguments: /home/buildnode/jenkins/workspace/oss-swift-incremental-RA-linux-ubuntu-15_10/Ninja-ReleaseAssert/swift-linux-x86_64/bin/swift -frontend -interpret /tmp/DependencyResolution_External_Complex.Hc95lS/app/Package.swift -target x86_64-unknown-linux-gnu -disable-objc-interop -I /home/buildnode/jenkins/workspace/oss-swift-incremental-RA-linux-ubuntu-15_10/Ninja-ReleaseAssert/swiftpm-linux-x86_64/lib/swift/pm -module-name Package -lPackageDescription

swift-build: error: Child process exited with signal

/home/buildnode/jenkins/workspace/oss-swift-incremental-RA-linux-ubuntu-15_10/swiftpm/Tests/Functional/TestMiscellaneous.swift:187: error: MiscellaneousTestCase.testCanBuildIfADependencyClonedButThenAborted : failed - `swift build -c Debug' failed:

exit(1): /home/buildnode/jenkins/workspace/oss-swift-incremental-RA-linux-ubuntu-15_10/Ninja-ReleaseAssert/swiftpm-linux-x86_64/bin/swift-build --chdir /tmp/DependencyResolution_External_Complex.Hc95lS/app --configuration debug

Test Case 'MiscellaneousTestCase.testCanBuildIfADependencyClonedButThenAborted' failed (0.281 seconds).
Test Case 'MiscellaneousTestCase.testTipHasNoPackageSwift' started.
    Building Debug
0 swift 0x00000000031373f8 llvm::sys::PrintStackTrace(llvm::raw_ostream&) + 40
1 swift 0x0000000003135bf6 llvm::sys::RunSignalHandlers() + 54
2 swift 0x0000000003137f26
3 libpthread.so.0 0x00007fdf4e45ed10
4 libswiftCore.so 0x00007fdf4b3ac9b4 _TTSg5Vs5UInt8___TFSa37_appendElementAssumeUniqueAndCapacityfTSi10newElementx_T_ + 100
5 libPackageDescription.so 0x00007fdf4b82a7c9 _TFC18PackageDescription7PackagecfT4nameGSqSS_7targetsGSaCS_6Target_12dependenciesGSaCS0_10Dependency_16testDependenciesGSaS2__7excludeGSaSS__S0_ + 921
6 libPackageDescription.so 0x00007fdf4b82ae08 _TFC18PackageDescription7PackageCfT4nameGSqSS_7targetsGSaCS_6Target_12dependenciesGSaCS0_10Dependency_16testDependenciesGSaS2__7excludeGSaSS__S0_ + 152
7 libPackageDescription.so 0x00007fdf4e6cb5e3 _TFC18PackageDescription7PackageCfT4nameGSqSS_7targetsGSaCS_6Target_12dependenciesGSaCS0_10Dependency_16testDependenciesGSaS2__7excludeGSaSS__S0_ + 48892019
8 swift 0x0000000000d089a4 llvm::MCJIT::runFunction(llvm::Function*, llvm::ArrayRef<llvm::GenericValue>) + 996
9 swift 0x0000000000d0c01f llvm::ExecutionEngine::runFunctionAsMain(llvm::Function*, std::vector<std::__cxx11::basic_string<char, std::char_traits<char>, std::allocator<char> >, std::allocator<std::__cxx11::basic_string<char, std::char_traits<char>, std::allocator<char> > > > const&, char const* const*) + 1263
10 swift 0x0000000000bf3318 swift::RunImmediately(swift::CompilerInstance&, std::vector<std::__cxx11::basic_string<char, std::char_traits<char>, std::allocator<char> >, std::allocator<std::__cxx11::basic_string<char, std::char_traits<char>, std::allocator<char> > > > const&, swift::IRGenOptions&, swift::SILOptions const&) + 2296
11 swift 0x0000000000789502
12 swift 0x0000000000784a73 frontend_main(llvm::ArrayRef<char const*>, char const*, void*) + 2643
13 swift 0x0000000000780056 main + 2518
14 libc.so.6 0x00007fdf4cd91a40 __libc_start_main + 240
15 swift 0x000000000077f579 _start + 41
Stack dump:
0. Program arguments: /home/buildnode/jenkins/workspace/oss-swift-incremental-RA-linux-ubuntu-15_10/Ninja-ReleaseAssert/swift-linux-x86_64/bin/swift -frontend -interpret /tmp/DependencyResolution_External_Complex.329FYr/app/Package.swift -target x86_64-unknown-linux-gnu -disable-objc-interop -I /home/buildnode/jenkins/workspace/oss-swift-incremental-RA-linux-ubuntu-15_10/Ninja-ReleaseAssert/swiftpm-linux-x86_64/lib/swift/pm -module-name Package -lPackageDescription

swift-build: error: Child process exited with signal

    Building Release
0 swift 0x00000000031373f8 llvm::sys::PrintStackTrace(llvm::raw_ostream&) + 40
1 swift 0x0000000003135bf6 llvm::sys::RunSignalHandlers() + 54
2 swift 0x0000000003137f26
3 libpthread.so.0 0x00007effa5940d10
4 libswiftCore.so 0x00007effa288e9b4 _TTSg5Vs5UInt8___TFSa37_appendElementAssumeUniqueAndCapacityfTSi10newElementx_T_ + 100
5 libPackageDescription.so 0x00007effa2d0c7c9 _TFC18PackageDescription7PackagecfT4nameGSqSS_7targetsGSaCS_6Target_12dependenciesGSaCS0_10Dependency_16testDependenciesGSaS2__7excludeGSaSS__S0_ + 921
6 libPackageDescription.so 0x00007effa2d0ce08 _TFC18PackageDescription7PackageCfT4nameGSqSS_7targetsGSaCS_6Target_12dependenciesGSaCS0_10Dependency_16testDependenciesGSaS2__7excludeGSaSS__S0_ + 152
7 libPackageDescription.so 0x00007effa5bad5e3 _TFC18PackageDescription7PackageCfT4nameGSqSS_7targetsGSaCS_6Target_12dependenciesGSaCS0_10Dependency_16testDependenciesGSaS2__7excludeGSaSS__S0_ + 48892019
8 swift 0x0000000000d089a4 llvm::MCJIT::runFunction(llvm::Function*, llvm::ArrayRef<llvm::GenericValue>) + 996
9 swift 0x0000000000d0c01f llvm::ExecutionEngine::runFunctionAsMain(llvm::Function*, std::vector<std::__cxx11::basic_string<char, std::char_traits<char>, std::allocator<char> >, std::allocator<std::__cxx11::basic_string<char, std::char_traits<char>, std::allocator<char> > > > const&, char const* const*) + 1263
10 swift 0x0000000000bf3318 swift::RunImmediately(swift::CompilerInstance&, std::vector<std::__cxx11::basic_string<char, std::char_traits<char>, std::allocator<char> >, std::allocator<std::__cxx11::basic_string<char, std::char_traits<char>, std::allocator<char> > > > const&, swift::IRGenOptions&, swift::SILOptions const&) + 2296
11 swift 0x0000000000789502
12 swift 0x0000000000784a73 frontend_main(llvm::ArrayRef<char const*>, char const*, void*) + 2643
13 swift 0x0000000000780056 main + 2518
14 libc.so.6 0x00007effa4273a40 __libc_start_main + 240
15 swift 0x000000000077f579 _start + 41
Stack dump:
0. Program arguments: /home/buildnode/jenkins/workspace/oss-swift-incremental-RA-linux-ubuntu-15_10/Ninja-ReleaseAssert/swift-linux-x86_64/bin/swift -frontend -interpret /tmp/DependencyResolution_External_Complex.329FYr/app/Package.swift -target x86_64-unknown-linux-gnu -disable-objc-interop -I /home/buildnode/jenkins/workspace/oss-swift-incremental-RA-linux-ubuntu-15_10/Ninja-ReleaseAssert/swiftpm-linux-x86_64/lib/swift/pm -module-name Package -lPackageDescription

swift-build: error: Child process exited with signal

/home/buildnode/jenkins/workspace/oss-swift-incremental-RA-linux-ubuntu-15_10/swiftpm/Tests/Functional/TestMiscellaneous.swift:204: error: MiscellaneousTestCase.testTipHasNoPackageSwift : failed - `swift build -c Debug' failed:

exit(1): /home/buildnode/jenkins/workspace/oss-swift-incremental-RA-linux-ubuntu-15_10/Ninja-ReleaseAssert/swiftpm-linux-x86_64/bin/swift-build --chdir /tmp/DependencyResolution_External_Complex.329FYr/app --configuration debug

/home/buildnode/jenkins/workspace/oss-swift-incremental-RA-linux-ubuntu-15_10/swiftpm/Tests/Functional/TestMiscellaneous.swift:204: error: MiscellaneousTestCase.testTipHasNoPackageSwift : failed - `swift build -c Release' failed:

exit(1): /home/buildnode/jenkins/workspace/oss-swift-incremental-RA-linux-ubuntu-15_10/Ninja-ReleaseAssert/swiftpm-linux-x86_64/bin/swift-build --chdir /tmp/DependencyResolution_External_Complex.329FYr/app --configuration release

Test Case 'MiscellaneousTestCase.testTipHasNoPackageSwift' failed (0.48 seconds).
Test Case 'MiscellaneousTestCase.testFailsIfVersionTagHasNoPackageSwift' started.
Test Case 'MiscellaneousTestCase.testFailsIfVersionTagHasNoPackageSwift' passed (0.284 seconds).
Test Case 'MiscellaneousTestCase.testPackageManagerDefine' started.
    Building Debug
0 swift 0x00000000031373f8 llvm::sys::PrintStackTrace(llvm::raw_ostream&) + 40
1 swift 0x0000000003135bf6 llvm::sys::RunSignalHandlers() + 54
2 swift 0x0000000003137f26
3 libpthread.so.0 0x00007f9ed1bc8d10
4 libswiftCore.so 0x00007f9eceb169b4 _TTSg5Vs5UInt8___TFSa37_appendElementAssumeUniqueAndCapacityfTSi10newElementx_T_ + 100
5 libPackageDescription.so 0x00007f9ecef947c9 _TFC18PackageDescription7PackagecfT4nameGSqSS_7targetsGSaCS_6Target_12dependenciesGSaCS0_10Dependency_16testDependenciesGSaS2__7excludeGSaSS__S0_ + 921
6 libPackageDescription.so 0x00007f9ecef94e08 _TFC18PackageDescription7PackageCfT4nameGSqSS_7targetsGSaCS_6Target_12dependenciesGSaCS0_10Dependency_16testDependenciesGSaS2__7excludeGSaSS__S0_ + 152
7 libPackageDescription.so 0x00007f9ed1e350f1 _TFC18PackageDescription7PackageCfT4nameGSqSS_7targetsGSaCS_6Target_12dependenciesGSaCS0_10Dependency_16testDependenciesGSaS2__7excludeGSaSS__S0_ + 48890753
8 swift 0x0000000000d089a4 llvm::MCJIT::runFunction(llvm::Function*, llvm::ArrayRef<llvm::GenericValue>) + 996
9 swift 0x0000000000d0c01f llvm::ExecutionEngine::runFunctionAsMain(llvm::Function*, std::vector<std::__cxx11::basic_string<char, std::char_traits<char>, std::allocator<char> >, std::allocator<std::__cxx11::basic_string<char, std::char_traits<char>, std::allocator<char> > > > const&, char const* const*) + 1263
10 swift 0x0000000000bf3318 swift::RunImmediately(swift::CompilerInstance&, std::vector<std::__cxx11::basic_string<char, std::char_traits<char>, std::allocator<char> >, std::allocator<std::__cxx11::basic_string<char, std::char_traits<char>, std::allocator<char> > > > const&, swift::IRGenOptions&, swift::SILOptions const&) + 2296
11 swift 0x0000000000789502
12 swift 0x0000000000784a73 frontend_main(llvm::ArrayRef<char const*>, char const*, void*) + 2643
13 swift 0x0000000000780056 main + 2518
14 libc.so.6 0x00007f9ed04fba40 __libc_start_main + 240
15 swift 0x000000000077f579 _start + 41
Stack dump:
0. Program arguments: /home/buildnode/jenkins/workspace/oss-swift-incremental-RA-linux-ubuntu-15_10/Ninja-ReleaseAssert/swift-linux-x86_64/bin/swift -frontend -interpret /tmp/Miscellaneous_-DSWIFT_PACKAGE.HIyOKE/-DSWIFT_PACKAGE/Package.swift -target x86_64-unknown-linux-gnu -disable-objc-interop -I /home/buildnode/jenkins/workspace/oss-swift-incremental-RA-linux-ubuntu-15_10/Ninja-ReleaseAssert/swiftpm-linux-x86_64/lib/swift/pm -module-name Package -lPackageDescription

swift-build: error: Child process exited with signal

    Building Release
0 swift 0x00000000031373f8 llvm::sys::PrintStackTrace(llvm::raw_ostream&) + 40
1 swift 0x0000000003135bf6 llvm::sys::RunSignalHandlers() + 54
2 swift 0x0000000003137f26
3 libpthread.so.0 0x00007f92c674bd10
4 libswiftCore.so 0x00007f92c36999b4 _TTSg5Vs5UInt8___TFSa37_appendElementAssumeUniqueAndCapacityfTSi10newElementx_T_ + 100
5 libPackageDescription.so 0x00007f92c3b177c9 _TFC18PackageDescription7PackagecfT4nameGSqSS_7targetsGSaCS_6Target_12dependenciesGSaCS0_10Dependency_16testDependenciesGSaS2__7excludeGSaSS__S0_ + 921
6 libPackageDescription.so 0x00007f92c3b17e08 _TFC18PackageDescription7PackageCfT4nameGSqSS_7targetsGSaCS_6Target_12dependenciesGSaCS0_10Dependency_16testDependenciesGSaS2__7excludeGSaSS__S0_ + 152
7 libPackageDescription.so 0x00007f92c69b80f1 _TFC18PackageDescription7PackageCfT4nameGSqSS_7targetsGSaCS_6Target_12dependenciesGSaCS0_10Dependency_16testDependenciesGSaS2__7excludeGSaSS__S0_ + 48890753
8 swift 0x0000000000d089a4 llvm::MCJIT::runFunction(llvm::Function*, llvm::ArrayRef<llvm::GenericValue>) + 996
9 swift 0x0000000000d0c01f llvm::ExecutionEngine::runFunctionAsMain(llvm::Function*, std::vector<std::__cxx11::basic_string<char, std::char_traits<char>, std::allocator<char> >, std::allocator<std::__cxx11::basic_string<char, std::char_traits<char>, std::allocator<char> > > > const&, char const* const*) + 1263
10 swift 0x0000000000bf3318 swift::RunImmediately(swift::CompilerInstance&, std::vector<std::__cxx11::basic_string<char, std::char_traits<char>, std::allocator<char> >, std::allocator<std::__cxx11::basic_string<char, std::char_traits<char>, std::allocator<char> > > > const&, swift::IRGenOptions&, swift::SILOptions const&) + 2296
11 swift 0x0000000000789502
12 swift 0x0000000000784a73 frontend_main(llvm::ArrayRef<char const*>, char const*, void*) + 2643
13 swift 0x0000000000780056 main + 2518
14 libc.so.6 0x00007f92c507ea40 __libc_start_main + 240
15 swift 0x000000000077f579 _start + 41
Stack dump:
0. Program arguments: /home/buildnode/jenkins/workspace/oss-swift-incremental-RA-linux-ubuntu-15_10/Ninja-ReleaseAssert/swift-linux-x86_64/bin/swift -frontend -interpret /tmp/Miscellaneous_-DSWIFT_PACKAGE.HIyOKE/-DSWIFT_PACKAGE/Package.swift -target x86_64-unknown-linux-gnu -disable-objc-interop -I /home/buildnode/jenkins/workspace/oss-swift-incremental-RA-linux-ubuntu-15_10/Ninja-ReleaseAssert/swiftpm-linux-x86_64/lib/swift/pm -module-name Package -lPackageDescription

swift-build: error: Child process exited with signal

/home/buildnode/jenkins/workspace/oss-swift-incremental-RA-linux-ubuntu-15_10/swiftpm/Tests/Functional/TestMiscellaneous.swift:225: error: MiscellaneousTestCase.testPackageManagerDefine : failed - `swift build -c Debug' failed:

exit(1): /home/buildnode/jenkins/workspace/oss-swift-incremental-RA-linux-ubuntu-15_10/Ninja-ReleaseAssert/swiftpm-linux-x86_64/bin/swift-build --chdir /tmp/Miscellaneous_-DSWIFT_PACKAGE.HIyOKE/-DSWIFT_PACKAGE --configuration debug

/home/buildnode/jenkins/workspace/oss-swift-incremental-RA-linux-ubuntu-15_10/swiftpm/Tests/Functional/TestMiscellaneous.swift:225: error: MiscellaneousTestCase.testPackageManagerDefine : failed - `swift build -c Release' failed:

exit(1): /home/buildnode/jenkins/workspace/oss-swift-incremental-RA-linux-ubuntu-15_10/Ninja-ReleaseAssert/swiftpm-linux-x86_64/bin/swift-build --chdir /tmp/Miscellaneous_-DSWIFT_PACKAGE.HIyOKE/-DSWIFT_PACKAGE --configuration release

Test Case 'MiscellaneousTestCase.testPackageManagerDefine' failed (0.325 seconds).
Test Case 'MiscellaneousTestCase.testInternalDependencyEdges' started.
    Building Debug
0 swift 0x00000000031373f8 llvm::sys::PrintStackTrace(llvm::raw_ostream&) + 40
1 swift 0x0000000003135bf6 llvm::sys::RunSignalHandlers() + 54
2 swift 0x0000000003137f26
3 libpthread.so.0 0x00007f8fb8d10d10
4 libswiftCore.so 0x00007f8fb5c5e9b4 _TTSg5Vs5UInt8___TFSa37_appendElementAssumeUniqueAndCapacityfTSi10newElementx_T_ + 100
5 libPackageDescription.so 0x00007f8fb60dc7c9 _TFC18PackageDescription7PackagecfT4nameGSqSS_7targetsGSaCS_6Target_12dependenciesGSaCS0_10Dependency_16testDependenciesGSaS2__7excludeGSaSS__S0_ + 921
6 libPackageDescription.so 0x00007f8fb60dce08 _TFC18PackageDescription7PackageCfT4nameGSqSS_7targetsGSaCS_6Target_12dependenciesGSaCS0_10Dependency_16testDependenciesGSaS2__7excludeGSaSS__S0_ + 152
7 libPackageDescription.so 0x00007f8fb8f7d1e6 _TFC18PackageDescription7PackageCfT4nameGSqSS_7targetsGSaCS_6Target_12dependenciesGSaCS0_10Dependency_16testDependenciesGSaS2__7excludeGSaSS__S0_ + 48890998
8 swift 0x0000000000d089a4 llvm::MCJIT::runFunction(llvm::Function*, llvm::ArrayRef<llvm::GenericValue>) + 996
9 swift 0x0000000000d0c01f llvm::ExecutionEngine::runFunctionAsMain(llvm::Function*, std::vector<std::__cxx11::basic_string<char, std::char_traits<char>, std::allocator<char> >, std::allocator<std::__cxx11::basic_string<char, std::char_traits<char>, std::allocator<char> > > > const&, char const* const*) + 1263
10 swift 0x0000000000bf3318 swift::RunImmediately(swift::CompilerInstance&, std::vector<std::__cxx11::basic_string<char, std::char_traits<char>, std::allocator<char> >, std::allocator<std::__cxx11::basic_string<char, std::char_traits<char>, std::allocator<char> > > > const&, swift::IRGenOptions&, swift::SILOptions const&) + 2296
11 swift 0x0000000000789502
12 swift 0x0000000000784a73 frontend_main(llvm::ArrayRef<char const*>, char const*, void*) + 2643
13 swift 0x0000000000780056 main + 2518
14 libc.so.6 0x00007f8fb7643a40 __libc_start_main + 240
15 swift 0x000000000077f579 _start + 41
Stack dump:
0. Program arguments: /home/buildnode/jenkins/workspace/oss-swift-incremental-RA-linux-ubuntu-15_10/Ninja-ReleaseAssert/swift-linux-x86_64/bin/swift -frontend -interpret /tmp/Miscellaneous_DependencyEdges_Internal.7On2sh/Internal/Package.swift -target x86_64-unknown-linux-gnu -disable-objc-interop -I /home/buildnode/jenkins/workspace/oss-swift-incremental-RA-linux-ubuntu-15_10/Ninja-ReleaseAssert/swiftpm-linux-x86_64/lib/swift/pm -module-name Package -lPackageDescription

swift-build: error: Child process exited with signal

    Building Release
0 swift 0x00000000031373f8 llvm::sys::PrintStackTrace(llvm::raw_ostream&) + 40
1 swift 0x0000000003135bf6 llvm::sys::RunSignalHandlers() + 54
2 swift 0x0000000003137f26
3 libpthread.so.0 0x00007f8187900d10
4 libswiftCore.so 0x00007f818484e9b4 _TTSg5Vs5UInt8___TFSa37_appendElementAssumeUniqueAndCapacityfTSi10newElementx_T_ + 100
5 libPackageDescription.so 0x00007f8184ccc7c9 _TFC18PackageDescription7PackagecfT4nameGSqSS_7targetsGSaCS_6Target_12dependenciesGSaCS0_10Dependency_16testDependenciesGSaS2__7excludeGSaSS__S0_ + 921
6 libPackageDescription.so 0x00007f8184ccce08 _TFC18PackageDescription7PackageCfT4nameGSqSS_7targetsGSaCS_6Target_12dependenciesGSaCS0_10Dependency_16testDependenciesGSaS2__7excludeGSaSS__S0_ + 152
7 libPackageDescription.so 0x00007f8187b6d1e6 _TFC18PackageDescription7PackageCfT4nameGSqSS_7targetsGSaCS_6Target_12dependenciesGSaCS0_10Dependency_16testDependenciesGSaS2__7excludeGSaSS__S0_ + 48890998
8 swift 0x0000000000d089a4 llvm::MCJIT::runFunction(llvm::Function*, llvm::ArrayRef<llvm::GenericValue>) + 996
9 swift 0x0000000000d0c01f llvm::ExecutionEngine::runFunctionAsMain(llvm::Function*, std::vector<std::__cxx11::basic_string<char, std::char_traits<char>, std::allocator<char> >, std::allocator<std::__cxx11::basic_string<char, std::char_traits<char>, std::allocator<char> > > > const&, char const* const*) + 1263
10 swift 0x0000000000bf3318 swift::RunImmediately(swift::CompilerInstance&, std::vector<std::__cxx11::basic_string<char, std::char_traits<char>, std::allocator<char> >, std::allocator<std::__cxx11::basic_string<char, std::char_traits<char>, std::allocator<char> > > > const&, swift::IRGenOptions&, swift::SILOptions const&) + 2296
11 swift 0x0000000000789502
12 swift 0x0000000000784a73 frontend_main(llvm::ArrayRef<char const*>, char const*, void*) + 2643
13 swift 0x0000000000780056 main + 2518
14 libc.so.6 0x00007f8186233a40 __libc_start_main + 240
15 swift 0x000000000077f579 _start + 41
Stack dump:
0. Program arguments: /home/buildnode/jenkins/workspace/oss-swift-incremental-RA-linux-ubuntu-15_10/Ninja-ReleaseAssert/swift-linux-x86_64/bin/swift -frontend -interpret /tmp/Miscellaneous_DependencyEdges_Internal.7On2sh/Internal/Package.swift -target x86_64-unknown-linux-gnu -disable-objc-interop -I /home/buildnode/jenkins/workspace/oss-swift-incremental-RA-linux-ubuntu-15_10/Ninja-ReleaseAssert/swiftpm-linux-x86_64/lib/swift/pm -module-name Package -lPackageDescription

swift-build: error: Child process exited with signal

/home/buildnode/jenkins/workspace/oss-swift-incremental-RA-linux-ubuntu-15_10/swiftpm/Tests/Functional/TestMiscellaneous.swift:237: error: MiscellaneousTestCase.testInternalDependencyEdges : failed - `swift build -c Debug' failed:

exit(1): /home/buildnode/jenkins/workspace/oss-swift-incremental-RA-linux-ubuntu-15_10/Ninja-ReleaseAssert/swiftpm-linux-x86_64/bin/swift-build --chdir /tmp/Miscellaneous_DependencyEdges_Internal.7On2sh/Internal --configuration debug

/home/buildnode/jenkins/workspace/oss-swift-incremental-RA-linux-ubuntu-15_10/swiftpm/Tests/Functional/TestMiscellaneous.swift:237: error: MiscellaneousTestCase.testInternalDependencyEdges : failed - `swift build -c Release' failed:

exit(1): /home/buildnode/jenkins/workspace/oss-swift-incremental-RA-linux-ubuntu-15_10/Ninja-ReleaseAssert/swiftpm-linux-x86_64/bin/swift-build --chdir /tmp/Miscellaneous_DependencyEdges_Internal.7On2sh/Internal --configuration release

/home/buildnode/jenkins/workspace/oss-swift-incremental-RA-linux-ubuntu-15_10/swiftpm/Tests/Functional/TestMiscellaneous.swift:234: error: MiscellaneousTestCase.testInternalDependencyEdges : failed - exit(127): /tmp/Miscellaneous_DependencyEdges_Internal.7On2sh/Internal/.build/debug/Foo
Test Case 'MiscellaneousTestCase.testInternalDependencyEdges' failed (0.368 seconds).
Test Case 'MiscellaneousTestCase.testExternalDependencyEdges1' started.
    Building Debug
0 swift 0x00000000031373f8 llvm::sys::PrintStackTrace(llvm::raw_ostream&) + 40
1 swift 0x0000000003135bf6 llvm::sys::RunSignalHandlers() + 54
2 swift 0x0000000003137f26
3 libpthread.so.0 0x00007fcd1b88fd10
4 libswiftCore.so 0x00007fcd187dd9b4 _TTSg5Vs5UInt8___TFSa37_appendElementAssumeUniqueAndCapacityfTSi10newElementx_T_ + 100
5 libPackageDescription.so 0x00007fcd18c5b7c9 _TFC18PackageDescription7PackagecfT4nameGSqSS_7targetsGSaCS_6Target_12dependenciesGSaCS0_10Dependency_16testDependenciesGSaS2__7excludeGSaSS__S0_ + 921
6 libPackageDescription.so 0x00007fcd18c5be08 _TFC18PackageDescription7PackageCfT4nameGSqSS_7targetsGSaCS_6Target_12dependenciesGSaCS0_10Dependency_16testDependenciesGSaS2__7excludeGSaSS__S0_ + 152
7 libPackageDescription.so 0x00007fcd1bafc5e3 _TFC18PackageDescription7PackageCfT4nameGSqSS_7targetsGSaCS_6Target_12dependenciesGSaCS0_10Dependency_16testDependenciesGSaS2__7excludeGSaSS__S0_ + 48892019
8 swift 0x0000000000d089a4 llvm::MCJIT::runFunction(llvm::Function*, llvm::ArrayRef<llvm::GenericValue>) + 996
9 swift 0x0000000000d0c01f llvm::ExecutionEngine::runFunctionAsMain(llvm::Function*, std::vector<std::__cxx11::basic_string<char, std::char_traits<char>, std::allocator<char> >, std::allocator<std::__cxx11::basic_string<char, std::char_traits<char>, std::allocator<char> > > > const&, char const* const*) + 1263
10 swift 0x0000000000bf3318 swift::RunImmediately(swift::CompilerInstance&, std::vector<std::__cxx11::basic_string<char, std::char_traits<char>, std::allocator<char> >, std::allocator<std::__cxx11::basic_string<char, std::char_traits<char>, std::allocator<char> > > > const&, swift::IRGenOptions&, swift::SILOptions const&) + 2296
11 swift 0x0000000000789502
12 swift 0x0000000000784a73 frontend_main(llvm::ArrayRef<char const*>, char const*, void*) + 2643
13 swift 0x0000000000780056 main + 2518
14 libc.so.6 0x00007fcd1a1c2a40 __libc_start_main + 240
15 swift 0x000000000077f579 _start + 41
Stack dump:
0. Program arguments: /home/buildnode/jenkins/workspace/oss-swift-incremental-RA-linux-ubuntu-15_10/Ninja-ReleaseAssert/swift-linux-x86_64/bin/swift -frontend -interpret /tmp/DependencyResolution_External_Complex.VHc3dV/app/Package.swift -target x86_64-unknown-linux-gnu -disable-objc-interop -I /home/buildnode/jenkins/workspace/oss-swift-incremental-RA-linux-ubuntu-15_10/Ninja-ReleaseAssert/swiftpm-linux-x86_64/lib/swift/pm -module-name Package -lPackageDescription

swift-build: error: Child process exited with signal

    Building Release
0 swift 0x00000000031373f8 llvm::sys::PrintStackTrace(llvm::raw_ostream&) + 40
1 swift 0x0000000003135bf6 llvm::sys::RunSignalHandlers() + 54
2 swift 0x0000000003137f26
3 libpthread.so.0 0x00007f020a6bad10
4 libswiftCore.so 0x00007f02076089b4 _TTSg5Vs5UInt8___TFSa37_appendElementAssumeUniqueAndCapacityfTSi10newElementx_T_ + 100
5 libPackageDescription.so 0x00007f0207a867c9 _TFC18PackageDescription7PackagecfT4nameGSqSS_7targetsGSaCS_6Target_12dependenciesGSaCS0_10Dependency_16testDependenciesGSaS2__7excludeGSaSS__S0_ + 921
6 libPackageDescription.so 0x00007f0207a86e08 _TFC18PackageDescription7PackageCfT4nameGSqSS_7targetsGSaCS_6Target_12dependenciesGSaCS0_10Dependency_16testDependenciesGSaS2__7excludeGSaSS__S0_ + 152
7 libPackageDescription.so 0x00007f020a9275e3 _TFC18PackageDescription7PackageCfT4nameGSqSS_7targetsGSaCS_6Target_12dependenciesGSaCS0_10Dependency_16testDependenciesGSaS2__7excludeGSaSS__S0_ + 48892019
8 swift 0x0000000000d089a4 llvm::MCJIT::runFunction(llvm::Function*, llvm::ArrayRef<llvm::GenericValue>) + 996
9 swift 0x0000000000d0c01f llvm::ExecutionEngine::runFunctionAsMain(llvm::Function*, std::vector<std::__cxx11::basic_string<char, std::char_traits<char>, std::allocator<char> >, std::allocator<std::__cxx11::basic_string<char, std::char_traits<char>, std::allocator<char> > > > const&, char const* const*) + 1263
10 swift 0x0000000000bf3318 swift::RunImmediately(swift::CompilerInstance&, std::vector<std::__cxx11::basic_string<char, std::char_traits<char>, std::allocator<char> >, std::allocator<std::__cxx11::basic_string<char, std::char_traits<char>, std::allocator<char> > > > const&, swift::IRGenOptions&, swift::SILOptions const&) + 2296
11 swift 0x0000000000789502
12 swift 0x0000000000784a73 frontend_main(llvm::ArrayRef<char const*>, char const*, void*) + 2643
13 swift 0x0000000000780056 main + 2518
14 libc.so.6 0x00007f0208feda40 __libc_start_main + 240
15 swift 0x000000000077f579 _start + 41
Stack dump:
0. Program arguments: /home/buildnode/jenkins/workspace/oss-swift-incremental-RA-linux-ubuntu-15_10/Ninja-ReleaseAssert/swift-linux-x86_64/bin/swift -frontend -interpret /tmp/DependencyResolution_External_Complex.VHc3dV/app/Package.swift -target x86_64-unknown-linux-gnu -disable-objc-interop -I /home/buildnode/jenkins/workspace/oss-swift-incremental-RA-linux-ubuntu-15_10/Ninja-ReleaseAssert/swiftpm-linux-x86_64/lib/swift/pm -module-name Package -lPackageDescription

swift-build: error: Child process exited with signal

/home/buildnode/jenkins/workspace/oss-swift-incremental-RA-linux-ubuntu-15_10/swiftpm/Tests/Functional/TestMiscellaneous.swift:263: error: MiscellaneousTestCase.testExternalDependencyEdges1 : failed - `swift build -c Debug' failed:

exit(1): /home/buildnode/jenkins/workspace/oss-swift-incremental-RA-linux-ubuntu-15_10/Ninja-ReleaseAssert/swiftpm-linux-x86_64/bin/swift-build --chdir /tmp/DependencyResolution_External_Complex.VHc3dV/app --configuration debug

/home/buildnode/jenkins/workspace/oss-swift-incremental-RA-linux-ubuntu-15_10/swiftpm/Tests/Functional/TestMiscellaneous.swift:263: error: MiscellaneousTestCase.testExternalDependencyEdges1 : failed - `swift build -c Release' failed:

exit(1): /home/buildnode/jenkins/workspace/oss-swift-incremental-RA-linux-ubuntu-15_10/Ninja-ReleaseAssert/swiftpm-linux-x86_64/bin/swift-build --chdir /tmp/DependencyResolution_External_Complex.VHc3dV/app --configuration release

/home/buildnode/jenkins/workspace/oss-swift-incremental-RA-linux-ubuntu-15_10/swiftpm/Tests/Functional/TestMiscellaneous.swift:260: error: MiscellaneousTestCase.testExternalDependencyEdges1 : failed - exit(127): /tmp/DependencyResolution_External_Complex.VHc3dV/app/.build/debug/Dealer
Test Case 'MiscellaneousTestCase.testExternalDependencyEdges1' failed (0.479 seconds).
Test Case 'MiscellaneousTestCase.testExternalDependencyEdges2' started.
    Building Debug
0 swift 0x00000000031373f8 llvm::sys::PrintStackTrace(llvm::raw_ostream&) + 40
1 swift 0x0000000003135bf6 llvm::sys::RunSignalHandlers() + 54
2 swift 0x0000000003137f26
3 libpthread.so.0 0x00007f4f3403dd10
4 libswiftCore.so 0x00007f4f30f8b9b4 _TTSg5Vs5UInt8___TFSa37_appendElementAssumeUniqueAndCapacityfTSi10newElementx_T_ + 100
5 libPackageDescription.so 0x00007f4f314097c9 _TFC18PackageDescription7PackagecfT4nameGSqSS_7targetsGSaCS_6Target_12dependenciesGSaCS0_10Dependency_16testDependenciesGSaS2__7excludeGSaSS__S0_ + 921
6 libPackageDescription.so 0x00007f4f31409e08 _TFC18PackageDescription7PackageCfT4nameGSqSS_7targetsGSaCS_6Target_12dependenciesGSaCS0_10Dependency_16testDependenciesGSaS2__7excludeGSaSS__S0_ + 152
7 libPackageDescription.so 0x00007f4f342aa163 _TFC18PackageDescription7PackageCfT4nameGSqSS_7targetsGSaCS_6Target_12dependenciesGSaCS0_10Dependency_16testDependenciesGSaS2__7excludeGSaSS__S0_ + 48890867
8 swift 0x0000000000d089a4 llvm::MCJIT::runFunction(llvm::Function*, llvm::ArrayRef<llvm::GenericValue>) + 996
9 swift 0x0000000000d0c01f llvm::ExecutionEngine::runFunctionAsMain(llvm::Function*, std::vector<std::__cxx11::basic_string<char, std::char_traits<char>, std::allocator<char> >, std::allocator<std::__cxx11::basic_string<char, std::char_traits<char>, std::allocator<char> > > > const&, char const* const*) + 1263
10 swift 0x0000000000bf3318 swift::RunImmediately(swift::CompilerInstance&, std::vector<std::__cxx11::basic_string<char, std::char_traits<char>, std::allocator<char> >, std::allocator<std::__cxx11::basic_string<char, std::char_traits<char>, std::allocator<char> > > > const&, swift::IRGenOptions&, swift::SILOptions const&) + 2296
11 swift 0x0000000000789502
12 swift 0x0000000000784a73 frontend_main(llvm::ArrayRef<char const*>, char const*, void*) + 2643
13 swift 0x0000000000780056 main + 2518
14 libc.so.6 0x00007f4f32970a40 __libc_start_main + 240
15 swift 0x000000000077f579 _start + 41
Stack dump:
0. Program arguments: /home/buildnode/jenkins/workspace/oss-swift-incremental-RA-linux-ubuntu-15_10/Ninja-ReleaseAssert/swift-linux-x86_64/bin/swift -frontend -interpret /tmp/Miscellaneous_DependencyEdges_External.3VOllA/root/Package.swift -target x86_64-unknown-linux-gnu -disable-objc-interop -I /home/buildnode/jenkins/workspace/oss-swift-incremental-RA-linux-ubuntu-15_10/Ninja-ReleaseAssert/swiftpm-linux-x86_64/lib/swift/pm -module-name Package -lPackageDescription

swift-build: error: Child process exited with signal

    Building Release
0 swift 0x00000000031373f8 llvm::sys::PrintStackTrace(llvm::raw_ostream&) + 40
1 swift 0x0000000003135bf6 llvm::sys::RunSignalHandlers() + 54
2 swift 0x0000000003137f26
3 libpthread.so.0 0x00007feea3158d10
4 libswiftCore.so 0x00007feea00a69b4 _TTSg5Vs5UInt8___TFSa37_appendElementAssumeUniqueAndCapacityfTSi10newElementx_T_ + 100
5 libPackageDescription.so 0x00007feea05247c9 _TFC18PackageDescription7PackagecfT4nameGSqSS_7targetsGSaCS_6Target_12dependenciesGSaCS0_10Dependency_16testDependenciesGSaS2__7excludeGSaSS__S0_ + 921
6 libPackageDescription.so 0x00007feea0524e08 _TFC18PackageDescription7PackageCfT4nameGSqSS_7targetsGSaCS_6Target_12dependenciesGSaCS0_10Dependency_16testDependenciesGSaS2__7excludeGSaSS__S0_ + 152
7 libPackageDescription.so 0x00007feea33c5163 _TFC18PackageDescription7PackageCfT4nameGSqSS_7targetsGSaCS_6Target_12dependenciesGSaCS0_10Dependency_16testDependenciesGSaS2__7excludeGSaSS__S0_ + 48890867
8 swift 0x0000000000d089a4 llvm::MCJIT::runFunction(llvm::Function*, llvm::ArrayRef<llvm::GenericValue>) + 996
9 swift 0x0000000000d0c01f llvm::ExecutionEngine::runFunctionAsMain(llvm::Function*, std::vector<std::__cxx11::basic_string<char, std::char_traits<char>, std::allocator<char> >, std::allocator<std::__cxx11::basic_string<char, std::char_traits<char>, std::allocator<char> > > > const&, char const* const*) + 1263
10 swift 0x0000000000bf3318 swift::RunImmediately(swift::CompilerInstance&, std::vector<std::__cxx11::basic_string<char, std::char_traits<char>, std::allocator<char> >, std::allocator<std::__cxx11::basic_string<char, std::char_traits<char>, std::allocator<char> > > > const&, swift::IRGenOptions&, swift::SILOptions const&) + 2296
11 swift 0x0000000000789502
12 swift 0x0000000000784a73 frontend_main(llvm::ArrayRef<char const*>, char const*, void*) + 2643
13 swift 0x0000000000780056 main + 2518
14 libc.so.6 0x00007feea1a8ba40 __libc_start_main + 240
15 swift 0x000000000077f579 _start + 41
Stack dump:
0. Program arguments: /home/buildnode/jenkins/workspace/oss-swift-incremental-RA-linux-ubuntu-15_10/Ninja-ReleaseAssert/swift-linux-x86_64/bin/swift -frontend -interpret /tmp/Miscellaneous_DependencyEdges_External.3VOllA/root/Package.swift -target x86_64-unknown-linux-gnu -disable-objc-interop -I /home/buildnode/jenkins/workspace/oss-swift-incremental-RA-linux-ubuntu-15_10/Ninja-ReleaseAssert/swiftpm-linux-x86_64/lib/swift/pm -module-name Package -lPackageDescription

swift-build: error: Child process exited with signal

/home/buildnode/jenkins/workspace/oss-swift-incremental-RA-linux-ubuntu-15_10/swiftpm/Tests/Functional/TestMiscellaneous.swift:289: error: MiscellaneousTestCase.testExternalDependencyEdges2 : failed - `swift build -c Debug' failed:

exit(1): /home/buildnode/jenkins/workspace/oss-swift-incremental-RA-linux-ubuntu-15_10/Ninja-ReleaseAssert/swiftpm-linux-x86_64/bin/swift-build --chdir /tmp/Miscellaneous_DependencyEdges_External.3VOllA/root --configuration debug

/home/buildnode/jenkins/workspace/oss-swift-incremental-RA-linux-ubuntu-15_10/swiftpm/Tests/Functional/TestMiscellaneous.swift:289: error: MiscellaneousTestCase.testExternalDependencyEdges2 : failed - `swift build -c Release' failed:

exit(1): /home/buildnode/jenkins/workspace/oss-swift-incremental-RA-linux-ubuntu-15_10/Ninja-ReleaseAssert/swiftpm-linux-x86_64/bin/swift-build --chdir /tmp/Miscellaneous_DependencyEdges_External.3VOllA/root --configuration release

/home/buildnode/jenkins/workspace/oss-swift-incremental-RA-linux-ubuntu-15_10/swiftpm/Tests/Functional/TestMiscellaneous.swift:286: error: MiscellaneousTestCase.testExternalDependencyEdges2 : failed - exit(127): /tmp/Miscellaneous_DependencyEdges_External.3VOllA/root/.build/debug/dep2
Test Case 'MiscellaneousTestCase.testExternalDependencyEdges2' failed (0.425 seconds).
Executed 19 tests, with 43 failures (0 unexpected) in 6.933 (6.936) seconds
Test Case 'PackageTests.testBasics' started.
Test Case 'PackageTests.testBasics' passed (0.001 seconds).
Test Case 'PackageTests.testExclude' started.
Test Case 'PackageTests.testExclude' passed (0.0 seconds).
Test Case 'PackageTests.testEmptyTestDependencies' started.
Test Case 'PackageTests.testEmptyTestDependencies' passed (0.0 seconds).
Test Case 'PackageTests.testTestDependencies' started.
Test Case 'PackageTests.testTestDependencies' passed (0.0 seconds).
Test Case 'PackageTests.testTargetDependencyIsStringConvertible' started.
Test Case 'PackageTests.testTargetDependencyIsStringConvertible' passed (0.0 seconds).
Executed 5 tests, with 0 failures (0 unexpected) in 0.002 (0.002) seconds
Test Case 'ModuleTests.test1' started.
Test Case 'ModuleTests.test1' passed (0.0 seconds).
Test Case 'ModuleTests.test2' started.
Test Case 'ModuleTests.test2' passed (0.0 seconds).
Test Case 'ModuleTests.test3' started.
Test Case 'ModuleTests.test3' passed (0.0 seconds).
Test Case 'ModuleTests.test4' started.
Test Case 'ModuleTests.test4' passed (0.0 seconds).
Test Case 'ModuleTests.test5' started.
Test Case 'ModuleTests.test5' passed (0.001 seconds).
Test Case 'ModuleTests.test6' started.
Test Case 'ModuleTests.test6' passed (0.001 seconds).
Test Case 'ModuleTests.testIgnoresFiles' started.
    Building Debug
    Building Release
Test Case 'ModuleTests.testIgnoresFiles' passed (0.403 seconds).
Test Case 'ModuleTests.testModuleTypes' started.
    Building Debug
0 swift 0x00000000031373f8 llvm::sys::PrintStackTrace(llvm::raw_ostream&) + 40
1 swift 0x0000000003135bf6 llvm::sys::RunSignalHandlers() + 54
2 swift 0x0000000003137f26
3 libpthread.so.0 0x00007ff532b93d10
4 libswiftCore.so 0x00007ff52fae19b4 _TTSg5Vs5UInt8___TFSa37_appendElementAssumeUniqueAndCapacityfTSi10newElementx_T_ + 100
5 libPackageDescription.so 0x00007ff52ff5f7c9 _TFC18PackageDescription7PackagecfT4nameGSqSS_7targetsGSaCS_6Target_12dependenciesGSaCS0_10Dependency_16testDependenciesGSaS2__7excludeGSaSS__S0_ + 921
6 libPackageDescription.so 0x00007ff52ff5fe08 _TFC18PackageDescription7PackageCfT4nameGSqSS_7targetsGSaCS_6Target_12dependenciesGSaCS0_10Dependency_16testDependenciesGSaS2__7excludeGSaSS__S0_ + 152
7 libPackageDescription.so 0x00007ff532e0019b _TFC18PackageDescription7PackageCfT4nameGSqSS_7targetsGSaCS_6Target_12dependenciesGSaCS0_10Dependency_16testDependenciesGSaS2__7excludeGSaSS__S0_ + 48890923
8 swift 0x0000000000d089a4 llvm::MCJIT::runFunction(llvm::Function*, llvm::ArrayRef<llvm::GenericValue>) + 996
9 swift 0x0000000000d0c01f llvm::ExecutionEngine::runFunctionAsMain(llvm::Function*, std::vector<std::__cxx11::basic_string<char, std::char_traits<char>, std::allocator<char> >, std::allocator<std::__cxx11::basic_string<char, std::char_traits<char>, std::allocator<char> > > > const&, char const* const*) + 1263
10 swift 0x0000000000bf3318 swift::RunImmediately(swift::CompilerInstance&, std::vector<std::__cxx11::basic_string<char, std::char_traits<char>, std::allocator<char> >, std::allocator<std::__cxx11::basic_string<char, std::char_traits<char>, std::allocator<char> > > > const&, swift::IRGenOptions&, swift::SILOptions const&) + 2296
11 swift 0x0000000000789502
12 swift 0x0000000000784a73 frontend_main(llvm::ArrayRef<char const*>, char const*, void*) + 2643
13 swift 0x0000000000780056 main + 2518
14 libc.so.6 0x00007ff5314c6a40 __libc_start_main + 240
15 swift 0x000000000077f579 _start + 41
Stack dump:
0. Program arguments: /home/buildnode/jenkins/workspace/oss-swift-incremental-RA-linux-ubuntu-15_10/Ninja-ReleaseAssert/swift-linux-x86_64/bin/swift -frontend -interpret /tmp/Miscellaneous_PackageType.jOMsaY/App/Package.swift -target x86_64-unknown-linux-gnu -disable-objc-interop -I /home/buildnode/jenkins/workspace/oss-swift-incremental-RA-linux-ubuntu-15_10/Ninja-ReleaseAssert/swiftpm-linux-x86_64/lib/swift/pm -module-name Package -lPackageDescription

swift-build: error: Child process exited with signal

    Building Release
0 swift 0x00000000031373f8 llvm::sys::PrintStackTrace(llvm::raw_ostream&) + 40
1 swift 0x0000000003135bf6 llvm::sys::RunSignalHandlers() + 54
2 swift 0x0000000003137f26
3 libpthread.so.0 0x00007f6bbe302d10
4 libswiftCore.so 0x00007f6bbb2509b4 _TTSg5Vs5UInt8___TFSa37_appendElementAssumeUniqueAndCapacityfTSi10newElementx_T_ + 100
5 libPackageDescription.so 0x00007f6bbb6ce7c9 _TFC18PackageDescription7PackagecfT4nameGSqSS_7targetsGSaCS_6Target_12dependenciesGSaCS0_10Dependency_16testDependenciesGSaS2__7excludeGSaSS__S0_ + 921
6 libPackageDescription.so 0x00007f6bbb6cee08 _TFC18PackageDescription7PackageCfT4nameGSqSS_7targetsGSaCS_6Target_12dependenciesGSaCS0_10Dependency_16testDependenciesGSaS2__7excludeGSaSS__S0_ + 152
7 libPackageDescription.so 0x00007f6bbe56f19b _TFC18PackageDescription7PackageCfT4nameGSqSS_7targetsGSaCS_6Target_12dependenciesGSaCS0_10Dependency_16testDependenciesGSaS2__7excludeGSaSS__S0_ + 48890923
8 swift 0x0000000000d089a4 llvm::MCJIT::runFunction(llvm::Function*, llvm::ArrayRef<llvm::GenericValue>) + 996
9 swift 0x0000000000d0c01f llvm::ExecutionEngine::runFunctionAsMain(llvm::Function*, std::vector<std::__cxx11::basic_string<char, std::char_traits<char>, std::allocator<char> >, std::allocator<std::__cxx11::basic_string<char, std::char_traits<char>, std::allocator<char> > > > const&, char const* const*) + 1263
10 swift 0x0000000000bf3318 swift::RunImmediately(swift::CompilerInstance&, std::vector<std::__cxx11::basic_string<char, std::char_traits<char>, std::allocator<char> >, std::allocator<std::__cxx11::basic_string<char, std::char_traits<char>, std::allocator<char> > > > const&, swift::IRGenOptions&, swift::SILOptions const&) + 2296
11 swift 0x0000000000789502
12 swift 0x0000000000784a73 frontend_main(llvm::ArrayRef<char const*>, char const*, void*) + 2643
13 swift 0x0000000000780056 main + 2518
14 libc.so.6 0x00007f6bbcc35a40 __libc_start_main + 240
15 swift 0x000000000077f579 _start + 41
Stack dump:
0. Program arguments: /home/buildnode/jenkins/workspace/oss-swift-incremental-RA-linux-ubuntu-15_10/Ninja-ReleaseAssert/swift-linux-x86_64/bin/swift -frontend -interpret /tmp/Miscellaneous_PackageType.jOMsaY/App/Package.swift -target x86_64-unknown-linux-gnu -disable-objc-interop -I /home/buildnode/jenkins/workspace/oss-swift-incremental-RA-linux-ubuntu-15_10/Ninja-ReleaseAssert/swiftpm-linux-x86_64/lib/swift/pm -module-name Package -lPackageDescription

swift-build: error: Child process exited with signal

/home/buildnode/jenkins/workspace/oss-swift-incremental-RA-linux-ubuntu-15_10/swiftpm/Tests/Transmute/ModuleTests.swift:182: error: ModuleTests.testModuleTypes : failed - `swift build -c Debug' failed:

exit(1): /home/buildnode/jenkins/workspace/oss-swift-incremental-RA-linux-ubuntu-15_10/Ninja-ReleaseAssert/swiftpm-linux-x86_64/bin/swift-build --chdir /tmp/Miscellaneous_PackageType.jOMsaY/App --configuration debug

/home/buildnode/jenkins/workspace/oss-swift-incremental-RA-linux-ubuntu-15_10/swiftpm/Tests/Transmute/ModuleTests.swift:182: error: ModuleTests.testModuleTypes : failed - `swift build -c Release' failed:

exit(1): /home/buildnode/jenkins/workspace/oss-swift-incremental-RA-linux-ubuntu-15_10/Ninja-ReleaseAssert/swiftpm-linux-x86_64/bin/swift-build --chdir /tmp/Miscellaneous_PackageType.jOMsaY/App --configuration release

/home/buildnode/jenkins/workspace/oss-swift-incremental-RA-linux-ubuntu-15_10/swiftpm/Tests/Transmute/ModuleTests.swift:179: error: ModuleTests.testModuleTypes : failed - NoManifest("/tmp/Miscellaneous_PackageType.jOMsaY/App/Packages/Module-1.2.3")
Test Case 'ModuleTests.testModuleTypes' failed (0.403 seconds).
Test Case 'ModuleTests.testTransmuteResolvesCModuleDependencies' started.
0 swift 0x00000000031373f8 llvm::sys::PrintStackTrace(llvm::raw_ostream&) + 40
1 swift 0x0000000003135bf6 llvm::sys::RunSignalHandlers() + 54
2 swift 0x0000000003137f26
3 libpthread.so.0 0x00007f6c83b5ed10
4 libswiftCore.so 0x00007f6c80aac9b4 _TTSg5Vs5UInt8___TFSa37_appendElementAssumeUniqueAndCapacityfTSi10newElementx_T_ + 100
5 libPackageDescription.so 0x00007f6c80f2a7c9 _TFC18PackageDescription7PackagecfT4nameGSqSS_7targetsGSaCS_6Target_12dependenciesGSaCS0_10Dependency_16testDependenciesGSaS2__7excludeGSaSS__S0_ + 921
6 libPackageDescription.so 0x00007f6c80f2ae08 _TFC18PackageDescription7PackageCfT4nameGSqSS_7targetsGSaCS_6Target_12dependenciesGSaCS0_10Dependency_16testDependenciesGSaS2__7excludeGSaSS__S0_ + 152
7 libPackageDescription.so 0x00007f6c83dcb19b _TFC18PackageDescription7PackageCfT4nameGSqSS_7targetsGSaCS_6Target_12dependenciesGSaCS0_10Dependency_16testDependenciesGSaS2__7excludeGSaSS__S0_ + 48890923
8 swift 0x0000000000d089a4 llvm::MCJIT::runFunction(llvm::Function*, llvm::ArrayRef<llvm::GenericValue>) + 996
9 swift 0x0000000000d0c01f llvm::ExecutionEngine::runFunctionAsMain(llvm::Function*, std::vector<std::__cxx11::basic_string<char, std::char_traits<char>, std::allocator<char> >, std::allocator<std::__cxx11::basic_string<char, std::char_traits<char>, std::allocator<char> > > > const&, char const* const*) + 1263
10 swift 0x0000000000bf3318 swift::RunImmediately(swift::CompilerInstance&, std::vector<std::__cxx11::basic_string<char, std::char_traits<char>, std::allocator<char> >, std::allocator<std::__cxx11::basic_string<char, std::char_traits<char>, std::allocator<char> > > > const&, swift::IRGenOptions&, swift::SILOptions const&) + 2296
11 swift 0x0000000000789502
12 swift 0x0000000000784a73 frontend_main(llvm::ArrayRef<char const*>, char const*, void*) + 2643
13 swift 0x0000000000780056 main + 2518
14 libc.so.6 0x00007f6c82491a40 __libc_start_main + 240
15 swift 0x000000000077f579 _start + 41
Stack dump:
0. Program arguments: /home/buildnode/jenkins/workspace/oss-swift-incremental-RA-linux-ubuntu-15_10/Ninja-ReleaseAssert/swift-linux-x86_64/bin/swift -frontend -interpret /tmp/Miscellaneous_PackageType.9NVoNG/App/Package.swift -target x86_64-unknown-linux-gnu -disable-objc-interop -I /home/buildnode/jenkins/workspace/oss-swift-incremental-RA-linux-ubuntu-15_10/Ninja-ReleaseAssert/swiftpm-linux-x86_64/lib/swift/pm -module-name Package -lPackageDescription
0 swift 0x00000000031373f8 llvm::sys::PrintStackTrace(llvm::raw_ostream&) + 40
1 swift 0x0000000003135bf6 llvm::sys::RunSignalHandlers() + 54
2 swift 0x0000000003137f26
3 libpthread.so.0 0x00007f920d658d10
4 libswiftCore.so 0x00007f920a5a69b4 _TTSg5Vs5UInt8___TFSa37_appendElementAssumeUniqueAndCapacityfTSi10newElementx_T_ + 100
5 libPackageDescription.so 0x00007f920aa247c9 _TFC18PackageDescription7PackagecfT4nameGSqSS_7targetsGSaCS_6Target_12dependenciesGSaCS0_10Dependency_16testDependenciesGSaS2__7excludeGSaSS__S0_ + 921
6 libPackageDescription.so 0x00007f920aa24e08 _TFC18PackageDescription7PackageCfT4nameGSqSS_7targetsGSaCS_6Target_12dependenciesGSaCS0_10Dependency_16testDependenciesGSaS2__7excludeGSaSS__S0_ + 152
7 libPackageDescription.so 0x00007f920d8c5163 _TFC18PackageDescription7PackageCfT4nameGSqSS_7targetsGSaCS_6Target_12dependenciesGSaCS0_10Dependency_16testDependenciesGSaS2__7excludeGSaSS__S0_ + 48890867
8 swift 0x0000000000d089a4 llvm::MCJIT::runFunction(llvm::Function*, llvm::ArrayRef<llvm::GenericValue>) + 996
9 swift 0x0000000000d0c01f llvm::ExecutionEngine::runFunctionAsMain(llvm::Function*, std::vector<std::__cxx11::basic_string<char, std::char_traits<char>, std::allocator<char> >, std::allocator<std::__cxx11::basic_string<char, std::char_traits<char>, std::allocator<char> > > > const&, char const* const*) + 1263
10 swift 0x0000000000bf3318 swift::RunImmediately(swift::CompilerInstance&, std::vector<std::__cxx11::basic_string<char, std::char_traits<char>, std::allocator<char> >, std::allocator<std::__cxx11::basic_string<char, std::char_traits<char>, std::allocator<char> > > > const&, swift::IRGenOptions&, swift::SILOptions const&) + 2296
11 swift 0x0000000000789502
12 swift 0x0000000000784a73 frontend_main(llvm::ArrayRef<char const*>, char const*, void*) + 2643
13 swift 0x0000000000780056 main + 2518
14 libc.so.6 0x00007f920bf8ba40 __libc_start_main + 240
15 swift 0x000000000077f579 _start + 41
Stack dump:
0. Program arguments: /home/buildnode/jenkins/workspace/oss-swift-incremental-RA-linux-ubuntu-15_10/Ninja-ReleaseAssert/swift-linux-x86_64/bin/swift -frontend -interpret /tmp/ModuleMaps_Direct.VUDW2p/App/Package.swift -target x86_64-unknown-linux-gnu -disable-objc-interop -I /home/buildnode/jenkins/workspace/oss-swift-incremental-RA-linux-ubuntu-15_10/Ninja-ReleaseAssert/swiftpm-linux-x86_64/lib/swift/pm -module-name Package -lPackageDescription
/home/buildnode/jenkins/workspace/oss-swift-incremental-RA-linux-ubuntu-15_10/swiftpm/Tests/Transmute/ModuleTests.swift:200: error: ModuleTests.testTransmuteResolvesCModuleDependencies : failed - Child process exited with signal
/home/buildnode/jenkins/workspace/oss-swift-incremental-RA-linux-ubuntu-15_10/swiftpm/Tests/Transmute/ModuleTests.swift:211: error: ModuleTests.testTransmuteResolvesCModuleDependencies : failed - Child process exited with signal
Test Case 'ModuleTests.testTransmuteResolvesCModuleDependencies' failed (0.417 seconds).
Executed 9 tests, with 5 failures (0 unexpected) in 1.226 (1.226) seconds
Test Case 'PackageTests.testUrlEndsInDotGit1' started.
Test Case 'PackageTests.testUrlEndsInDotGit1' passed (0.0 seconds).
Test Case 'PackageTests.testUrlEndsInDotGit2' started.
Test Case 'PackageTests.testUrlEndsInDotGit2' passed (0.0 seconds).
Test Case 'PackageTests.testUrlEndsInDotGit3' started.
Test Case 'PackageTests.testUrlEndsInDotGit3' passed (0.0 seconds).
Test Case 'PackageTests.testUid' started.
Test Case 'PackageTests.testUid' passed (0.0 seconds).
Executed 4 tests, with 0 failures (0 unexpected) in 0.0 (0.0) seconds
Test Case 'PathTests.test' started.
Test Case 'PathTests.test' passed (0.0 seconds).
Test Case 'PathTests.testPrecombined' started.
Test Case 'PathTests.testPrecombined' passed (0.0 seconds).
Test Case 'PathTests.testExtraSeparators' started.
Test Case 'PathTests.testExtraSeparators' passed (0.0 seconds).
Test Case 'PathTests.testEmpties' started.
Test Case 'PathTests.testEmpties' passed (0.0 seconds).
Test Case 'PathTests.testNormalizePath' started.
Test Case 'PathTests.testNormalizePath' passed (0.0 seconds).
Test Case 'PathTests.testJoinWithAbsoluteReturnsLastAbsoluteComponent' started.
Test Case 'PathTests.testJoinWithAbsoluteReturnsLastAbsoluteComponent' passed (0.0 seconds).
Test Case 'PathTests.testParentDirectory' started.
Test Case 'PathTests.testParentDirectory' passed (0.0 seconds).
Executed 7 tests, with 0 failures (0 unexpected) in 0.001 (0.001) seconds
Test Case 'RelativePathTests.testAbsolute' started.
Test Case 'RelativePathTests.testAbsolute' passed (0.0 seconds).
Test Case 'RelativePathTests.testRelative' started.
Test Case 'RelativePathTests.testRelative' passed (0.0 seconds).
Test Case 'RelativePathTests.testMixed' started.
Test Case 'RelativePathTests.testMixed' passed (0.0 seconds).
Executed 3 tests, with 0 failures (0 unexpected) in 0.0 (0.001) seconds
Test Case 'ResourcesTests.testResources' started.
Test Case 'ResourcesTests.testResources' passed (0.0 seconds).
Executed 1 test, with 0 failures (0 unexpected) in 0.0 (0.0) seconds
Test Case 'ShellTests.testPopen' started.
Test Case 'ShellTests.testPopen' passed (0.001 seconds).
Test Case 'ShellTests.testPopenWithBufferLargerThanThatAllocated' started.
Test Case 'ShellTests.testPopenWithBufferLargerThanThatAllocated' passed (0.004 seconds).
Test Case 'ShellTests.testPopenWithBinaryOutput' started.
Test Case 'ShellTests.testPopenWithBinaryOutput' passed (0.001 seconds).
Executed 3 tests, with 0 failures (0 unexpected) in 0.005 (0.005) seconds
Test Case 'StatTests.test_isdir' started.
Test Case 'StatTests.test_isdir' passed (0.0 seconds).
Test Case 'StatTests.test_isfile' started.
Test Case 'StatTests.test_isfile' passed (0.0 seconds).
Test Case 'StatTests.test_realpath' started.
Test Case 'StatTests.test_realpath' passed (0.0 seconds).
Test Case 'StatTests.test_basename' started.
Test Case 'StatTests.test_basename' passed (0.0 seconds).
Executed 4 tests, with 0 failures (0 unexpected) in 0.0 (0.0) seconds
Test Case 'StringTests.testTrailingChomp' started.
Test Case 'StringTests.testTrailingChomp' passed (0.0 seconds).
Test Case 'StringTests.testEmptyChomp' started.
Test Case 'StringTests.testEmptyChomp' passed (0.0 seconds).
Test Case 'StringTests.testSeparatorChomp' started.
Test Case 'StringTests.testSeparatorChomp' passed (0.0 seconds).
Test Case 'StringTests.testChuzzle' started.
Test Case 'StringTests.testChuzzle' passed (0.0 seconds).
Executed 4 tests, with 0 failures (0 unexpected) in 0.0 (0.0) seconds
Test Case 'TOMLTests.testLexer' started.
Test Case 'TOMLTests.testLexer' passed (0.0 seconds).
Test Case 'TOMLTests.testParser' started.
Test Case 'TOMLTests.testParser' passed (0.001 seconds).
Test Case 'TOMLTests.testParsingTables' started.
Test Case 'TOMLTests.testParsingTables' passed (0.001 seconds).
Executed 3 tests, with 0 failures (0 unexpected) in 0.002 (0.002) seconds
Test Case 'URLTests.testSchema' started.
Test Case 'URLTests.testSchema' passed (0.0 seconds).
Executed 1 test, with 0 failures (0 unexpected) in 0.0 (0.0) seconds
Test Case 'ValidLayoutsTestCase.testSingleModuleLibrary' started.
    Building Debug
    Building Release
    Building Debug
    Building Release
    Building Debug
    Building Release
Test Case 'ValidLayoutsTestCase.testSingleModuleLibrary' passed (1.136 seconds).
Test Case 'ValidLayoutsTestCase.testSingleModuleExecutable' started.
    Building Debug
    Building Release
    Building Debug
    Building Release
    Building Debug
    Building Release
Test Case 'ValidLayoutsTestCase.testSingleModuleExecutable' passed (1.685 seconds).
Test Case 'ValidLayoutsTestCase.testSingleModuleCustomizedName' started.
    Building Debug
0 swift 0x00000000031373f8 llvm::sys::PrintStackTrace(llvm::raw_ostream&) + 40
1 swift 0x0000000003135bf6 llvm::sys::RunSignalHandlers() + 54
2 swift 0x0000000003137f26
3 libpthread.so.0 0x00007fcbb06ebd10
4 libswiftCore.so 0x00007fcbad6399b4 _TTSg5Vs5UInt8___TFSa37_appendElementAssumeUniqueAndCapacityfTSi10newElementx_T_ + 100
5 libPackageDescription.so 0x00007fcbadab77c9 _TFC18PackageDescription7PackagecfT4nameGSqSS_7targetsGSaCS_6Target_12dependenciesGSaCS0_10Dependency_16testDependenciesGSaS2__7excludeGSaSS__S0_ + 921
6 libPackageDescription.so 0x00007fcbadab7e08 _TFC18PackageDescription7PackageCfT4nameGSqSS_7targetsGSaCS_6Target_12dependenciesGSaCS0_10Dependency_16testDependenciesGSaS2__7excludeGSaSS__S0_ + 152
7 libPackageDescription.so 0x00007fcbb09580f1 _TFC18PackageDescription7PackageCfT4nameGSqSS_7targetsGSaCS_6Target_12dependenciesGSaCS0_10Dependency_16testDependenciesGSaS2__7excludeGSaSS__S0_ + 48890753
8 swift 0x0000000000d089a4 llvm::MCJIT::runFunction(llvm::Function*, llvm::ArrayRef<llvm::GenericValue>) + 996
9 swift 0x0000000000d0c01f llvm::ExecutionEngine::runFunctionAsMain(llvm::Function*, std::vector<std::__cxx11::basic_string<char, std::char_traits<char>, std::allocator<char> >, std::allocator<std::__cxx11::basic_string<char, std::char_traits<char>, std::allocator<char> > > > const&, char const* const*) + 1263
10 swift 0x0000000000bf3318 swift::RunImmediately(swift::CompilerInstance&, std::vector<std::__cxx11::basic_string<char, std::char_traits<char>, std::allocator<char> >, std::allocator<std::__cxx11::basic_string<char, std::char_traits<char>, std::allocator<char> > > > const&, swift::IRGenOptions&, swift::SILOptions const&) + 2296
11 swift 0x0000000000789502
12 swift 0x0000000000784a73 frontend_main(llvm::ArrayRef<char const*>, char const*, void*) + 2643
13 swift 0x0000000000780056 main + 2518
14 libc.so.6 0x00007fcbaf01ea40 __libc_start_main + 240
15 swift 0x000000000077f579 _start + 41
Stack dump:
0. Program arguments: /home/buildnode/jenkins/workspace/oss-swift-incremental-RA-linux-ubuntu-15_10/Ninja-ReleaseAssert/swift-linux-x86_64/bin/swift -frontend -interpret /tmp/ValidLayouts_SingleModule_CustomizedName.dYFLmK/CustomizedName/Package.swift -target x86_64-unknown-linux-gnu -disable-objc-interop -I /home/buildnode/jenkins/workspace/oss-swift-incremental-RA-linux-ubuntu-15_10/Ninja-ReleaseAssert/swiftpm-linux-x86_64/lib/swift/pm -module-name Package -lPackageDescription

swift-build: error: Child process exited with signal

    Building Release
0 swift 0x00000000031373f8 llvm::sys::PrintStackTrace(llvm::raw_ostream&) + 40
1 swift 0x0000000003135bf6 llvm::sys::RunSignalHandlers() + 54
2 swift 0x0000000003137f26
3 libpthread.so.0 0x00007f5af5a5ad10
4 libswiftCore.so 0x00007f5af29a89b4 _TTSg5Vs5UInt8___TFSa37_appendElementAssumeUniqueAndCapacityfTSi10newElementx_T_ + 100
5 libPackageDescription.so 0x00007f5af2e267c9 _TFC18PackageDescription7PackagecfT4nameGSqSS_7targetsGSaCS_6Target_12dependenciesGSaCS0_10Dependency_16testDependenciesGSaS2__7excludeGSaSS__S0_ + 921
6 libPackageDescription.so 0x00007f5af2e26e08 _TFC18PackageDescription7PackageCfT4nameGSqSS_7targetsGSaCS_6Target_12dependenciesGSaCS0_10Dependency_16testDependenciesGSaS2__7excludeGSaSS__S0_ + 152
7 libPackageDescription.so 0x00007f5af5cc70f1 _TFC18PackageDescription7PackageCfT4nameGSqSS_7targetsGSaCS_6Target_12dependenciesGSaCS0_10Dependency_16testDependenciesGSaS2__7excludeGSaSS__S0_ + 48890753
8 swift 0x0000000000d089a4 llvm::MCJIT::runFunction(llvm::Function*, llvm::ArrayRef<llvm::GenericValue>) + 996
9 swift 0x0000000000d0c01f llvm::ExecutionEngine::runFunctionAsMain(llvm::Function*, std::vector<std::__cxx11::basic_string<char, std::char_traits<char>, std::allocator<char> >, std::allocator<std::__cxx11::basic_string<char, std::char_traits<char>, std::allocator<char> > > > const&, char const* const*) + 1263
10 swift 0x0000000000bf3318 swift::RunImmediately(swift::CompilerInstance&, std::vector<std::__cxx11::basic_string<char, std::char_traits<char>, std::allocator<char> >, std::allocator<std::__cxx11::basic_string<char, std::char_traits<char>, std::allocator<char> > > > const&, swift::IRGenOptions&, swift::SILOptions const&) + 2296
11 swift 0x0000000000789502
12 swift 0x0000000000784a73 frontend_main(llvm::ArrayRef<char const*>, char const*, void*) + 2643
13 swift 0x0000000000780056 main + 2518
14 libc.so.6 0x00007f5af438da40 __libc_start_main + 240
15 swift 0x000000000077f579 _start + 41
Stack dump:
0. Program arguments: /home/buildnode/jenkins/workspace/oss-swift-incremental-RA-linux-ubuntu-15_10/Ninja-ReleaseAssert/swift-linux-x86_64/bin/swift -frontend -interpret /tmp/ValidLayouts_SingleModule_CustomizedName.dYFLmK/CustomizedName/Package.swift -target x86_64-unknown-linux-gnu -disable-objc-interop -I /home/buildnode/jenkins/workspace/oss-swift-incremental-RA-linux-ubuntu-15_10/Ninja-ReleaseAssert/swiftpm-linux-x86_64/lib/swift/pm -module-name Package -lPackageDescription

swift-build: error: Child process exited with signal

    Building Debug
0 swift 0x00000000031373f8 llvm::sys::PrintStackTrace(llvm::raw_ostream&) + 40
1 swift 0x0000000003135bf6 llvm::sys::RunSignalHandlers() + 54
2 swift 0x0000000003137f26
3 libpthread.so.0 0x00007fee7c841d10
4 libswiftCore.so 0x00007fee7978f9b4 _TTSg5Vs5UInt8___TFSa37_appendElementAssumeUniqueAndCapacityfTSi10newElementx_T_ + 100
5 libPackageDescription.so 0x00007fee79c0d7c9 _TFC18PackageDescription7PackagecfT4nameGSqSS_7targetsGSaCS_6Target_12dependenciesGSaCS0_10Dependency_16testDependenciesGSaS2__7excludeGSaSS__S0_ + 921
6 libPackageDescription.so 0x00007fee79c0de08 _TFC18PackageDescription7PackageCfT4nameGSqSS_7targetsGSaCS_6Target_12dependenciesGSaCS0_10Dependency_16testDependenciesGSaS2__7excludeGSaSS__S0_ + 152
7 libPackageDescription.so 0x00007fee7caae0f1 _TFC18PackageDescription7PackageCfT4nameGSqSS_7targetsGSaCS_6Target_12dependenciesGSaCS0_10Dependency_16testDependenciesGSaS2__7excludeGSaSS__S0_ + 48890753
8 swift 0x0000000000d089a4 llvm::MCJIT::runFunction(llvm::Function*, llvm::ArrayRef<llvm::GenericValue>) + 996
9 swift 0x0000000000d0c01f llvm::ExecutionEngine::runFunctionAsMain(llvm::Function*, std::vector<std::__cxx11::basic_string<char, std::char_traits<char>, std::allocator<char> >, std::allocator<std::__cxx11::basic_string<char, std::char_traits<char>, std::allocator<char> > > > const&, char const* const*) + 1263
10 swift 0x0000000000bf3318 swift::RunImmediately(swift::CompilerInstance&, std::vector<std::__cxx11::basic_string<char, std::char_traits<char>, std::allocator<char> >, std::allocator<std::__cxx11::basic_string<char, std::char_traits<char>, std::allocator<char> > > > const&, swift::IRGenOptions&, swift::SILOptions const&) + 2296
11 swift 0x0000000000789502
12 swift 0x0000000000784a73 frontend_main(llvm::ArrayRef<char const*>, char const*, void*) + 2643
13 swift 0x0000000000780056 main + 2518
14 libc.so.6 0x00007fee7b174a40 __libc_start_main + 240
15 swift 0x000000000077f579 _start + 41
Stack dump:
0. Program arguments: /home/buildnode/jenkins/workspace/oss-swift-incremental-RA-linux-ubuntu-15_10/Ninja-ReleaseAssert/swift-linux-x86_64/bin/swift -frontend -interpret /tmp/ValidLayouts_SingleModule_CustomizedName.LFMU6C/CustomizedName/Package.swift -target x86_64-unknown-linux-gnu -disable-objc-interop -I /home/buildnode/jenkins/workspace/oss-swift-incremental-RA-linux-ubuntu-15_10/Ninja-ReleaseAssert/swiftpm-linux-x86_64/lib/swift/pm -module-name Package -lPackageDescription

swift-build: error: Child process exited with signal

    Building Release
0 swift 0x00000000031373f8 llvm::sys::PrintStackTrace(llvm::raw_ostream&) + 40
1 swift 0x0000000003135bf6 llvm::sys::RunSignalHandlers() + 54
2 swift 0x0000000003137f26
3 libpthread.so.0 0x00007f01c68bfd10
4 libswiftCore.so 0x00007f01c380d9b4 _TTSg5Vs5UInt8___TFSa37_appendElementAssumeUniqueAndCapacityfTSi10newElementx_T_ + 100
5 libPackageDescription.so 0x00007f01c3c8b7c9 _TFC18PackageDescription7PackagecfT4nameGSqSS_7targetsGSaCS_6Target_12dependenciesGSaCS0_10Dependency_16testDependenciesGSaS2__7excludeGSaSS__S0_ + 921
6 libPackageDescription.so 0x00007f01c3c8be08 _TFC18PackageDescription7PackageCfT4nameGSqSS_7targetsGSaCS_6Target_12dependenciesGSaCS0_10Dependency_16testDependenciesGSaS2__7excludeGSaSS__S0_ + 152
7 libPackageDescription.so 0x00007f01c6b2c0f1 _TFC18PackageDescription7PackageCfT4nameGSqSS_7targetsGSaCS_6Target_12dependenciesGSaCS0_10Dependency_16testDependenciesGSaS2__7excludeGSaSS__S0_ + 48890753
8 swift 0x0000000000d089a4 llvm::MCJIT::runFunction(llvm::Function*, llvm::ArrayRef<llvm::GenericValue>) + 996
9 swift 0x0000000000d0c01f llvm::ExecutionEngine::runFunctionAsMain(llvm::Function*, std::vector<std::__cxx11::basic_string<char, std::char_traits<char>, std::allocator<char> >, std::allocator<std::__cxx11::basic_string<char, std::char_traits<char>, std::allocator<char> > > > const&, char const* const*) + 1263
10 swift 0x0000000000bf3318 swift::RunImmediately(swift::CompilerInstance&, std::vector<std::__cxx11::basic_string<char, std::char_traits<char>, std::allocator<char> >, std::allocator<std::__cxx11::basic_string<char, std::char_traits<char>, std::allocator<char> > > > const&, swift::IRGenOptions&, swift::SILOptions const&) + 2296
11 swift 0x0000000000789502
12 swift 0x0000000000784a73 frontend_main(llvm::ArrayRef<char const*>, char const*, void*) + 2643
13 swift 0x0000000000780056 main + 2518
14 libc.so.6 0x00007f01c51f2a40 __libc_start_main + 240
15 swift 0x000000000077f579 _start + 41
Stack dump:
0. Program arguments: /home/buildnode/jenkins/workspace/oss-swift-incremental-RA-linux-ubuntu-15_10/Ninja-ReleaseAssert/swift-linux-x86_64/bin/swift -frontend -interpret /tmp/ValidLayouts_SingleModule_CustomizedName.LFMU6C/CustomizedName/Package.swift -target x86_64-unknown-linux-gnu -disable-objc-interop -I /home/buildnode/jenkins/workspace/oss-swift-incremental-RA-linux-ubuntu-15_10/Ninja-ReleaseAssert/swiftpm-linux-x86_64/lib/swift/pm -module-name Package -lPackageDescription

swift-build: error: Child process exited with signal

    Building Debug
0 swift 0x00000000031373f8 llvm::sys::PrintStackTrace(llvm::raw_ostream&) + 40
1 swift 0x0000000003135bf6 llvm::sys::RunSignalHandlers() + 54
2 swift 0x0000000003137f26
3 libpthread.so.0 0x00007f9c1a9f8d10
4 libswiftCore.so 0x00007f9c179469b4 _TTSg5Vs5UInt8___TFSa37_appendElementAssumeUniqueAndCapacityfTSi10newElementx_T_ + 100
5 libPackageDescription.so 0x00007f9c17dc47c9 _TFC18PackageDescription7PackagecfT4nameGSqSS_7targetsGSaCS_6Target_12dependenciesGSaCS0_10Dependency_16testDependenciesGSaS2__7excludeGSaSS__S0_ + 921
6 libPackageDescription.so 0x00007f9c17dc4e08 _TFC18PackageDescription7PackageCfT4nameGSqSS_7targetsGSaCS_6Target_12dependenciesGSaCS0_10Dependency_16testDependenciesGSaS2__7excludeGSaSS__S0_ + 152
7 libPackageDescription.so 0x00007f9c1ac650f1 _TFC18PackageDescription7PackageCfT4nameGSqSS_7targetsGSaCS_6Target_12dependenciesGSaCS0_10Dependency_16testDependenciesGSaS2__7excludeGSaSS__S0_ + 48890753
8 swift 0x0000000000d089a4 llvm::MCJIT::runFunction(llvm::Function*, llvm::ArrayRef<llvm::GenericValue>) + 996
9 swift 0x0000000000d0c01f llvm::ExecutionEngine::runFunctionAsMain(llvm::Function*, std::vector<std::__cxx11::basic_string<char, std::char_traits<char>, std::allocator<char> >, std::allocator<std::__cxx11::basic_string<char, std::char_traits<char>, std::allocator<char> > > > const&, char const* const*) + 1263
10 swift 0x0000000000bf3318 swift::RunImmediately(swift::CompilerInstance&, std::vector<std::__cxx11::basic_string<char, std::char_traits<char>, std::allocator<char> >, std::allocator<std::__cxx11::basic_string<char, std::char_traits<char>, std::allocator<char> > > > const&, swift::IRGenOptions&, swift::SILOptions const&) + 2296
11 swift 0x0000000000789502
12 swift 0x0000000000784a73 frontend_main(llvm::ArrayRef<char const*>, char const*, void*) + 2643
13 swift 0x0000000000780056 main + 2518
14 libc.so.6 0x00007f9c1932ba40 __libc_start_main + 240
15 swift 0x000000000077f579 _start + 41
Stack dump:
0. Program arguments: /home/buildnode/jenkins/workspace/oss-swift-incremental-RA-linux-ubuntu-15_10/Ninja-ReleaseAssert/swift-linux-x86_64/bin/swift -frontend -interpret /tmp/ValidLayouts_SingleModule_CustomizedName.LIZvJw/CustomizedName/Package.swift -target x86_64-unknown-linux-gnu -disable-objc-interop -I /home/buildnode/jenkins/workspace/oss-swift-incremental-RA-linux-ubuntu-15_10/Ninja-ReleaseAssert/swiftpm-linux-x86_64/lib/swift/pm -module-name Package -lPackageDescription

swift-build: error: Child process exited with signal

    Building Release
0 swift 0x00000000031373f8 llvm::sys::PrintStackTrace(llvm::raw_ostream&) + 40
1 swift 0x0000000003135bf6 llvm::sys::RunSignalHandlers() + 54
2 swift 0x0000000003137f26
3 libpthread.so.0 0x00007f9bae439d10
4 libswiftCore.so 0x00007f9bab3879b4 _TTSg5Vs5UInt8___TFSa37_appendElementAssumeUniqueAndCapacityfTSi10newElementx_T_ + 100
5 libPackageDescription.so 0x00007f9bab8057c9 _TFC18PackageDescription7PackagecfT4nameGSqSS_7targetsGSaCS_6Target_12dependenciesGSaCS0_10Dependency_16testDependenciesGSaS2__7excludeGSaSS__S0_ + 921
6 libPackageDescription.so 0x00007f9bab805e08 _TFC18PackageDescription7PackageCfT4nameGSqSS_7targetsGSaCS_6Target_12dependenciesGSaCS0_10Dependency_16testDependenciesGSaS2__7excludeGSaSS__S0_ + 152
7 libPackageDescription.so 0x00007f9bae6a60f1 _TFC18PackageDescription7PackageCfT4nameGSqSS_7targetsGSaCS_6Target_12dependenciesGSaCS0_10Dependency_16testDependenciesGSaS2__7excludeGSaSS__S0_ + 48890753
8 swift 0x0000000000d089a4 llvm::MCJIT::runFunction(llvm::Function*, llvm::ArrayRef<llvm::GenericValue>) + 996
9 swift 0x0000000000d0c01f llvm::ExecutionEngine::runFunctionAsMain(llvm::Function*, std::vector<std::__cxx11::basic_string<char, std::char_traits<char>, std::allocator<char> >, std::allocator<std::__cxx11::basic_string<char, std::char_traits<char>, std::allocator<char> > > > const&, char const* const*) + 1263
10 swift 0x0000000000bf3318 swift::RunImmediately(swift::CompilerInstance&, std::vector<std::__cxx11::basic_string<char, std::char_traits<char>, std::allocator<char> >, std::allocator<std::__cxx11::basic_string<char, std::char_traits<char>, std::allocator<char> > > > const&, swift::IRGenOptions&, swift::SILOptions const&) + 2296
11 swift 0x0000000000789502
12 swift 0x0000000000784a73 frontend_main(llvm::ArrayRef<char const*>, char const*, void*) + 2643
13 swift 0x0000000000780056 main + 2518
14 libc.so.6 0x00007f9bacd6ca40 __libc_start_main + 240
15 swift 0x000000000077f579 _start + 41
Stack dump:
0. Program arguments: /home/buildnode/jenkins/workspace/oss-swift-incremental-RA-linux-ubuntu-15_10/Ninja-ReleaseAssert/swift-linux-x86_64/bin/swift -frontend -interpret /tmp/ValidLayouts_SingleModule_CustomizedName.LIZvJw/CustomizedName/Package.swift -target x86_64-unknown-linux-gnu -disable-objc-interop -I /home/buildnode/jenkins/workspace/oss-swift-incremental-RA-linux-ubuntu-15_10/Ninja-ReleaseAssert/swiftpm-linux-x86_64/lib/swift/pm -module-name Package -lPackageDescription

swift-build: error: Child process exited with signal

/home/buildnode/jenkins/workspace/oss-swift-incremental-RA-linux-ubuntu-15_10/swiftpm/Tests/Functional/TestValidLayouts.swift:41: error: ValidLayoutsTestCase.testSingleModuleCustomizedName : failed - `swift build -c Debug' failed:

exit(1): /home/buildnode/jenkins/workspace/oss-swift-incremental-RA-linux-ubuntu-15_10/Ninja-ReleaseAssert/swiftpm-linux-x86_64/bin/swift-build --chdir /tmp/ValidLayouts_SingleModule_CustomizedName.dYFLmK/CustomizedName --configuration debug

/home/buildnode/jenkins/workspace/oss-swift-incremental-RA-linux-ubuntu-15_10/swiftpm/Tests/Functional/TestValidLayouts.swift:41: error: ValidLayoutsTestCase.testSingleModuleCustomizedName : failed - `swift build -c Release' failed:

exit(1): /home/buildnode/jenkins/workspace/oss-swift-incremental-RA-linux-ubuntu-15_10/Ninja-ReleaseAssert/swiftpm-linux-x86_64/bin/swift-build --chdir /tmp/ValidLayouts_SingleModule_CustomizedName.dYFLmK/CustomizedName --configuration release

/home/buildnode/jenkins/workspace/oss-swift-incremental-RA-linux-ubuntu-15_10/swiftpm/Tests/Functional/TestValidLayouts.swift:42: error: ValidLayoutsTestCase.testSingleModuleCustomizedName : failed - Expected file doesn’t exist: /tmp/ValidLayouts_SingleModule_CustomizedName.dYFLmK/CustomizedName/.build/debug/Bar.swiftmodule
/home/buildnode/jenkins/workspace/oss-swift-incremental-RA-linux-ubuntu-15_10/swiftpm/Tests/Functional/TestValidLayouts.swift:41: error: ValidLayoutsTestCase.testSingleModuleCustomizedName : failed - `swift build -c Debug' failed:

exit(1): /home/buildnode/jenkins/workspace/oss-swift-incremental-RA-linux-ubuntu-15_10/Ninja-ReleaseAssert/swiftpm-linux-x86_64/bin/swift-build --chdir /tmp/ValidLayouts_SingleModule_CustomizedName.LFMU6C/CustomizedName --configuration debug

/home/buildnode/jenkins/workspace/oss-swift-incremental-RA-linux-ubuntu-15_10/swiftpm/Tests/Functional/TestValidLayouts.swift:41: error: ValidLayoutsTestCase.testSingleModuleCustomizedName : failed - `swift build -c Release' failed:

exit(1): /home/buildnode/jenkins/workspace/oss-swift-incremental-RA-linux-ubuntu-15_10/Ninja-ReleaseAssert/swiftpm-linux-x86_64/bin/swift-build --chdir /tmp/ValidLayouts_SingleModule_CustomizedName.LFMU6C/CustomizedName --configuration release

/home/buildnode/jenkins/workspace/oss-swift-incremental-RA-linux-ubuntu-15_10/swiftpm/Tests/Functional/TestValidLayouts.swift:42: error: ValidLayoutsTestCase.testSingleModuleCustomizedName : failed - Expected file doesn’t exist: /tmp/ValidLayouts_SingleModule_CustomizedName.LFMU6C/CustomizedName/.build/debug/Bar.swiftmodule
/home/buildnode/jenkins/workspace/oss-swift-incremental-RA-linux-ubuntu-15_10/swiftpm/Tests/Functional/TestValidLayouts.swift:41: error: ValidLayoutsTestCase.testSingleModuleCustomizedName : failed - `swift build -c Debug' failed:

exit(1): /home/buildnode/jenkins/workspace/oss-swift-incremental-RA-linux-ubuntu-15_10/Ninja-ReleaseAssert/swiftpm-linux-x86_64/bin/swift-build --chdir /tmp/ValidLayouts_SingleModule_CustomizedName.LIZvJw/CustomizedName --configuration debug

/home/buildnode/jenkins/workspace/oss-swift-incremental-RA-linux-ubuntu-15_10/swiftpm/Tests/Functional/TestValidLayouts.swift:41: error: ValidLayoutsTestCase.testSingleModuleCustomizedName : failed - `swift build -c Release' failed:

exit(1): /home/buildnode/jenkins/workspace/oss-swift-incremental-RA-linux-ubuntu-15_10/Ninja-ReleaseAssert/swiftpm-linux-x86_64/bin/swift-build --chdir /tmp/ValidLayouts_SingleModule_CustomizedName.LIZvJw/CustomizedName --configuration release

/home/buildnode/jenkins/workspace/oss-swift-incremental-RA-linux-ubuntu-15_10/swiftpm/Tests/Functional/TestValidLayouts.swift:42: error: ValidLayoutsTestCase.testSingleModuleCustomizedName : failed - Expected file doesn’t exist: /tmp/ValidLayouts_SingleModule_CustomizedName.LIZvJw/CustomizedName/.build/debug/Bar.swiftmodule
Test Case 'ValidLayoutsTestCase.testSingleModuleCustomizedName' failed (0.942 seconds).
Test Case 'ValidLayoutsTestCase.testSingleModuleSubfolderWithSwiftSuffix' started.
    Building Debug
0 swift 0x00000000031373f8 llvm::sys::PrintStackTrace(llvm::raw_ostream&) + 40
1 swift 0x0000000003135bf6 llvm::sys::RunSignalHandlers() + 54
2 swift 0x0000000003137f26
3 libpthread.so.0 0x00007f553a8add10
4 libswiftCore.so 0x00007f55377fb9b4 _TTSg5Vs5UInt8___TFSa37_appendElementAssumeUniqueAndCapacityfTSi10newElementx_T_ + 100
5 libPackageDescription.so 0x00007f5537c797c9 _TFC18PackageDescription7PackagecfT4nameGSqSS_7targetsGSaCS_6Target_12dependenciesGSaCS0_10Dependency_16testDependenciesGSaS2__7excludeGSaSS__S0_ + 921
6 libPackageDescription.so 0x00007f5537c79e08 _TFC18PackageDescription7PackageCfT4nameGSqSS_7targetsGSaCS_6Target_12dependenciesGSaCS0_10Dependency_16testDependenciesGSaS2__7excludeGSaSS__S0_ + 152
7 libPackageDescription.so 0x00007f553ab1a0f1 _TFC18PackageDescription7PackageCfT4nameGSqSS_7targetsGSaCS_6Target_12dependenciesGSaCS0_10Dependency_16testDependenciesGSaS2__7excludeGSaSS__S0_ + 48890753
8 swift 0x0000000000d089a4 llvm::MCJIT::runFunction(llvm::Function*, llvm::ArrayRef<llvm::GenericValue>) + 996
9 swift 0x0000000000d0c01f llvm::ExecutionEngine::runFunctionAsMain(llvm::Function*, std::vector<std::__cxx11::basic_string<char, std::char_traits<char>, std::allocator<char> >, std::allocator<std::__cxx11::basic_string<char, std::char_traits<char>, std::allocator<char> > > > const&, char const* const*) + 1263
10 swift 0x0000000000bf3318 swift::RunImmediately(swift::CompilerInstance&, std::vector<std::__cxx11::basic_string<char, std::char_traits<char>, std::allocator<char> >, std::allocator<std::__cxx11::basic_string<char, std::char_traits<char>, std::allocator<char> > > > const&, swift::IRGenOptions&, swift::SILOptions const&) + 2296
11 swift 0x0000000000789502
12 swift 0x0000000000784a73 frontend_main(llvm::ArrayRef<char const*>, char const*, void*) + 2643
13 swift 0x0000000000780056 main + 2518
14 libc.so.6 0x00007f55391e0a40 __libc_start_main + 240
15 swift 0x000000000077f579 _start + 41
Stack dump:
0. Program arguments: /home/buildnode/jenkins/workspace/oss-swift-incremental-RA-linux-ubuntu-15_10/Ninja-ReleaseAssert/swift-linux-x86_64/bin/swift -frontend -interpret /tmp/ValidLayouts_SingleModule_SubfolderWithSwiftSuffix.ZVUHfr/SubfolderWithSwiftSuffix/Package.swift -target x86_64-unknown-linux-gnu -disable-objc-interop -I /home/buildnode/jenkins/workspace/oss-swift-incremental-RA-linux-ubuntu-15_10/Ninja-ReleaseAssert/swiftpm-linux-x86_64/lib/swift/pm -module-name Package -lPackageDescription

swift-build: error: Child process exited with signal

    Building Release
0 swift 0x00000000031373f8 llvm::sys::PrintStackTrace(llvm::raw_ostream&) + 40
1 swift 0x0000000003135bf6 llvm::sys::RunSignalHandlers() + 54
2 swift 0x0000000003137f26
3 libpthread.so.0 0x00007f0893ac9d10
4 libswiftCore.so 0x00007f0890a179b4 _TTSg5Vs5UInt8___TFSa37_appendElementAssumeUniqueAndCapacityfTSi10newElementx_T_ + 100
5 libPackageDescription.so 0x00007f0890e957c9 _TFC18PackageDescription7PackagecfT4nameGSqSS_7targetsGSaCS_6Target_12dependenciesGSaCS0_10Dependency_16testDependenciesGSaS2__7excludeGSaSS__S0_ + 921
6 libPackageDescription.so 0x00007f0890e95e08 _TFC18PackageDescription7PackageCfT4nameGSqSS_7targetsGSaCS_6Target_12dependenciesGSaCS0_10Dependency_16testDependenciesGSaS2__7excludeGSaSS__S0_ + 152
7 libPackageDescription.so 0x00007f0893d360f1 _TFC18PackageDescription7PackageCfT4nameGSqSS_7targetsGSaCS_6Target_12dependenciesGSaCS0_10Dependency_16testDependenciesGSaS2__7excludeGSaSS__S0_ + 48890753
8 swift 0x0000000000d089a4 llvm::MCJIT::runFunction(llvm::Function*, llvm::ArrayRef<llvm::GenericValue>) + 996
9 swift 0x0000000000d0c01f llvm::ExecutionEngine::runFunctionAsMain(llvm::Function*, std::vector<std::__cxx11::basic_string<char, std::char_traits<char>, std::allocator<char> >, std::allocator<std::__cxx11::basic_string<char, std::char_traits<char>, std::allocator<char> > > > const&, char const* const*) + 1263
10 swift 0x0000000000bf3318 swift::RunImmediately(swift::CompilerInstance&, std::vector<std::__cxx11::basic_string<char, std::char_traits<char>, std::allocator<char> >, std::allocator<std::__cxx11::basic_string<char, std::char_traits<char>, std::allocator<char> > > > const&, swift::IRGenOptions&, swift::SILOptions const&) + 2296
11 swift 0x0000000000789502
12 swift 0x0000000000784a73 frontend_main(llvm::ArrayRef<char const*>, char const*, void*) + 2643
13 swift 0x0000000000780056 main + 2518
14 libc.so.6 0x00007f08923fca40 __libc_start_main + 240
15 swift 0x000000000077f579 _start + 41
Stack dump:
0. Program arguments: /home/buildnode/jenkins/workspace/oss-swift-incremental-RA-linux-ubuntu-15_10/Ninja-ReleaseAssert/swift-linux-x86_64/bin/swift -frontend -interpret /tmp/ValidLayouts_SingleModule_SubfolderWithSwiftSuffix.ZVUHfr/SubfolderWithSwiftSuffix/Package.swift -target x86_64-unknown-linux-gnu -disable-objc-interop -I /home/buildnode/jenkins/workspace/oss-swift-incremental-RA-linux-ubuntu-15_10/Ninja-ReleaseAssert/swiftpm-linux-x86_64/lib/swift/pm -module-name Package -lPackageDescription

swift-build: error: Child process exited with signal

/home/buildnode/jenkins/workspace/oss-swift-incremental-RA-linux-ubuntu-15_10/swiftpm/Tests/Functional/TestValidLayouts.swift:48: error: ValidLayoutsTestCase.testSingleModuleSubfolderWithSwiftSuffix : failed - `swift build -c Debug' failed:

exit(1): /home/buildnode/jenkins/workspace/oss-swift-incremental-RA-linux-ubuntu-15_10/Ninja-ReleaseAssert/swiftpm-linux-x86_64/bin/swift-build --chdir /tmp/ValidLayouts_SingleModule_SubfolderWithSwiftSuffix.ZVUHfr/SubfolderWithSwiftSuffix --configuration debug

/home/buildnode/jenkins/workspace/oss-swift-incremental-RA-linux-ubuntu-15_10/swiftpm/Tests/Functional/TestValidLayouts.swift:48: error: ValidLayoutsTestCase.testSingleModuleSubfolderWithSwiftSuffix : failed - `swift build -c Release' failed:

exit(1): /home/buildnode/jenkins/workspace/oss-swift-incremental-RA-linux-ubuntu-15_10/Ninja-ReleaseAssert/swiftpm-linux-x86_64/bin/swift-build --chdir /tmp/ValidLayouts_SingleModule_SubfolderWithSwiftSuffix.ZVUHfr/SubfolderWithSwiftSuffix --configuration release

/home/buildnode/jenkins/workspace/oss-swift-incremental-RA-linux-ubuntu-15_10/swiftpm/Tests/Functional/TestValidLayouts.swift:49: error: ValidLayoutsTestCase.testSingleModuleSubfolderWithSwiftSuffix : failed - Expected file doesn’t exist: /tmp/ValidLayouts_SingleModule_SubfolderWithSwiftSuffix.ZVUHfr/SubfolderWithSwiftSuffix/.build/debug/Bar.swiftmodule
Test Case 'ValidLayoutsTestCase.testSingleModuleSubfolderWithSwiftSuffix' failed (0.32 seconds).
Test Case 'ValidLayoutsTestCase.testMultipleModulesLibraries' started.
    Building Debug
    Building Release
    Building Debug
    Building Release
    Building Debug
    Building Release
Test Case 'ValidLayoutsTestCase.testMultipleModulesLibraries' passed (1.268 seconds).
Test Case 'ValidLayoutsTestCase.testMultipleModulesExecutables' started.
    Building Debug
    Building Release
    Building Debug
    Building Release
    Building Debug
    Building Release
Test Case 'ValidLayoutsTestCase.testMultipleModulesExecutables' passed (2.383 seconds).
Test Case 'ValidLayoutsTestCase.testPackageIdentifiers' started.
    Building Debug
0 swift 0x00000000031373f8 llvm::sys::PrintStackTrace(llvm::raw_ostream&) + 40
1 swift 0x0000000003135bf6 llvm::sys::RunSignalHandlers() + 54
2 swift 0x0000000003137f26
3 libpthread.so.0 0x00007fac23082d10
4 libswiftCore.so 0x00007fac1ffd09b4 _TTSg5Vs5UInt8___TFSa37_appendElementAssumeUniqueAndCapacityfTSi10newElementx_T_ + 100
5 libPackageDescription.so 0x00007fac2044e7c9 _TFC18PackageDescription7PackagecfT4nameGSqSS_7targetsGSaCS_6Target_12dependenciesGSaCS0_10Dependency_16testDependenciesGSaS2__7excludeGSaSS__S0_ + 921
6 libPackageDescription.so 0x00007fac2044ee08 _TFC18PackageDescription7PackageCfT4nameGSqSS_7targetsGSaCS_6Target_12dependenciesGSaCS0_10Dependency_16testDependenciesGSaS2__7excludeGSaSS__S0_ + 152
7 libPackageDescription.so 0x00007fac232ef5e3 _TFC18PackageDescription7PackageCfT4nameGSqSS_7targetsGSaCS_6Target_12dependenciesGSaCS0_10Dependency_16testDependenciesGSaS2__7excludeGSaSS__S0_ + 48892019
8 swift 0x0000000000d089a4 llvm::MCJIT::runFunction(llvm::Function*, llvm::ArrayRef<llvm::GenericValue>) + 996
9 swift 0x0000000000d0c01f llvm::ExecutionEngine::runFunctionAsMain(llvm::Function*, std::vector<std::__cxx11::basic_string<char, std::char_traits<char>, std::allocator<char> >, std::allocator<std::__cxx11::basic_string<char, std::char_traits<char>, std::allocator<char> > > > const&, char const* const*) + 1263
10 swift 0x0000000000bf3318 swift::RunImmediately(swift::CompilerInstance&, std::vector<std::__cxx11::basic_string<char, std::char_traits<char>, std::allocator<char> >, std::allocator<std::__cxx11::basic_string<char, std::char_traits<char>, std::allocator<char> > > > const&, swift::IRGenOptions&, swift::SILOptions const&) + 2296
11 swift 0x0000000000789502
12 swift 0x0000000000784a73 frontend_main(llvm::ArrayRef<char const*>, char const*, void*) + 2643
13 swift 0x0000000000780056 main + 2518
14 libc.so.6 0x00007fac219b5a40 __libc_start_main + 240
15 swift 0x000000000077f579 _start + 41
Stack dump:
0. Program arguments: /home/buildnode/jenkins/workspace/oss-swift-incremental-RA-linux-ubuntu-15_10/Ninja-ReleaseAssert/swift-linux-x86_64/bin/swift -frontend -interpret /tmp/DependencyResolution_External_Complex.3IToOq/app/Package.swift -target x86_64-unknown-linux-gnu -disable-objc-interop -I /home/buildnode/jenkins/workspace/oss-swift-incremental-RA-linux-ubuntu-15_10/Ninja-ReleaseAssert/swiftpm-linux-x86_64/lib/swift/pm -module-name Package -lPackageDescription

swift-build: error: Child process exited with signal

/home/buildnode/jenkins/workspace/oss-swift-incremental-RA-linux-ubuntu-15_10/swiftpm/Tests/Functional/TestValidLayouts.swift:81: error: ValidLayoutsTestCase.testPackageIdentifiers : failed - `swift build -c Debug' failed:

exit(1): /home/buildnode/jenkins/workspace/oss-swift-incremental-RA-linux-ubuntu-15_10/Ninja-ReleaseAssert/swiftpm-linux-x86_64/bin/swift-build --chdir /tmp/DependencyResolution_External_Complex.3IToOq/app --configuration debug

/home/buildnode/jenkins/workspace/oss-swift-incremental-RA-linux-ubuntu-15_10/swiftpm/Tests/Functional/TestValidLayouts.swift:82: error: ValidLayoutsTestCase.testPackageIdentifiers : failed - Expected directory doesn’t exist: /tmp/DependencyResolution_External_Complex.3IToOq/app/Packages/DeckOfPlayingCards-1.2.3-beta5
/home/buildnode/jenkins/workspace/oss-swift-incremental-RA-linux-ubuntu-15_10/swiftpm/Tests/Functional/TestValidLayouts.swift:83: error: ValidLayoutsTestCase.testPackageIdentifiers : failed - Expected directory doesn’t exist: /tmp/DependencyResolution_External_Complex.3IToOq/app/Packages/FisherYates-1.3.4-alpha.beta.gamma1
/home/buildnode/jenkins/workspace/oss-swift-incremental-RA-linux-ubuntu-15_10/swiftpm/Tests/Functional/TestValidLayouts.swift:84: error: ValidLayoutsTestCase.testPackageIdentifiers : failed - Expected directory doesn’t exist: /tmp/DependencyResolution_External_Complex.3IToOq/app/Packages/PlayingCard-1.2.3+24
Test Case 'ValidLayoutsTestCase.testPackageIdentifiers' failed (0.285 seconds).
Test Case 'ValidLayoutsTestCase.testMadeValidWithExclude' started.
    Building Debug
0 swift 0x00000000031373f8 llvm::sys::PrintStackTrace(llvm::raw_ostream&) + 40
1 swift 0x0000000003135bf6 llvm::sys::RunSignalHandlers() + 54
2 swift 0x0000000003137f26
3 libpthread.so.0 0x00007fae78844d10
4 libswiftCore.so 0x00007fae757929b4 _TTSg5Vs5UInt8___TFSa37_appendElementAssumeUniqueAndCapacityfTSi10newElementx_T_ + 100
5 libPackageDescription.so 0x00007fae75c107c9 _TFC18PackageDescription7PackagecfT4nameGSqSS_7targetsGSaCS_6Target_12dependenciesGSaCS0_10Dependency_16testDependenciesGSaS2__7excludeGSaSS__S0_ + 921
6 libPackageDescription.so 0x00007fae75c10e08 _TFC18PackageDescription7PackageCfT4nameGSqSS_7targetsGSaCS_6Target_12dependenciesGSaCS0_10Dependency_16testDependenciesGSaS2__7excludeGSaSS__S0_ + 152
7 libPackageDescription.so 0x00007fae78ab113a _TFC18PackageDescription7PackageCfT4nameGSqSS_7targetsGSaCS_6Target_12dependenciesGSaCS0_10Dependency_16testDependenciesGSaS2__7excludeGSaSS__S0_ + 48890826
8 swift 0x0000000000d089a4 llvm::MCJIT::runFunction(llvm::Function*, llvm::ArrayRef<llvm::GenericValue>) + 996
9 swift 0x0000000000d0c01f llvm::ExecutionEngine::runFunctionAsMain(llvm::Function*, std::vector<std::__cxx11::basic_string<char, std::char_traits<char>, std::allocator<char> >, std::allocator<std::__cxx11::basic_string<char, std::char_traits<char>, std::allocator<char> > > > const&, char const* const*) + 1263
10 swift 0x0000000000bf3318 swift::RunImmediately(swift::CompilerInstance&, std::vector<std::__cxx11::basic_string<char, std::char_traits<char>, std::allocator<char> >, std::allocator<std::__cxx11::basic_string<char, std::char_traits<char>, std::allocator<char> > > > const&, swift::IRGenOptions&, swift::SILOptions const&) + 2296
11 swift 0x0000000000789502
12 swift 0x0000000000784a73 frontend_main(llvm::ArrayRef<char const*>, char const*, void*) + 2643
13 swift 0x0000000000780056 main + 2518
14 libc.so.6 0x00007fae77177a40 __libc_start_main + 240
15 swift 0x000000000077f579 _start + 41
Stack dump:
0. Program arguments: /home/buildnode/jenkins/workspace/oss-swift-incremental-RA-linux-ubuntu-15_10/Ninja-ReleaseAssert/swift-linux-x86_64/bin/swift -frontend -interpret /tmp/ValidLayouts_MadeValidWithExclude_Case1.l0tApx/Case1/Package.swift -target x86_64-unknown-linux-gnu -disable-objc-interop -I /home/buildnode/jenkins/workspace/oss-swift-incremental-RA-linux-ubuntu-15_10/Ninja-ReleaseAssert/swiftpm-linux-x86_64/lib/swift/pm -module-name Package -lPackageDescription

swift-build: error: Child process exited with signal

    Building Release
0 swift 0x00000000031373f8 llvm::sys::PrintStackTrace(llvm::raw_ostream&) + 40
1 swift 0x0000000003135bf6 llvm::sys::RunSignalHandlers() + 54
2 swift 0x0000000003137f26
3 libpthread.so.0 0x00007fc6d97f5d10
4 libswiftCore.so 0x00007fc6d67439b4 _TTSg5Vs5UInt8___TFSa37_appendElementAssumeUniqueAndCapacityfTSi10newElementx_T_ + 100
5 libPackageDescription.so 0x00007fc6d6bc17c9 _TFC18PackageDescription7PackagecfT4nameGSqSS_7targetsGSaCS_6Target_12dependenciesGSaCS0_10Dependency_16testDependenciesGSaS2__7excludeGSaSS__S0_ + 921
6 libPackageDescription.so 0x00007fc6d6bc1e08 _TFC18PackageDescription7PackageCfT4nameGSqSS_7targetsGSaCS_6Target_12dependenciesGSaCS0_10Dependency_16testDependenciesGSaS2__7excludeGSaSS__S0_ + 152
7 libPackageDescription.so 0x00007fc6d9a6213a _TFC18PackageDescription7PackageCfT4nameGSqSS_7targetsGSaCS_6Target_12dependenciesGSaCS0_10Dependency_16testDependenciesGSaS2__7excludeGSaSS__S0_ + 48890826
8 swift 0x0000000000d089a4 llvm::MCJIT::runFunction(llvm::Function*, llvm::ArrayRef<llvm::GenericValue>) + 996
9 swift 0x0000000000d0c01f llvm::ExecutionEngine::runFunctionAsMain(llvm::Function*, std::vector<std::__cxx11::basic_string<char, std::char_traits<char>, std::allocator<char> >, std::allocator<std::__cxx11::basic_string<char, std::char_traits<char>, std::allocator<char> > > > const&, char const* const*) + 1263
10 swift 0x0000000000bf3318 swift::RunImmediately(swift::CompilerInstance&, std::vector<std::__cxx11::basic_string<char, std::char_traits<char>, std::allocator<char> >, std::allocator<std::__cxx11::basic_string<char, std::char_traits<char>, std::allocator<char> > > > const&, swift::IRGenOptions&, swift::SILOptions const&) + 2296
11 swift 0x0000000000789502
12 swift 0x0000000000784a73 frontend_main(llvm::ArrayRef<char const*>, char const*, void*) + 2643
13 swift 0x0000000000780056 main + 2518
14 libc.so.6 0x00007fc6d8128a40 __libc_start_main + 240
15 swift 0x000000000077f579 _start + 41
Stack dump:
0. Program arguments: /home/buildnode/jenkins/workspace/oss-swift-incremental-RA-linux-ubuntu-15_10/Ninja-ReleaseAssert/swift-linux-x86_64/bin/swift -frontend -interpret /tmp/ValidLayouts_MadeValidWithExclude_Case1.l0tApx/Case1/Package.swift -target x86_64-unknown-linux-gnu -disable-objc-interop -I /home/buildnode/jenkins/workspace/oss-swift-incremental-RA-linux-ubuntu-15_10/Ninja-ReleaseAssert/swiftpm-linux-x86_64/lib/swift/pm -module-name Package -lPackageDescription

swift-build: error: Child process exited with signal

    Building Debug
0 swift 0x00000000031373f8 llvm::sys::PrintStackTrace(llvm::raw_ostream&) + 40
1 swift 0x0000000003135bf6 llvm::sys::RunSignalHandlers() + 54
2 swift 0x0000000003137f26
3 libpthread.so.0 0x00007f4544291d10
4 libswiftCore.so 0x00007f45411df9b4 _TTSg5Vs5UInt8___TFSa37_appendElementAssumeUniqueAndCapacityfTSi10newElementx_T_ + 100
5 libPackageDescription.so 0x00007f454165d7c9 _TFC18PackageDescription7PackagecfT4nameGSqSS_7targetsGSaCS_6Target_12dependenciesGSaCS0_10Dependency_16testDependenciesGSaS2__7excludeGSaSS__S0_ + 921
6 libPackageDescription.so 0x00007f454165de08 _TFC18PackageDescription7PackageCfT4nameGSqSS_7targetsGSaCS_6Target_12dependenciesGSaCS0_10Dependency_16testDependenciesGSaS2__7excludeGSaSS__S0_ + 152
7 libPackageDescription.so 0x00007f45444fe15e _TFC18PackageDescription7PackageCfT4nameGSqSS_7targetsGSaCS_6Target_12dependenciesGSaCS0_10Dependency_16testDependenciesGSaS2__7excludeGSaSS__S0_ + 48890862
8 swift 0x0000000000d089a4 llvm::MCJIT::runFunction(llvm::Function*, llvm::ArrayRef<llvm::GenericValue>) + 996
9 swift 0x0000000000d0c01f llvm::ExecutionEngine::runFunctionAsMain(llvm::Function*, std::vector<std::__cxx11::basic_string<char, std::char_traits<char>, std::allocator<char> >, std::allocator<std::__cxx11::basic_string<char, std::char_traits<char>, std::allocator<char> > > > const&, char const* const*) + 1263
10 swift 0x0000000000bf3318 swift::RunImmediately(swift::CompilerInstance&, std::vector<std::__cxx11::basic_string<char, std::char_traits<char>, std::allocator<char> >, std::allocator<std::__cxx11::basic_string<char, std::char_traits<char>, std::allocator<char> > > > const&, swift::IRGenOptions&, swift::SILOptions const&) + 2296
11 swift 0x0000000000789502
12 swift 0x0000000000784a73 frontend_main(llvm::ArrayRef<char const*>, char const*, void*) + 2643
13 swift 0x0000000000780056 main + 2518
14 libc.so.6 0x00007f4542bc4a40 __libc_start_main + 240
15 swift 0x000000000077f579 _start + 41
Stack dump:
0. Program arguments: /home/buildnode/jenkins/workspace/oss-swift-incremental-RA-linux-ubuntu-15_10/Ninja-ReleaseAssert/swift-linux-x86_64/bin/swift -frontend -interpret /tmp/ValidLayouts_MadeValidWithExclude_Case2.HNrE2E/Case2/Package.swift -target x86_64-unknown-linux-gnu -disable-objc-interop -I /home/buildnode/jenkins/workspace/oss-swift-incremental-RA-linux-ubuntu-15_10/Ninja-ReleaseAssert/swiftpm-linux-x86_64/lib/swift/pm -module-name Package -lPackageDescription

swift-build: error: Child process exited with signal

    Building Release
0 swift 0x00000000031373f8 llvm::sys::PrintStackTrace(llvm::raw_ostream&) + 40
1 swift 0x0000000003135bf6 llvm::sys::RunSignalHandlers() + 54
2 swift 0x0000000003137f26
3 libpthread.so.0 0x00007f7f63f3ad10
4 libswiftCore.so 0x00007f7f60e889b4 _TTSg5Vs5UInt8___TFSa37_appendElementAssumeUniqueAndCapacityfTSi10newElementx_T_ + 100
5 libPackageDescription.so 0x00007f7f613067c9 _TFC18PackageDescription7PackagecfT4nameGSqSS_7targetsGSaCS_6Target_12dependenciesGSaCS0_10Dependency_16testDependenciesGSaS2__7excludeGSaSS__S0_ + 921
6 libPackageDescription.so 0x00007f7f61306e08 _TFC18PackageDescription7PackageCfT4nameGSqSS_7targetsGSaCS_6Target_12dependenciesGSaCS0_10Dependency_16testDependenciesGSaS2__7excludeGSaSS__S0_ + 152
7 libPackageDescription.so 0x00007f7f641a715e _TFC18PackageDescription7PackageCfT4nameGSqSS_7targetsGSaCS_6Target_12dependenciesGSaCS0_10Dependency_16testDependenciesGSaS2__7excludeGSaSS__S0_ + 48890862
8 swift 0x0000000000d089a4 llvm::MCJIT::runFunction(llvm::Function*, llvm::ArrayRef<llvm::GenericValue>) + 996
9 swift 0x0000000000d0c01f llvm::ExecutionEngine::runFunctionAsMain(llvm::Function*, std::vector<std::__cxx11::basic_string<char, std::char_traits<char>, std::allocator<char> >, std::allocator<std::__cxx11::basic_string<char, std::char_traits<char>, std::allocator<char> > > > const&, char const* const*) + 1263
10 swift 0x0000000000bf3318 swift::RunImmediately(swift::CompilerInstance&, std::vector<std::__cxx11::basic_string<char, std::char_traits<char>, std::allocator<char> >, std::allocator<std::__cxx11::basic_string<char, std::char_traits<char>, std::allocator<char> > > > const&, swift::IRGenOptions&, swift::SILOptions const&) + 2296
11 swift 0x0000000000789502
12 swift 0x0000000000784a73 frontend_main(llvm::ArrayRef<char const*>, char const*, void*) + 2643
13 swift 0x0000000000780056 main + 2518
14 libc.so.6 0x00007f7f6286da40 __libc_start_main + 240
15 swift 0x000000000077f579 _start + 41
Stack dump:
0. Program arguments: /home/buildnode/jenkins/workspace/oss-swift-incremental-RA-linux-ubuntu-15_10/Ninja-ReleaseAssert/swift-linux-x86_64/bin/swift -frontend -interpret /tmp/ValidLayouts_MadeValidWithExclude_Case2.HNrE2E/Case2/Package.swift -target x86_64-unknown-linux-gnu -disable-objc-interop -I /home/buildnode/jenkins/workspace/oss-swift-incremental-RA-linux-ubuntu-15_10/Ninja-ReleaseAssert/swiftpm-linux-x86_64/lib/swift/pm -module-name Package -lPackageDescription

swift-build: error: Child process exited with signal

/home/buildnode/jenkins/workspace/oss-swift-incremental-RA-linux-ubuntu-15_10/swiftpm/Tests/Functional/TestValidLayouts.swift:90: error: ValidLayoutsTestCase.testMadeValidWithExclude : failed - `swift build -c Debug' failed:

exit(1): /home/buildnode/jenkins/workspace/oss-swift-incremental-RA-linux-ubuntu-15_10/Ninja-ReleaseAssert/swiftpm-linux-x86_64/bin/swift-build --chdir /tmp/ValidLayouts_MadeValidWithExclude_Case1.l0tApx/Case1 --configuration debug

/home/buildnode/jenkins/workspace/oss-swift-incremental-RA-linux-ubuntu-15_10/swiftpm/Tests/Functional/TestValidLayouts.swift:90: error: ValidLayoutsTestCase.testMadeValidWithExclude : failed - `swift build -c Release' failed:

exit(1): /home/buildnode/jenkins/workspace/oss-swift-incremental-RA-linux-ubuntu-15_10/Ninja-ReleaseAssert/swiftpm-linux-x86_64/bin/swift-build --chdir /tmp/ValidLayouts_MadeValidWithExclude_Case1.l0tApx/Case1 --configuration release

/home/buildnode/jenkins/workspace/oss-swift-incremental-RA-linux-ubuntu-15_10/swiftpm/Tests/Functional/TestValidLayouts.swift:93: error: ValidLayoutsTestCase.testMadeValidWithExclude : failed - `swift build -c Debug' failed:

exit(1): /home/buildnode/jenkins/workspace/oss-swift-incremental-RA-linux-ubuntu-15_10/Ninja-ReleaseAssert/swiftpm-linux-x86_64/bin/swift-build --chdir /tmp/ValidLayouts_MadeValidWithExclude_Case2.HNrE2E/Case2 --configuration debug

/home/buildnode/jenkins/workspace/oss-swift-incremental-RA-linux-ubuntu-15_10/swiftpm/Tests/Functional/TestValidLayouts.swift:93: error: ValidLayoutsTestCase.testMadeValidWithExclude : failed - `swift build -c Release' failed:

exit(1): /home/buildnode/jenkins/workspace/oss-swift-incremental-RA-linux-ubuntu-15_10/Ninja-ReleaseAssert/swiftpm-linux-x86_64/bin/swift-build --chdir /tmp/ValidLayouts_MadeValidWithExclude_Case2.HNrE2E/Case2 --configuration release

Test Case 'ValidLayoutsTestCase.testMadeValidWithExclude' failed (0.724 seconds).
Executed 8 tests, with 20 failures (0 unexpected) in 8.743 (8.744) seconds
Test Case 'VersionGraphTests.testNoGraph' started.
Test Case 'VersionGraphTests.testNoGraph' passed (0.0 seconds).
Test Case 'VersionGraphTests.testOneDependency' started.
Test Case 'VersionGraphTests.testOneDependency' passed (0.0 seconds).
Test Case 'VersionGraphTests.testOneDepenencyWithMultipleAvailableVersions' started.
Test Case 'VersionGraphTests.testOneDepenencyWithMultipleAvailableVersions' passed (0.0 seconds).
Test Case 'VersionGraphTests.testOneDepenencyWithMultipleAvailableVersions' started.
Test Case 'VersionGraphTests.testOneDepenencyWithMultipleAvailableVersions' passed (0.0 seconds).
Test Case 'VersionGraphTests.testTwoDependencies' started.
Test Case 'VersionGraphTests.testTwoDependencies' passed (0.0 seconds).
Test Case 'VersionGraphTests.testTwoDirectDependencies' started.
Test Case 'VersionGraphTests.testTwoDirectDependencies' passed (0.0 seconds).
Test Case 'VersionGraphTests.testTwoDirectDependenciesWhereOneAlsoDependsOnTheOther' started.
Test Case 'VersionGraphTests.testTwoDirectDependenciesWhereOneAlsoDependsOnTheOther' passed (0.0 seconds).
Test Case 'VersionGraphTests.testSimpleVersionRestrictedGraph' started.
Test Case 'VersionGraphTests.testSimpleVersionRestrictedGraph' passed (0.0 seconds).
Test Case 'VersionGraphTests.testComplexVersionRestrictedGraph' started.
Test Case 'VersionGraphTests.testComplexVersionRestrictedGraph' passed (0.0 seconds).
Test Case 'VersionGraphTests.testVersionConstrain' started.
Test Case 'VersionGraphTests.testVersionConstrain' passed (0.0 seconds).
Test Case 'VersionGraphTests.testTwoDependenciesRequireMutuallyExclusiveVersionsOfTheSameDependency_Simple' started.
Test Case 'VersionGraphTests.testTwoDependenciesRequireMutuallyExclusiveVersionsOfTheSameDependency_Simple' passed (0.0 seconds).
Test Case 'VersionGraphTests.testTwoDependenciesRequireMutuallyExclusiveVersionsOfTheSameDependency_Complex' started.
Test Case 'VersionGraphTests.testTwoDependenciesRequireMutuallyExclusiveVersionsOfTheSameDependency_Complex' passed (0.0 seconds).
Test Case 'VersionGraphTests.testVersionUnavailable' started.
Test Case 'VersionGraphTests.testVersionUnavailable' passed (0.0 seconds).
Executed 13 tests, with 0 failures (0 unexpected) in 0.002 (0.002) seconds
Test Case 'VersionTests.testEquality' started.
Test Case 'VersionTests.testEquality' passed (0.0 seconds).
Test Case 'VersionTests.testNegativeValuesBecomeZero' started.
Test Case 'VersionTests.testNegativeValuesBecomeZero' passed (0.0 seconds).
Test Case 'VersionTests.testComparable' started.
Test Case 'VersionTests.testComparable' passed (0.001 seconds).
Test Case 'VersionTests.testDescription' started.
Test Case 'VersionTests.testDescription' passed (0.0 seconds).
Test Case 'VersionTests.testFromString' started.
Test Case 'VersionTests.testFromString' passed (0.0 seconds).
Test Case 'VersionTests.testSort' started.
Test Case 'VersionTests.testSort' passed (0.003 seconds).
Test Case 'VersionTests.testRange' started.
Test Case 'VersionTests.testRange' passed (0.0 seconds).
Test Case 'VersionTests.testSuccessor' started.
Test Case 'VersionTests.testSuccessor' passed (0.0 seconds).
Test Case 'VersionTests.testPredecessor' started.
Test Case 'VersionTests.testPredecessor' passed (0.0 seconds).
Executed 9 tests, with 0 failures (0 unexpected) in 0.004 (0.004) seconds
Test Case 'WalkTests.testNonRecursive' started.
Test Case 'WalkTests.testNonRecursive' passed (0.001 seconds).
Test Case 'WalkTests.testRecursive' started.
Test Case 'WalkTests.testRecursive' passed (0.012 seconds).
Test Case 'WalkTests.testSymlinksNotWalked' started.
Test Case 'WalkTests.testSymlinksNotWalked' passed (0.0 seconds).
Test Case 'WalkTests.testWalkingADirectorySymlinkResolvesOnce' started.
Test Case 'WalkTests.testWalkingADirectorySymlinkResolvesOnce' passed (0.001 seconds).
Executed 4 tests, with 0 failures (0 unexpected) in 0.014 (0.014) seconds
Test Case 'ModuleMapsTestCase.testDirectDependency' started.
    Building Debug
0 swift 0x00000000031373f8 llvm::sys::PrintStackTrace(llvm::raw_ostream&) + 40
1 swift 0x0000000003135bf6 llvm::sys::RunSignalHandlers() + 54
2 swift 0x0000000003137f26
3 libpthread.so.0 0x00007f44281e7d10
4 libswiftCore.so 0x00007f44251359b4 _TTSg5Vs5UInt8___TFSa37_appendElementAssumeUniqueAndCapacityfTSi10newElementx_T_ + 100
5 libPackageDescription.so 0x00007f44255b37c9 _TFC18PackageDescription7PackagecfT4nameGSqSS_7targetsGSaCS_6Target_12dependenciesGSaCS0_10Dependency_16testDependenciesGSaS2__7excludeGSaSS__S0_ + 921
6 libPackageDescription.so 0x00007f44255b3e08 _TFC18PackageDescription7PackageCfT4nameGSqSS_7targetsGSaCS_6Target_12dependenciesGSaCS0_10Dependency_16testDependenciesGSaS2__7excludeGSaSS__S0_ + 152
7 libPackageDescription.so 0x00007f4428454163 _TFC18PackageDescription7PackageCfT4nameGSqSS_7targetsGSaCS_6Target_12dependenciesGSaCS0_10Dependency_16testDependenciesGSaS2__7excludeGSaSS__S0_ + 48890867
8 swift 0x0000000000d089a4 llvm::MCJIT::runFunction(llvm::Function*, llvm::ArrayRef<llvm::GenericValue>) + 996
9 swift 0x0000000000d0c01f llvm::ExecutionEngine::runFunctionAsMain(llvm::Function*, std::vector<std::__cxx11::basic_string<char, std::char_traits<char>, std::allocator<char> >, std::allocator<std::__cxx11::basic_string<char, std::char_traits<char>, std::allocator<char> > > > const&, char const* const*) + 1263
10 swift 0x0000000000bf3318 swift::RunImmediately(swift::CompilerInstance&, std::vector<std::__cxx11::basic_string<char, std::char_traits<char>, std::allocator<char> >, std::allocator<std::__cxx11::basic_string<char, std::char_traits<char>, std::allocator<char> > > > const&, swift::IRGenOptions&, swift::SILOptions const&) + 2296
11 swift 0x0000000000789502
12 swift 0x0000000000784a73 frontend_main(llvm::ArrayRef<char const*>, char const*, void*) + 2643
13 swift 0x0000000000780056 main + 2518
14 libc.so.6 0x00007f4426b1aa40 __libc_start_main + 240
15 swift 0x000000000077f579 _start + 41
Stack dump:
0. Program arguments: /home/buildnode/jenkins/workspace/oss-swift-incremental-RA-linux-ubuntu-15_10/Ninja-ReleaseAssert/swift-linux-x86_64/bin/swift -frontend -interpret /tmp/ModuleMaps_Direct.fxyHb5/App/Package.swift -target x86_64-unknown-linux-gnu -disable-objc-interop -I /home/buildnode/jenkins/workspace/oss-swift-incremental-RA-linux-ubuntu-15_10/Ninja-ReleaseAssert/swiftpm-linux-x86_64/lib/swift/pm -module-name Package -lPackageDescription

swift-build: error: Child process exited with signal

    Building Release
0 swift 0x00000000031373f8 llvm::sys::PrintStackTrace(llvm::raw_ostream&) + 40
1 swift 0x0000000003135bf6 llvm::sys::RunSignalHandlers() + 54
2 swift 0x0000000003137f26
3 libpthread.so.0 0x00007ff1c8bb1d10
4 libswiftCore.so 0x00007ff1c5aff9b4 _TTSg5Vs5UInt8___TFSa37_appendElementAssumeUniqueAndCapacityfTSi10newElementx_T_ + 100
5 libPackageDescription.so 0x00007ff1c5f7d7c9 _TFC18PackageDescription7PackagecfT4nameGSqSS_7targetsGSaCS_6Target_12dependenciesGSaCS0_10Dependency_16testDependenciesGSaS2__7excludeGSaSS__S0_ + 921
6 libPackageDescription.so 0x00007ff1c5f7de08 _TFC18PackageDescription7PackageCfT4nameGSqSS_7targetsGSaCS_6Target_12dependenciesGSaCS0_10Dependency_16testDependenciesGSaS2__7excludeGSaSS__S0_ + 152
7 libPackageDescription.so 0x00007ff1c8e1e163 _TFC18PackageDescription7PackageCfT4nameGSqSS_7targetsGSaCS_6Target_12dependenciesGSaCS0_10Dependency_16testDependenciesGSaS2__7excludeGSaSS__S0_ + 48890867
8 swift 0x0000000000d089a4 llvm::MCJIT::runFunction(llvm::Function*, llvm::ArrayRef<llvm::GenericValue>) + 996
9 swift 0x0000000000d0c01f llvm::ExecutionEngine::runFunctionAsMain(llvm::Function*, std::vector<std::__cxx11::basic_string<char, std::char_traits<char>, std::allocator<char> >, std::allocator<std::__cxx11::basic_string<char, std::char_traits<char>, std::allocator<char> > > > const&, char const* const*) + 1263
10 swift 0x0000000000bf3318 swift::RunImmediately(swift::CompilerInstance&, std::vector<std::__cxx11::basic_string<char, std::char_traits<char>, std::allocator<char> >, std::allocator<std::__cxx11::basic_string<char, std::char_traits<char>, std::allocator<char> > > > const&, swift::IRGenOptions&, swift::SILOptions const&) + 2296
11 swift 0x0000000000789502
12 swift 0x0000000000784a73 frontend_main(llvm::ArrayRef<char const*>, char const*, void*) + 2643
13 swift 0x0000000000780056 main + 2518
14 libc.so.6 0x00007ff1c74e4a40 __libc_start_main + 240
15 swift 0x000000000077f579 _start + 41
Stack dump:
0. Program arguments: /home/buildnode/jenkins/workspace/oss-swift-incremental-RA-linux-ubuntu-15_10/Ninja-ReleaseAssert/swift-linux-x86_64/bin/swift -frontend -interpret /tmp/ModuleMaps_Direct.fxyHb5/App/Package.swift -target x86_64-unknown-linux-gnu -disable-objc-interop -I /home/buildnode/jenkins/workspace/oss-swift-incremental-RA-linux-ubuntu-15_10/Ninja-ReleaseAssert/swiftpm-linux-x86_64/lib/swift/pm -module-name Package -lPackageDescription

swift-build: error: Child process exited with signal

/home/buildnode/jenkins/workspace/oss-swift-incremental-RA-linux-ubuntu-15_10/swiftpm/Tests/Functional/TestModuleMaps.swift:43: error: ModuleMapsTestCase.testDirectDependency : failed - `swift build -c Debug' failed:

exit(1): /home/buildnode/jenkins/workspace/oss-swift-incremental-RA-linux-ubuntu-15_10/Ninja-ReleaseAssert/swiftpm-linux-x86_64/bin/swift-build --chdir /tmp/ModuleMaps_Direct.fxyHb5/App --configuration debug -Xlinker -L -Xlinker /tmp/ModuleMaps_Direct.fxyHb5/App/.build/debug -Xlinker -rpath -Xlinker /tmp/ModuleMaps_Direct.fxyHb5/App/.build/debug

/home/buildnode/jenkins/workspace/oss-swift-incremental-RA-linux-ubuntu-15_10/swiftpm/Tests/Functional/TestModuleMaps.swift:43: error: ModuleMapsTestCase.testDirectDependency : failed - `swift build -c Release' failed:

exit(1): /home/buildnode/jenkins/workspace/oss-swift-incremental-RA-linux-ubuntu-15_10/Ninja-ReleaseAssert/swiftpm-linux-x86_64/bin/swift-build --chdir /tmp/ModuleMaps_Direct.fxyHb5/App --configuration release -Xlinker -L -Xlinker /tmp/ModuleMaps_Direct.fxyHb5/App/.build/debug -Xlinker -rpath -Xlinker /tmp/ModuleMaps_Direct.fxyHb5/App/.build/debug

/home/buildnode/jenkins/workspace/oss-swift-incremental-RA-linux-ubuntu-15_10/swiftpm/Tests/Functional/TestModuleMaps.swift:25: error: ModuleMapsTestCase.testDirectDependency : failed - exit(127): /tmp/ModuleMaps_Direct.fxyHb5/App/.build/debug/App
Test Case 'ModuleMapsTestCase.testDirectDependency' failed (0.43 seconds).
Test Case 'ModuleMapsTestCase.testTransitiveDependency' started.
    Building Debug
0 swift 0x00000000031373f8 llvm::sys::PrintStackTrace(llvm::raw_ostream&) + 40
1 swift 0x0000000003135bf6 llvm::sys::RunSignalHandlers() + 54
2 swift 0x0000000003137f26
3 libpthread.so.0 0x00007f314e273d10
4 libswiftCore.so 0x00007f314b1c19b4 _TTSg5Vs5UInt8___TFSa37_appendElementAssumeUniqueAndCapacityfTSi10newElementx_T_ + 100
5 libPackageDescription.so 0x00007f314b63f7c9 _TFC18PackageDescription7PackagecfT4nameGSqSS_7targetsGSaCS_6Target_12dependenciesGSaCS0_10Dependency_16testDependenciesGSaS2__7excludeGSaSS__S0_ + 921
6 libPackageDescription.so 0x00007f314b63fe08 _TFC18PackageDescription7PackageCfT4nameGSqSS_7targetsGSaCS_6Target_12dependenciesGSaCS0_10Dependency_16testDependenciesGSaS2__7excludeGSaSS__S0_ + 152
7 libPackageDescription.so 0x00007f314e4e0163 _TFC18PackageDescription7PackageCfT4nameGSqSS_7targetsGSaCS_6Target_12dependenciesGSaCS0_10Dependency_16testDependenciesGSaS2__7excludeGSaSS__S0_ + 48890867
8 swift 0x0000000000d089a4 llvm::MCJIT::runFunction(llvm::Function*, llvm::ArrayRef<llvm::GenericValue>) + 996
9 swift 0x0000000000d0c01f llvm::ExecutionEngine::runFunctionAsMain(llvm::Function*, std::vector<std::__cxx11::basic_string<char, std::char_traits<char>, std::allocator<char> >, std::allocator<std::__cxx11::basic_string<char, std::char_traits<char>, std::allocator<char> > > > const&, char const* const*) + 1263
10 swift 0x0000000000bf3318 swift::RunImmediately(swift::CompilerInstance&, std::vector<std::__cxx11::basic_string<char, std::char_traits<char>, std::allocator<char> >, std::allocator<std::__cxx11::basic_string<char, std::char_traits<char>, std::allocator<char> > > > const&, swift::IRGenOptions&, swift::SILOptions const&) + 2296
11 swift 0x0000000000789502
12 swift 0x0000000000784a73 frontend_main(llvm::ArrayRef<char const*>, char const*, void*) + 2643
13 swift 0x0000000000780056 main + 2518
14 libc.so.6 0x00007f314cba6a40 __libc_start_main + 240
15 swift 0x000000000077f579 _start + 41
Stack dump:
0. Program arguments: /home/buildnode/jenkins/workspace/oss-swift-incremental-RA-linux-ubuntu-15_10/Ninja-ReleaseAssert/swift-linux-x86_64/bin/swift -frontend -interpret /tmp/ModuleMaps_Transitive.f7IL7e/packageA/Package.swift -target x86_64-unknown-linux-gnu -disable-objc-interop -I /home/buildnode/jenkins/workspace/oss-swift-incremental-RA-linux-ubuntu-15_10/Ninja-ReleaseAssert/swiftpm-linux-x86_64/lib/swift/pm -module-name Package -lPackageDescription

swift-build: error: Child process exited with signal

    Building Release
0 swift 0x00000000031373f8 llvm::sys::PrintStackTrace(llvm::raw_ostream&) + 40
1 swift 0x0000000003135bf6 llvm::sys::RunSignalHandlers() + 54
2 swift 0x0000000003137f26
3 libpthread.so.0 0x00007fdd43a70d10
4 libswiftCore.so 0x00007fdd409be9b4 _TTSg5Vs5UInt8___TFSa37_appendElementAssumeUniqueAndCapacityfTSi10newElementx_T_ + 100
5 libPackageDescription.so 0x00007fdd40e3c7c9 _TFC18PackageDescription7PackagecfT4nameGSqSS_7targetsGSaCS_6Target_12dependenciesGSaCS0_10Dependency_16testDependenciesGSaS2__7excludeGSaSS__S0_ + 921
6 libPackageDescription.so 0x00007fdd40e3ce08 _TFC18PackageDescription7PackageCfT4nameGSqSS_7targetsGSaCS_6Target_12dependenciesGSaCS0_10Dependency_16testDependenciesGSaS2__7excludeGSaSS__S0_ + 152
7 libPackageDescription.so 0x00007fdd43cdd163 _TFC18PackageDescription7PackageCfT4nameGSqSS_7targetsGSaCS_6Target_12dependenciesGSaCS0_10Dependency_16testDependenciesGSaS2__7excludeGSaSS__S0_ + 48890867
8 swift 0x0000000000d089a4 llvm::MCJIT::runFunction(llvm::Function*, llvm::ArrayRef<llvm::GenericValue>) + 996
9 swift 0x0000000000d0c01f llvm::ExecutionEngine::runFunctionAsMain(llvm::Function*, std::vector<std::__cxx11::basic_string<char, std::char_traits<char>, std::allocator<char> >, std::allocator<std::__cxx11::basic_string<char, std::char_traits<char>, std::allocator<char> > > > const&, char const* const*) + 1263
10 swift 0x0000000000bf3318 swift::RunImmediately(swift::CompilerInstance&, std::vector<std::__cxx11::basic_string<char, std::char_traits<char>, std::allocator<char> >, std::allocator<std::__cxx11::basic_string<char, std::char_traits<char>, std::allocator<char> > > > const&, swift::IRGenOptions&, swift::SILOptions const&) + 2296
11 swift 0x0000000000789502
12 swift 0x0000000000784a73 frontend_main(llvm::ArrayRef<char const*>, char const*, void*) + 2643
13 swift 0x0000000000780056 main + 2518
14 libc.so.6 0x00007fdd423a3a40 __libc_start_main + 240
15 swift 0x000000000077f579 _start + 41
Stack dump:
0. Program arguments: /home/buildnode/jenkins/workspace/oss-swift-incremental-RA-linux-ubuntu-15_10/Ninja-ReleaseAssert/swift-linux-x86_64/bin/swift -frontend -interpret /tmp/ModuleMaps_Transitive.f7IL7e/packageA/Package.swift -target x86_64-unknown-linux-gnu -disable-objc-interop -I /home/buildnode/jenkins/workspace/oss-swift-incremental-RA-linux-ubuntu-15_10/Ninja-ReleaseAssert/swiftpm-linux-x86_64/lib/swift/pm -module-name Package -lPackageDescription

swift-build: error: Child process exited with signal

/home/buildnode/jenkins/workspace/oss-swift-incremental-RA-linux-ubuntu-15_10/swiftpm/Tests/Functional/TestModuleMaps.swift:55: error: ModuleMapsTestCase.testTransitiveDependency : failed - `swift build -c Debug' failed:

exit(1): /home/buildnode/jenkins/workspace/oss-swift-incremental-RA-linux-ubuntu-15_10/Ninja-ReleaseAssert/swiftpm-linux-x86_64/bin/swift-build --chdir /tmp/ModuleMaps_Transitive.f7IL7e/packageA --configuration debug -Xlinker -L -Xlinker /tmp/ModuleMaps_Transitive.f7IL7e/packageA/.build/debug -Xlinker -rpath -Xlinker /tmp/ModuleMaps_Transitive.f7IL7e/packageA/.build/debug

/home/buildnode/jenkins/workspace/oss-swift-incremental-RA-linux-ubuntu-15_10/swiftpm/Tests/Functional/TestModuleMaps.swift:55: error: ModuleMapsTestCase.testTransitiveDependency : failed - `swift build -c Release' failed:

exit(1): /home/buildnode/jenkins/workspace/oss-swift-incremental-RA-linux-ubuntu-15_10/Ninja-ReleaseAssert/swiftpm-linux-x86_64/bin/swift-build --chdir /tmp/ModuleMaps_Transitive.f7IL7e/packageA --configuration release -Xlinker -L -Xlinker /tmp/ModuleMaps_Transitive.f7IL7e/packageA/.build/debug -Xlinker -rpath -Xlinker /tmp/ModuleMaps_Transitive.f7IL7e/packageA/.build/debug

/home/buildnode/jenkins/workspace/oss-swift-incremental-RA-linux-ubuntu-15_10/swiftpm/Tests/Functional/TestModuleMaps.swift:67: error: ModuleMapsTestCase.testTransitiveDependency : failed - exit(127): /tmp/ModuleMaps_Transitive.f7IL7e/packageA/.build/debug/packageA
/home/buildnode/jenkins/workspace/oss-swift-incremental-RA-linux-ubuntu-15_10/swiftpm/Tests/Functional/TestModuleMaps.swift:68: error: ModuleMapsTestCase.testTransitiveDependency : failed - exit(127): /tmp/ModuleMaps_Transitive.f7IL7e/packageA/.build/release/packageA
Test Case 'ModuleMapsTestCase.testTransitiveDependency' failed (0.498 seconds).
Executed 2 tests, with 7 failures (0 unexpected) in 0.928 (0.928) seconds

Thanks!
Mishal Shah

···

On Feb 23, 2016, at 9:07 AM, no-reply@swift.org wrote:

[FAILURE] oss-swift-incremental-RA-linux-ubuntu-15_10 [#2711]

Build URL: https://ci.swift.org/job/oss-swift-incremental-RA-linux-ubuntu-15_10/2711/
Project: oss-swift-incremental-RA-linux-ubuntu-15_10
Date of build: Tue, 23 Feb 2016 11:00:22 -0600
Build duration: 7 min 8 sec
Identified problems:

Compile Error: This build failed because of a compile error. Below is a list of all errors in the build log:
Indication 1 <https://ci.swift.org//job/oss-swift-incremental-RA-linux-ubuntu-15_10/2711/consoleFull#665899624ee1a197b-acac-4b17-83cf-a53b95139a76>
Tests:

Name: Swift
Failed: 0 test(s), Passed: 7729 test(s), Total: 7729 test(s)
Name: Swift-Unit
Failed: 0 test(s), Passed: 236 test(s), Total: 236 test(s)

Changes

Commit 5b4c73ed3b49b330eb29f9b6379852989abfec04 by eeckstein:
Revert "GenericSpecializer: When specializing a generic function,

edit: test/DebugInfo/specialization.swift
edit: test/SILOptimizer/specialize_apply_conf.swift
edit: test/SILOptimizer/specialize_inherited.sil
edit: lib/SILOptimizer/Transforms/GenericSpecializer.cpp
edit: lib/SILOptimizer/Utils/Generics.cpp
edit: test/SILOptimizer/specialize_chain.swift
edit: test/SILOptimizer/specialize.sil
edit: include/swift/SILOptimizer/Utils/GenericCloner.h
edit: lib/SILOptimizer/IPO/UsePrespecialized.cpp
edit: test/SILOptimizer/spec_archetype_method.swift
edit: test/SILOptimizer/specialize_metatypes_with_nondefault_representation.sil
edit: lib/SIL/SILModule.cpp
edit: lib/SILOptimizer/Utils/GenericCloner.cpp
edit: test/SILOptimizer/spec_conf1.swift
edit: include/swift/SILOptimizer/Utils/Generics.h
edit: test/SILOptimizer/spec_conf2.swift
delete: test/SILOptimizer/specialize_partial_apply.swift
edit: test/SILOptimizer/specialize_unconditional_checked_cast.swift