[Swift CI] Build Failure: 0. OSS - Swift Incremental RA - Ubuntu 15.10 (master) #2601


(Adrian Prantl) #1

Hmm, it doesn’t really look like this was my commit:

swift-build-tool: /home/buildnode/jenkins/workspace/oss-swift-incremental-RA-linux-ubuntu-15_10/llbuild/lib/Core/BuildEngine.cpp:1182: void (anonymous namespace)::BuildEngineImpl::taskDiscoveredDependency(llbuild::core::Task *, const KeyType &): Assertion `taskinfo_it != taskInfos.end() && "cannot request inputs for an unknown task"' failed.

-- adrian

···

On Feb 19, 2016, at 1:55 PM, no-reply@swift.org wrote:

[FAILURE] oss-swift-incremental-RA-linux-ubuntu-15_10 [#2601]

Build URL: https://ci.swift.org/job/oss-swift-incremental-RA-linux-ubuntu-15_10/2601/
Project: oss-swift-incremental-RA-linux-ubuntu-15_10
Date of build: Fri, 19 Feb 2016 15:45:58 -0600
Build duration: 9 min 14 sec
Identified problems:

Compile Error: This build failed because of a compile error. Below is a list of all errors in the build log:
Indication 1 <https://ci.swift.org//job/oss-swift-incremental-RA-linux-ubuntu-15_10/2601/consoleFull#665899624ee1a197b-acac-4b17-83cf-a53b95139a76>
Tests:

Name: Swift
Failed: 0 test(s), Passed: 7722 test(s), Total: 7722 test(s)
Name: Swift-Unit
Failed: 0 test(s), Passed: 236 test(s), Total: 236 test(s)

Changes

Commit 8e1d6c013b847ba6e26ad030253e98f061701682 by aprantl:
Make SILDebugLocation a value member of SILInstruction again.

edit: include/swift/SIL/SILBuilder.h
edit: lib/Serialization/DeserializeSIL.cpp
edit: include/swift/SIL/SILLocation.h
edit: include/swift/SIL/SILInstruction.h
edit: lib/SIL/SILBuilder.cpp
edit: lib/SIL/SILInstructions.cpp
edit: include/swift/SIL/SILDebugScope.h
edit: lib/Parse/ParseSIL.cpp
edit: lib/SIL/SILInstruction.cpp


(Daniel Dunbar) #2

I'm investigating right now.

- Daniel

···

On Feb 19, 2016, at 1:57 PM, Adrian Prantl <aprantl@apple.com> wrote:

Hmm, it doesn’t really look like this was my commit:

swift-build-tool: /home/buildnode/jenkins/workspace/oss-swift-incremental-RA-linux-ubuntu-15_10/llbuild/lib/Core/BuildEngine.cpp:1182: void (anonymous namespace)::BuildEngineImpl::taskDiscoveredDependency(llbuild::core::Task *, const KeyType &): Assertion `taskinfo_it != taskInfos.end() && "cannot request inputs for an unknown task"' failed.

-- adrian

On Feb 19, 2016, at 1:55 PM, no-reply@swift.org <mailto:no-reply@swift.org> wrote:

[FAILURE] oss-swift-incremental-RA-linux-ubuntu-15_10 [#2601]

Build URL: https://ci.swift.org/job/oss-swift-incremental-RA-linux-ubuntu-15_10/2601/
Project: oss-swift-incremental-RA-linux-ubuntu-15_10
Date of build: Fri, 19 Feb 2016 15:45:58 -0600
Build duration: 9 min 14 sec
Identified problems:

Compile Error: This build failed because of a compile error. Below is a list of all errors in the build log:
Indication 1 <https://ci.swift.org//job/oss-swift-incremental-RA-linux-ubuntu-15_10/2601/consoleFull#665899624ee1a197b-acac-4b17-83cf-a53b95139a76>
Tests:

Name: Swift
Failed: 0 test(s), Passed: 7722 test(s), Total: 7722 test(s)
Name: Swift-Unit
Failed: 0 test(s), Passed: 236 test(s), Total: 236 test(s)

Changes

Commit 8e1d6c013b847ba6e26ad030253e98f061701682 by aprantl:
Make SILDebugLocation a value member of SILInstruction again.

edit: include/swift/SIL/SILBuilder.h
edit: lib/Serialization/DeserializeSIL.cpp
edit: include/swift/SIL/SILLocation.h
edit: include/swift/SIL/SILInstruction.h
edit: lib/SIL/SILBuilder.cpp
edit: lib/SIL/SILInstructions.cpp
edit: include/swift/SIL/SILDebugScope.h
edit: lib/Parse/ParseSIL.cpp
edit: lib/SIL/SILInstruction.cpp


(Daniel Dunbar) #3

Should be fixed in llbuild 6c921aee0a25ae410d82e587c6b2d376cf804426.

- Daniel

···

On Feb 19, 2016, at 1:58 PM, Daniel Dunbar via swift-dev <swift-dev@swift.org> wrote:

I'm investigating right now.

- Daniel

On Feb 19, 2016, at 1:57 PM, Adrian Prantl <aprantl@apple.com <mailto:aprantl@apple.com>> wrote:

Hmm, it doesn’t really look like this was my commit:

swift-build-tool: /home/buildnode/jenkins/workspace/oss-swift-incremental-RA-linux-ubuntu-15_10/llbuild/lib/Core/BuildEngine.cpp:1182: void (anonymous namespace)::BuildEngineImpl::taskDiscoveredDependency(llbuild::core::Task *, const KeyType &): Assertion `taskinfo_it != taskInfos.end() && "cannot request inputs for an unknown task"' failed.

-- adrian

On Feb 19, 2016, at 1:55 PM, no-reply@swift.org <mailto:no-reply@swift.org> wrote:

[FAILURE] oss-swift-incremental-RA-linux-ubuntu-15_10 [#2601]

Build URL: https://ci.swift.org/job/oss-swift-incremental-RA-linux-ubuntu-15_10/2601/
Project: oss-swift-incremental-RA-linux-ubuntu-15_10
Date of build: Fri, 19 Feb 2016 15:45:58 -0600
Build duration: 9 min 14 sec
Identified problems:

Compile Error: This build failed because of a compile error. Below is a list of all errors in the build log:
Indication 1 <https://ci.swift.org//job/oss-swift-incremental-RA-linux-ubuntu-15_10/2601/consoleFull#665899624ee1a197b-acac-4b17-83cf-a53b95139a76>
Tests:

Name: Swift
Failed: 0 test(s), Passed: 7722 test(s), Total: 7722 test(s)
Name: Swift-Unit
Failed: 0 test(s), Passed: 236 test(s), Total: 236 test(s)

Changes

Commit 8e1d6c013b847ba6e26ad030253e98f061701682 by aprantl:
Make SILDebugLocation a value member of SILInstruction again.

edit: include/swift/SIL/SILBuilder.h
edit: lib/Serialization/DeserializeSIL.cpp
edit: include/swift/SIL/SILLocation.h
edit: include/swift/SIL/SILInstruction.h
edit: lib/SIL/SILBuilder.cpp
edit: lib/SIL/SILInstructions.cpp
edit: include/swift/SIL/SILDebugScope.h
edit: lib/Parse/ParseSIL.cpp
edit: lib/SIL/SILInstruction.cpp

_______________________________________________
swift-dev mailing list
swift-dev@swift.org
https://lists.swift.org/mailman/listinfo/swift-dev