[Swift CI] Build Failure: 0. OSS - Swift Incremental RA - Ubuntu 15.10 (master) #2358


(Mishal Shah) #1

This is related to unstable test in swiftpm.

https://bugs.swift.org/browse/SR-712

Test Case 'MiscellaneousTestCase.testManifestExcludes2' started.
<>/home/buildnode/jenkins/workspace/oss-swift-incremental-RA-linux-ubuntu-15_10/swiftpm/Sources/../Tests/Functional/TestMiscellaneous.swift:66: error: MiscellaneousTestCase.testManifestExcludes2 : failed - `swift build' failed:

exit(1): ["/home/buildnode/jenkins/workspace/oss-swift-incremental-RA-linux-ubuntu-15_10/Ninja-ReleaseAssert/swiftpm-linux-x86_64/.bootstrap/bin/swift-build", "--chdir", "/tmp/Miscellaneous_ExcludeDiagnostic2.H8yj4x/ExcludeDiagnostic2"]

/home/buildnode/jenkins/workspace/oss-swift-incremental-RA-linux-ubuntu-15_10/swiftpm/Sources/../Tests/Functional/TestMiscellaneous.swift:67: error: MiscellaneousTestCase.testManifestExcludes2 : failed - Expected file doesn’t exist: /tmp/Miscellaneous_ExcludeDiagnostic2.H8yj4x/ExcludeDiagnostic2/.build/debug/BarLib.a
Test Case 'MiscellaneousTestCase.testManifestExcludes2' failed (0.354 seconds).

Thanks,
Mishal Shah

···

On Feb 10, 2016, at 5:18 PM, no-reply@swift.org wrote:

[FAILURE] oss-swift-incremental-RA-linux-ubuntu-15_10 [#2358]

Build URL: https://ci.swift.org/job/oss-swift-incremental-RA-linux-ubuntu-15_10/2358/
Project: oss-swift-incremental-RA-linux-ubuntu-15_10
Date of build: Wed, 10 Feb 2016 19:04:18 -0600
Build duration: 14 min
Identified problems:

Compile Error: This build failed because of a compile error. Below is a list of all errors in the build log:
Indication 1 <https://ci.swift.org//job/oss-swift-incremental-RA-linux-ubuntu-15_10/2358/consoleFull#71749441ee1a197b-acac-4b17-83cf-a53b95139a76>
Tests:

Name: Swift
Failed: 0 test(s), Passed: 7712 test(s), Total: 7712 test(s)
Name: Swift-Unit
Failed: 0 test(s), Passed: 234 test(s), Total: 234 test(s)

Changes

Commit dd3508c785d81132bd6129b0abe50ca69960d1bc by practicalswift:
[gardening] Fix header consistency for newly introduced file.

edit: lib/LLVMPasses/LLVMInlineTree.cpp

Commit b575b552777d13468f594b660d87ca26adc2e6eb by gergely.orosz:
prettify the changelog a bit more.

edit: CHANGELOG.md