[Swift CI] Build Failure: 0. OSS - Swift Incremental RA - Ubuntu 14.04 (swift 5.1) #93


(Swift CI) #1

Report

[FAILURE] oss-swift-5.1-incremental-RA-linux-ubuntu-14_04 [#93]

Build URL:
https://ci.swift.org/job/oss-swift-5.1-incremental-RA-linux-ubuntu-14_04/93/
Project:
oss-swift-5.1-incremental-RA-linux-ubuntu-14_04
Date of build:
Tue, 12 Mar 2019 03:14:27 -0500
Build duration:
2 hr 17 min

Identified problems:

  • Regression test failed: This build failed because a regression test in the test suite FAILed. Below is a list of all errors:
  • Compile Error: This build failed because of a compile error. Below is a list of all errors in the build log:

Changes

  • Commit 8f03c3a48db40e421f2e6e0820222902d9c7f536 by klorentey:
    Initial import of diffing package into standard library

    • add: stdlib/public/core/OrderedCollectionDifference.swift
    • add: test/stdlib/Diffing.swift
    • add: stdlib/public/core/Diffing.swift
    • edit: stdlib/public/core/GroupInfo.json
    • edit: stdlib/public/core/CMakeLists.txt
  • Commit cd208e930b2518fd7d3c8581864dbb77f30faab7 by klorentey:
    Adapt the last of the Darwin- and XCTest-specific code in the diffing

    • edit: test/stdlib/Diffing.swift
  • Commit 721e84a643b0c0a7dc0743ac1f00409c80cd472b by klorentey:
    Match indentation style

    • edit: stdlib/public/core/Diffing.swift
    • edit: test/stdlib/Diffing.swift
  • Commit 82dfdd6da9d42db22a8935fcc1fbfc978d886669 by klorentey:
    s/shortestEditScript/difference/g per proposal feedback

    • edit: stdlib/public/core/Diffing.swift
    • edit: stdlib/public/core/OrderedCollectionDifference.swift
    • edit: test/stdlib/Diffing.swift
  • Commit a4fdfe2b449b94fa0f2871fbb62b46b3a254f33d by klorentey:
    Apply public documentation and type modifications from proposal

    • edit: stdlib/public/core/Diffing.swift
    • edit: stdlib/public/core/GroupInfo.json
    • edit: stdlib/public/core/CMakeLists.txt
    • edit: test/stdlib/Diffing.swift
    • delete: stdlib/public/core/OrderedCollectionDifference.swift
  • Commit 76a79cbc546694318066cc1c2e8b48dd8aae62ab by klorentey:
    Include renamed CollectionDifference.swift

    • add: stdlib/public/core/CollectionDifference.swift
  • Commit 9322750283e95729d5e5ff72ea5072fe70c32ce7 by klorentey:
    Header docs for internal methods validateChanges(_:) and

    • edit: stdlib/public/core/CollectionDifference.swift
  • Commit 88b295cb88e1f026f1a536aabfafbe42bc22026a by klorentey:
    Only instanciate one test suite--this was confusing the test framework,

    • edit: test/stdlib/Diffing.swift
  • Commit 50249194b1b7f67400c36c8621da12b20074290c by klorentey:
    [stdlib] Update diffing code to match stdlib coding conventions

    • edit: stdlib/public/core/Diffing.swift
    • edit: stdlib/public/core/CollectionDifference.swift
  • Commit 8432cdc51436fb9dd20ba2bc3a58c0489382d8c9 by klorentey:
    [stdlib] Set availability of diffing APIs

    • edit: stdlib/public/core/CollectionDifference.swift
    • edit: stdlib/public/core/Diffing.swift
  • Commit 3541c3a119e7ee0ab0ed2925bc45f4c375f3543b by klorentey:
    Incorporate feedback from @lorentey and @moiseev

    • edit: stdlib/public/core/Diffing.swift
    • edit: stdlib/public/core/CollectionDifference.swift
    • edit: test/stdlib/Diffing.swift
  • Commit 2a46fd06f4635a75c3dc0b703248ebdc328ff16f by klorentey:
    [test] Add missing runtime availability check around diffing tests

    • edit: test/stdlib/Diffing.swift
  • Commit 9f983e11a5a63740c68b6b7f0651f0a4b0562928 by vsk:
    [SimplifyCFG] Retain debug info when threading jumps with critical edges

    • add: test/Transforms/SimplifyCFG/debug-info-thread-phi.ll
    • edit: lib/Transforms/Utils/SimplifyCFG.cpp
  • Commit fc0f8d6043d80ca3de9474d31ea6234cb8297bc8 by compnerd:
    FileHandle: make FileHandle build on Windows again

    • edit: Foundation/FileHandle.swift

(Karoy Lorentey) #2

Hm:

05:32:22 Test Case 'ExpectationsTestCase.test_waitingForAnUnfulfilledExpectation_fails' started at 2019-03-12 10:32:20.105
05:32:22 
/home/buildnode/jenkins/workspace/oss-swift-5.1-incremental-RA-linux-ubuntu-14_04/swift-corelibs-xctest/Tests/Functional/Asynchronous/Expectations/main.swift:23: error: ExpectationsTestCase.test_waitingForAnUnfulfilledExpectation_fails : Asynchronous wait failed - Exceeded timeout of 0.2 seconds, with unfulfilled expectations: foo
05:32:22 Test Case 'ExpectationsTestCase.test_waitingForAnUnfulfilledExpectation_fails' failed (0.223 seconds)
05:32:22 Test Case 'ExpectationsTestCase.test_waitingForUnfulfilledExpectations_outputsAllExpectations_andFails' started at 2019-03-12 10:32:20.328
05:32:22 /home/buildnode/jenkins/workspace/oss-swift-5.1-incremental-RA-linux-ubuntu-14_04/swift-corelibs-xctest/Tests/Functional/Asynchronous/Expectations/
05:32:22 ...
05:32:22 note: data was truncated
05:32:22 
05:32:22 note: command had no output on stdout or stderr
05:32:22 error: command failed with exit status: -4
05:32:22 $ "true"
05:32:22 $ ":" "RUN: at line 3"
05:32:22 $ "/usr/bin/python" "/home/buildnode/jenkins/workspace/oss-swift-5.1-incremental-RA-linux-ubuntu-14_04/swift-corelibs-xctest/Tests/Functional/xctest_checker/xctest_checker.py" "/home/buildnode/jenkins/workspace/oss-swift-5.1-incremental-RA-linux-ubuntu-14_04/swift-corelibs-xctest/Tests/Functional/Asynchronous/Expectations/Output/main.swift.tmp" "/home/buildnode/jenkins/workspace/oss-swift-5.1-incremental-RA-linux-ubuntu-14_04/swift-corelibs-xctest/Tests/Functional/Asynchronous/Expectations/main.swift"
05:32:22 # command stderr:
05:32:22 Traceback (most recent call last):
05:32:22   File "/home/buildnode/jenkins/workspace/oss-swift-5.1-incremental-RA-linux-ubuntu-14_04/swift-corelibs-xctest/Tests/Functional/xctest_checker/xctest_checker.py", line 15, in <module>
05:32:22     xctest_checker.main.main()
05:32:22   File "/home/buildnode/jenkins/workspace/oss-swift-5.1-incremental-RA-linux-ubuntu-14_04/swift-corelibs-xctest/Tests/Functional/xctest_checker/xctest_checker/main.py", line 61, in main
05:32:22     compare.compare(args.actual, args.expected, args.check_prefix)
05:32:22   File "/home/buildnode/jenkins/workspace/oss-swift-5.1-incremental-RA-linux-ubuntu-14_04/swift-corelibs-xctest/Tests/Functional/xctest_checker/xctest_checker/compare.py", line 85, in compare
05:32:22     repr(expected_line)))
05:32:22 xctest_checker.error.XCTestCheckerError: 
05:32:22 /home/buildnode/jenkins/workspace/oss-swift-5.1-incremental-RA-linux-ubuntu-14_04/swift-corelibs-xctest/Tests/Functional/Asynchronous/Expectations/main.swift:75: There were more lines expected to appear than there were lines in the actual input. Unmet expectation: '.*[/\\\\]Tests[/\\\\]Functional[/\\\\]Asynchronous[/\\\\]Expectations[/\\\\]main.swift:79: error: ExpectationsTestCase.test_whenTimeoutIsImmediate_butNotAllExpectationsAreFulfilled_fails : Asynchronous wait failed - Exceeded timeout of -1.0 seconds, with unfulfilled expectations: dog'
05:32:22 
05:32:22 error: command failed with exit status: 1
05:32:22 
05:32:22 --
05:32:22 
05:32:22 ********************
05:32:22 Testing: 0 .. 10.. 20.. 30.. 40.. 50.. 60.. 70.. 80.. 90.. 
05:32:24 Testing Time: 25.55s
05:32:24 ********************
05:32:24 Failing Tests (1):
05:32:24     SwiftXCTestFunctionalTests :: Asynchronous/Expectations/main.swift
05:32:24 
05:32:24   Expected Passes    : 19
05:32:24   Unexpected Failures: 1