[Swift CI] Build Failure: 0. OSS - Swift Incremental RA - Ubuntu 14.04 (master) #7836

Report

[FAILURE] oss-swift-incremental-RA-linux-ubuntu-14_04 [#7836]

Build URL:
https://ci.swift.org/job/oss-swift-incremental-RA-linux-ubuntu-14_04/7836/
Project:
oss-swift-incremental-RA-linux-ubuntu-14_04
Date of build:
Mon, 05 Aug 2019 14:07:36 -0500
Build duration:
1 hr 15 min

Identified problems:

  • Compile Error: This build failed because of a compile error. Below is a list of all errors in the build log:

Changes

  • Commit c671cbc6f7d8686360ff8c55925c132e72c75f20 by me:
    Replace literal "NSDebugDescription" error keys

    • edit: Foundation/NSKeyedUnarchiver.swift
    • edit: Foundation/NSCoder.swift
    • edit: Foundation/NSString.swift
    • edit: Foundation/JSONSerialization.swift
    • edit: CoreFoundation/PlugIn.subproj/CFBundle.c
  • Commit 960b0d71bb6fe6a29a224256a97c0680d4d5a3dd by millenomi:
    Parity: NSDictionary: Non-keyed archiving marked as NSUnimplemented()

    • edit: Foundation/NSDictionary.swift

15:22:59 [585/585] Testing SourceControlTests.GitRepositoryTests/testSubmodules
15:22:59
15:22:59 Test Suite 'Selected tests' started at 2019-08-05 20:21:21.119
15:22:59 Test Suite 'MiscellaneousTestCase' started at 2019-08-05 20:21:21.204
15:22:59 Test Case 'MiscellaneousTestCase.testCompileFailureExitsGracefully' started at 2019-08-05 20:21:21.204
15:22:59 /home/buildnode/jenkins/workspace/oss-swift-incremental-RA-linux-ubuntu-14_04/swiftpm/Tests/FunctionalTests/MiscellaneousTests.swift:93: error: MiscellaneousTestCase.testCompileFailureExitsGracefully : XCTAssertTrue failed - unexpected failure matching '' against pattern contains("Compiling CompileFails Foo.swift")
15:22:59 /home/buildnode/jenkins/workspace/oss-swift-incremental-RA-linux-ubuntu-14_04/swiftpm/Tests/FunctionalTests/MiscellaneousTests.swift:94: error: MiscellaneousTestCase.testCompileFailureExitsGracefully : XCTAssertTrue failed - unexpected failure matching '' against pattern regex("error: .*\n.*compile_failure")

New issue found!

New issue found!

New issue found!

Timeout:

/home/buildnode/jenkins/workspace/oss-swift-incremental-RA-linux-ubuntu-14_04/swift-corelibs-foundation/TestFoundation/TestURLSession.swift:1018: error: TestURLSession.test_simpleUploadWithDelegateProvidingInputStream : Asynchronous wait failed - Exceeded timeout of 20.0 seconds, with unfulfilled expectations: PUT [http://127.0.0.1:42340/upload](http://127.0.0.1:42340/upload): Upload data

Terms of Service

Privacy Policy

Cookie Policy