[Swift CI] Build Failure: 0. OSS - Swift Incremental RA - Ubuntu 14.04 (master) #7176


(Mishal Shah) #1

Time out in Foundation test.
Test Case 'TestURLSession.test_downloadTaskWithURL' started at 16:20:09.237

···

On Aug 26, 2016, at 10:05 AM, no-reply@swift.org wrote:

[FAILURE] oss-swift-incremental-RA-linux-ubuntu-14_04 [#7176]

Build URL: https://ci.swift.org/job/oss-swift-incremental-RA-linux-ubuntu-14_04/7176/
Project: oss-swift-incremental-RA-linux-ubuntu-14_04
Date of build: Fri, 26 Aug 2016 09:03:23 -0700
Build duration: 1 hr 1 min
Identified problems:

Timeout: This build was marked as FAIL because it timed out.
Indication 1 <https://ci.swift.org//job/oss-swift-incremental-RA-linux-ubuntu-14_04/7176/consoleFull#89513194756633f0f-8823-4f82-9a4a-0c0d97ce7760>
Tests:

Name: Swift(linux-x86_64)
Failed: 0 test(s), Passed: 8275 test(s), Total: 8275 test(s)
Name: Swift-Unit
Failed: 0 test(s), Passed: 230 test(s), Total: 230 test(s)

Changes

Commit cbbdaf49164550191bcd82539790c4fd3fa3d3f8 by itai:
Rename NSOutputStream to OutputStream

edit: Foundation/NSStream.swift
edit: TestFoundation/TestNSJSONSerialization.swift
edit: Foundation/NSSwiftRuntime.swift
edit: Foundation/NSURLSession/NSURLSessionDelegate.swift
edit: Foundation/NSURLSession/NSURLSessionTask.swift
edit: Foundation/NSURLSession/NSURLSession.swift
edit: TestFoundation/TestNSStream.swift
edit: Foundation/NSJSONSerialization.swift


(Philippe Hausler) #2

Since this test has been giving us problems I am just going to disable it.

···

On Aug 26, 2016, at 11:59 AM, mishal_shah via swift-dev <swift-dev@swift.org> wrote:

Time out in Foundation test.
Test Case 'TestURLSession.test_downloadTaskWithURL' started at 16:20:09.237

On Aug 26, 2016, at 10:05 AM, no-reply@swift.org <mailto:no-reply@swift.org> wrote:

[FAILURE] oss-swift-incremental-RA-linux-ubuntu-14_04 [#7176]

Build URL: https://ci.swift.org/job/oss-swift-incremental-RA-linux-ubuntu-14_04/7176/
Project: oss-swift-incremental-RA-linux-ubuntu-14_04
Date of build: Fri, 26 Aug 2016 09:03:23 -0700
Build duration: 1 hr 1 min
Identified problems:

Timeout: This build was marked as FAIL because it timed out.
Indication 1 <https://ci.swift.org//job/oss-swift-incremental-RA-linux-ubuntu-14_04/7176/consoleFull#89513194756633f0f-8823-4f82-9a4a-0c0d97ce7760>
Tests:

Name: Swift(linux-x86_64)
Failed: 0 test(s), Passed: 8275 test(s), Total: 8275 test(s)
Name: Swift-Unit
Failed: 0 test(s), Passed: 230 test(s), Total: 230 test(s)

Changes

Commit cbbdaf49164550191bcd82539790c4fd3fa3d3f8 by itai:
Rename NSOutputStream to OutputStream

edit: Foundation/NSStream.swift
edit: TestFoundation/TestNSJSONSerialization.swift
edit: Foundation/NSSwiftRuntime.swift
edit: Foundation/NSURLSession/NSURLSessionDelegate.swift
edit: Foundation/NSURLSession/NSURLSessionTask.swift
edit: Foundation/NSURLSession/NSURLSession.swift
edit: TestFoundation/TestNSStream.swift
edit: Foundation/NSJSONSerialization.swift

_______________________________________________
swift-dev mailing list
swift-dev@swift.org
https://lists.swift.org/mailman/listinfo/swift-dev


(Mishal Shah) #3

Thanks!

···

On Aug 26, 2016, at 3:19 PM, Philippe Hausler <phausler@apple.com> wrote:

Since this test has been giving us problems I am just going to disable it.

On Aug 26, 2016, at 11:59 AM, mishal_shah via swift-dev <swift-dev@swift.org <mailto:swift-dev@swift.org>> wrote:

Time out in Foundation test.
Test Case 'TestURLSession.test_downloadTaskWithURL' started at 16:20:09.237

On Aug 26, 2016, at 10:05 AM, no-reply@swift.org <mailto:no-reply@swift.org> wrote:

[FAILURE] oss-swift-incremental-RA-linux-ubuntu-14_04 [#7176]

Build URL: https://ci.swift.org/job/oss-swift-incremental-RA-linux-ubuntu-14_04/7176/
Project: oss-swift-incremental-RA-linux-ubuntu-14_04
Date of build: Fri, 26 Aug 2016 09:03:23 -0700
Build duration: 1 hr 1 min
Identified problems:

Timeout: This build was marked as FAIL because it timed out.
Indication 1 <https://ci.swift.org//job/oss-swift-incremental-RA-linux-ubuntu-14_04/7176/consoleFull#89513194756633f0f-8823-4f82-9a4a-0c0d97ce7760>
Tests:

Name: Swift(linux-x86_64)
Failed: 0 test(s), Passed: 8275 test(s), Total: 8275 test(s)
Name: Swift-Unit
Failed: 0 test(s), Passed: 230 test(s), Total: 230 test(s)

Changes

Commit cbbdaf49164550191bcd82539790c4fd3fa3d3f8 by itai:
Rename NSOutputStream to OutputStream

edit: Foundation/NSStream.swift
edit: TestFoundation/TestNSJSONSerialization.swift
edit: Foundation/NSSwiftRuntime.swift
edit: Foundation/NSURLSession/NSURLSessionDelegate.swift
edit: Foundation/NSURLSession/NSURLSessionTask.swift
edit: Foundation/NSURLSession/NSURLSession.swift
edit: TestFoundation/TestNSStream.swift
edit: Foundation/NSJSONSerialization.swift

_______________________________________________
swift-dev mailing list
swift-dev@swift.org <mailto:swift-dev@swift.org>
https://lists.swift.org/mailman/listinfo/swift-dev


(Philippe Hausler) #4

Disabled that test and a few others that might time out after it in b98f8d67

···

On Aug 26, 2016, at 3:41 PM, mishal_shah <mishal_shah@apple.com> wrote:

Thanks!

On Aug 26, 2016, at 3:19 PM, Philippe Hausler <phausler@apple.com <mailto:phausler@apple.com>> wrote:

Since this test has been giving us problems I am just going to disable it.

On Aug 26, 2016, at 11:59 AM, mishal_shah via swift-dev <swift-dev@swift.org <mailto:swift-dev@swift.org>> wrote:

Time out in Foundation test.
Test Case 'TestURLSession.test_downloadTaskWithURL' started at 16:20:09.237

On Aug 26, 2016, at 10:05 AM, no-reply@swift.org <mailto:no-reply@swift.org> wrote:

[FAILURE] oss-swift-incremental-RA-linux-ubuntu-14_04 [#7176]

Build URL: https://ci.swift.org/job/oss-swift-incremental-RA-linux-ubuntu-14_04/7176/
Project: oss-swift-incremental-RA-linux-ubuntu-14_04
Date of build: Fri, 26 Aug 2016 09:03:23 -0700
Build duration: 1 hr 1 min
Identified problems:

Timeout: This build was marked as FAIL because it timed out.
Indication 1 <https://ci.swift.org//job/oss-swift-incremental-RA-linux-ubuntu-14_04/7176/consoleFull#89513194756633f0f-8823-4f82-9a4a-0c0d97ce7760>
Tests:

Name: Swift(linux-x86_64)
Failed: 0 test(s), Passed: 8275 test(s), Total: 8275 test(s)
Name: Swift-Unit
Failed: 0 test(s), Passed: 230 test(s), Total: 230 test(s)

Changes

Commit cbbdaf49164550191bcd82539790c4fd3fa3d3f8 by itai:
Rename NSOutputStream to OutputStream

edit: Foundation/NSStream.swift
edit: TestFoundation/TestNSJSONSerialization.swift
edit: Foundation/NSSwiftRuntime.swift
edit: Foundation/NSURLSession/NSURLSessionDelegate.swift
edit: Foundation/NSURLSession/NSURLSessionTask.swift
edit: Foundation/NSURLSession/NSURLSession.swift
edit: TestFoundation/TestNSStream.swift
edit: Foundation/NSJSONSerialization.swift

_______________________________________________
swift-dev mailing list
swift-dev@swift.org <mailto:swift-dev@swift.org>
https://lists.swift.org/mailman/listinfo/swift-dev