[Swift CI] Build Failure: 0. OSS - Swift Incremental RA - Ubuntu 14.04 (master) #3181


(Ben Langmuir) #1

This doesn’t seem like it would be related to my patch. Anyone recognize this?

Test Case 'TestNSNotificationQueue.test_notificationQueueLifecycle' started.
<>TestFoundation/TestNSNotificationQueue.swift:210: error: TestNSNotificationQueue.test_notificationQueueLifecycle : XCTAssertNil failed: "<NSNotificationQueue: 0x00007f5b7c000b20>" -

Ben

···

On Mar 4, 2016, at 4:59 PM, no-reply@swift.org wrote:

[FAILURE] oss-swift-incremental-RA-linux-ubuntu-14_04 [#3181]

Build URL: https://ci.swift.org/job/oss-swift-incremental-RA-linux-ubuntu-14_04/3181/
Project: oss-swift-incremental-RA-linux-ubuntu-14_04
Date of build: Fri, 04 Mar 2016 18:50:30 -0600
Build duration: 9 min 11 sec
Identified problems:

Compile Error: This build failed because of a compile error. Below is a list of all errors in the build log:
Indication 1 <https://ci.swift.org//job/oss-swift-incremental-RA-linux-ubuntu-14_04/3181/consoleFull#805696456ee1a197b-acac-4b17-83cf-a53b95139a76>
Tests:

Name: Swift
Failed: 0 test(s), Passed: 7745 test(s), Total: 7745 test(s)
Name: Swift-Unit
Failed: 0 test(s), Passed: 236 test(s), Total: 236 test(s)

Changes

Commit ca1c7f1a70428bb6645558ba4d4bae99fb0333cd by blangmuir:
[ASTPrinter] Fix a couple of 80-column violations NFC

edit: lib/AST/ASTPrinter.cpp


(Ben Langmuir) #2

Next build succeeded…

···

On Mar 4, 2016, at 5:03 PM, Ben Langmuir via swift-dev <swift-dev@swift.org> wrote:

This doesn’t seem like it would be related to my patch. Anyone recognize this?

Test Case 'TestNSNotificationQueue.test_notificationQueueLifecycle' started.
<>TestFoundation/TestNSNotificationQueue.swift:210: error: TestNSNotificationQueue.test_notificationQueueLifecycle : XCTAssertNil failed: "<NSNotificationQueue: 0x00007f5b7c000b20>" -

Ben

On Mar 4, 2016, at 4:59 PM, no-reply@swift.org <mailto:no-reply@swift.org> wrote:

[FAILURE] oss-swift-incremental-RA-linux-ubuntu-14_04 [#3181]

Build URL: https://ci.swift.org/job/oss-swift-incremental-RA-linux-ubuntu-14_04/3181/
Project: oss-swift-incremental-RA-linux-ubuntu-14_04
Date of build: Fri, 04 Mar 2016 18:50:30 -0600
Build duration: 9 min 11 sec
Identified problems:

Compile Error: This build failed because of a compile error. Below is a list of all errors in the build log:
Indication 1 <https://ci.swift.org//job/oss-swift-incremental-RA-linux-ubuntu-14_04/3181/consoleFull#805696456ee1a197b-acac-4b17-83cf-a53b95139a76>
Tests:

Name: Swift
Failed: 0 test(s), Passed: 7745 test(s), Total: 7745 test(s)
Name: Swift-Unit
Failed: 0 test(s), Passed: 236 test(s), Total: 236 test(s)

Changes

Commit ca1c7f1a70428bb6645558ba4d4bae99fb0333cd by blangmuir:
[ASTPrinter] Fix a couple of 80-column violations NFC

edit: lib/AST/ASTPrinter.cpp

_______________________________________________
swift-dev mailing list
swift-dev@swift.org
https://lists.swift.org/mailman/listinfo/swift-dev


(Philippe Hausler) #3

That test has been failing intermittently, I disabled it to reduce the noise. There is likely yet another threading bug around there.

···

Sent from my iPhone

On Mar 4, 2016, at 5:07 PM, Ben Langmuir via swift-dev <swift-dev@swift.org> wrote:

Next build succeeded…

On Mar 4, 2016, at 5:03 PM, Ben Langmuir via swift-dev <swift-dev@swift.org> wrote:

This doesn’t seem like it would be related to my patch. Anyone recognize this?

Test Case 'TestNSNotificationQueue.test_notificationQueueLifecycle' started.
TestFoundation/TestNSNotificationQueue.swift:210: error: TestNSNotificationQueue.test_notificationQueueLifecycle : XCTAssertNil failed: "<NSNotificationQueue: 0x00007f5b7c000b20>" -

Ben

On Mar 4, 2016, at 4:59 PM, no-reply@swift.org wrote:

[FAILURE] oss-swift-incremental-RA-linux-ubuntu-14_04 [#3181]

Build URL: https://ci.swift.org/job/oss-swift-incremental-RA-linux-ubuntu-14_04/3181/
Project: oss-swift-incremental-RA-linux-ubuntu-14_04
Date of build: Fri, 04 Mar 2016 18:50:30 -0600
Build duration: 9 min 11 sec
Identified problems:

Compile Error: This build failed because of a compile error. Below is a list of all errors in the build log:
Indication 1
Tests:

Name: Swift
Failed: 0 test(s), Passed: 7745 test(s), Total: 7745 test(s)
Name: Swift-Unit
Failed: 0 test(s), Passed: 236 test(s), Total: 236 test(s)

Changes

Commit ca1c7f1a70428bb6645558ba4d4bae99fb0333cd by blangmuir:
[ASTPrinter] Fix a couple of 80-column violations NFC

edit: lib/AST/ASTPrinter.cpp

_______________________________________________
swift-dev mailing list
swift-dev@swift.org
https://lists.swift.org/mailman/listinfo/swift-dev

_______________________________________________
swift-dev mailing list
swift-dev@swift.org
https://lists.swift.org/mailman/listinfo/swift-dev