[Swift CI] Build Failure: 0. OSS - Swift Incremental RA - Ubuntu 14.04 (master) #2756


(Joe Shajrawi) #1

Another bot issue:
/home/buildnode/disk2/workspace/oss-swift-incremental-RA-linux-ubuntu-14_04/swiftpm/Tests/SourceControlTests/GitRepositoryTests.swift:366: error: GitRepositoryTests.testHasDetatchedUnpushedCommits : failed - terminated(129): git -C /tmp/spm-tests-testHasDetatchedUnpushedCommits.7q3y3q/checkout branch --force -d new-branch

Regards,
—Joe |  | :e-mail: shajrawi@apple.com | :iphone:(+1) 408-930-5203

···

On May 22, 2017, at 7:38 AM, no-reply@swift.org wrote:

[FAILURE] oss-swift-incremental-RA-linux-ubuntu-14_04 [#2756]

Build URL: https://ci.swift.org/job/oss-swift-incremental-RA-linux-ubuntu-14_04/2756/
Project: oss-swift-incremental-RA-linux-ubuntu-14_04
Date of build: Mon, 22 May 2017 06:59:06 -0700
Build duration: 39 min
Identified problems:

Compile Error: This build failed because of a compile error. Below is a list of all errors in the build log:
Indication 1 <https://ci.swift.org//job/oss-swift-incremental-RA-linux-ubuntu-14_04/2756/consoleFull#541612374ee1a197b-acac-4b17-83cf-a53b95139a76>
Changes

Commit ea5b132e31d65f27b6227f6860718bd868ff279e by Ankit Aggarwal:
FIX: hasUnpushedCommits for detatched HEAD (#1201)

edit: Tests/SourceControlTests/GitRepositoryTests.swift
edit: Sources/SourceControl/GitRepository.swift


(Ankit Aggarwal) #2

Reverted: https://github.com/apple/swift-package-manager/pull/1213

···

On 22-May-2017, at 8:08 PM, Joe Shajrawi <shajrawi@apple.com> wrote:

Another bot issue:
/home/buildnode/disk2/workspace/oss-swift-incremental-RA-linux-ubuntu-14_04/swiftpm/Tests/SourceControlTests/GitRepositoryTests.swift:366: error: GitRepositoryTests.testHasDetatchedUnpushedCommits : failed - terminated(129): git -C /tmp/spm-tests-testHasDetatchedUnpushedCommits.7q3y3q/checkout branch --force -d new-branch

Regards,
—Joe |  | :e-mail: shajrawi@apple.com <mailto:shajrawi@apple.com> | :iphone:(+1) 408-930-5203

On May 22, 2017, at 7:38 AM, no-reply@swift.org <mailto:no-reply@swift.org> wrote:

[FAILURE] oss-swift-incremental-RA-linux-ubuntu-14_04 [#2756]

Build URL: https://ci.swift.org/job/oss-swift-incremental-RA-linux-ubuntu-14_04/2756/
Project: oss-swift-incremental-RA-linux-ubuntu-14_04
Date of build: Mon, 22 May 2017 06:59:06 -0700
Build duration: 39 min
Identified problems:

Compile Error: This build failed because of a compile error. Below is a list of all errors in the build log:
Indication 1 <https://ci.swift.org//job/oss-swift-incremental-RA-linux-ubuntu-14_04/2756/consoleFull#541612374ee1a197b-acac-4b17-83cf-a53b95139a76>
Changes

Commit ea5b132e31d65f27b6227f6860718bd868ff279e by Ankit Aggarwal:
FIX: hasUnpushedCommits for detatched HEAD (#1201)

edit: Tests/SourceControlTests/GitRepositoryTests.swift
edit: Sources/SourceControl/GitRepository.swift