[Swift CI] Build Failure: 0. OSS - Swift Incremental RA - Ubuntu 14.04 (master) #2706


(Joe Shajrawi) #1

Same issue as the OS X bot, Ankit please advise.

Regards,
—Joe |  | :e-mail: shajrawi@apple.com | :iphone:(+1) 408-930-5203

···

On May 19, 2017, at 11:07 AM, no-reply@swift.org wrote:

[FAILURE] oss-swift-incremental-RA-linux-ubuntu-14_04 [#2706]

Build URL: https://ci.swift.org/job/oss-swift-incremental-RA-linux-ubuntu-14_04/2706/
Project: oss-swift-incremental-RA-linux-ubuntu-14_04
Date of build: Fri, 19 May 2017 10:30:47 -0700
Build duration: 37 min
Identified problems:

Regression test failed: This build failed because a regression test in the test suite FAILed. Below is a list of all errors:
Indication 1 <https://ci.swift.org//job/oss-swift-incremental-RA-linux-ubuntu-14_04/2706/consoleFull#-1366378527fca400bf-2f4a-462e-b517-e058d770b2d7>
Changes

Commit fc3d9db5dcce5c5b5ceb7538efeb294445235b54 by Ankit Aggarwal:
[BuildSystem] Check command result in MockBuildSystemDelegate

edit: unittests/BuildSystem/MockBuildSystemDelegate.h
edit: unittests/BuildSystem/BuildSystemTaskTests.cpp

Commit 3278886410cdf3d98e7368276ae74f00cfbe372c by Erik Eckstein:
benchmarks: only search in benchmark source directories in

edit: utils/gyb_benchmark_support.py

Commit f9893a9758ea08ade1a1f1a09ac94ae5b568f4fe by github:
Un-XFAIL Lazy.swift test (#9777)

edit: validation-test/stdlib/Lazy.swift.gyb

Commit 3682bb12dbcd39110f7a44dd86354bc5aa9971cb by David Grove:
update README and INSTALL for libpwq removal

edit: README.md
edit: INSTALL.md

Commit ee2c36bc301ced372e45ba4847a490680db9c6e5 by Tim Northover:
AArch64: use linker-private symbols for globals in MachO.

add: test/CodeGen/AArch64/macho-global-symbols.ll
edit: lib/Target/AArch64/AArch64TargetObjectFile.cpp
edit: test/CodeGen/AArch64/arm64-hello.ll
edit: lib/Target/AArch64/AArch64TargetObjectFile.h

Commit 49806fb811a17dcd1303bbe60cbd29c556e4db63 by Alex Lorenz:
[index] Record references to class receivers used in property references

edit: test/Index/Core/index-source.m
edit: lib/Index/IndexBody.cpp

Commit 46a5fd691764e2e04b09b481bb9131a607ceb3e3 by Alex Lorenz:
[Lexer] Ensure that the token is not an annotation token when retrieving

edit: lib/Lex/Lexer.cpp
add: test/Modules/Inputs/objcAtKeywordMissingEnd.h
edit: test/Modules/Inputs/module.map
add: test/Modules/objc-at-keyword.m


(Ankit Aggarwal) #2

Boris is pushing a fix.

···

On 19-May-2017, at 11:38 PM, Joe Shajrawi <shajrawi@apple.com> wrote:

Same issue as the OS X bot, Ankit please advise.

Regards,
—Joe |  | :e-mail: shajrawi@apple.com <mailto:shajrawi@apple.com> | :iphone:(+1) 408-930-5203

On May 19, 2017, at 11:07 AM, no-reply@swift.org <mailto:no-reply@swift.org> wrote:

[FAILURE] oss-swift-incremental-RA-linux-ubuntu-14_04 [#2706]

Build URL: https://ci.swift.org/job/oss-swift-incremental-RA-linux-ubuntu-14_04/2706/
Project: oss-swift-incremental-RA-linux-ubuntu-14_04
Date of build: Fri, 19 May 2017 10:30:47 -0700
Build duration: 37 min
Identified problems:

Regression test failed: This build failed because a regression test in the test suite FAILed. Below is a list of all errors:
Indication 1 <https://ci.swift.org//job/oss-swift-incremental-RA-linux-ubuntu-14_04/2706/consoleFull#-1366378527fca400bf-2f4a-462e-b517-e058d770b2d7>
Changes

Commit fc3d9db5dcce5c5b5ceb7538efeb294445235b54 by Ankit Aggarwal:
[BuildSystem] Check command result in MockBuildSystemDelegate

edit: unittests/BuildSystem/MockBuildSystemDelegate.h
edit: unittests/BuildSystem/BuildSystemTaskTests.cpp

Commit 3278886410cdf3d98e7368276ae74f00cfbe372c by Erik Eckstein:
benchmarks: only search in benchmark source directories in

edit: utils/gyb_benchmark_support.py

Commit f9893a9758ea08ade1a1f1a09ac94ae5b568f4fe by github:
Un-XFAIL Lazy.swift test (#9777)

edit: validation-test/stdlib/Lazy.swift.gyb

Commit 3682bb12dbcd39110f7a44dd86354bc5aa9971cb by David Grove:
update README and INSTALL for libpwq removal

edit: README.md
edit: INSTALL.md

Commit ee2c36bc301ced372e45ba4847a490680db9c6e5 by Tim Northover:
AArch64: use linker-private symbols for globals in MachO.

add: test/CodeGen/AArch64/macho-global-symbols.ll
edit: lib/Target/AArch64/AArch64TargetObjectFile.cpp
edit: test/CodeGen/AArch64/arm64-hello.ll
edit: lib/Target/AArch64/AArch64TargetObjectFile.h

Commit 49806fb811a17dcd1303bbe60cbd29c556e4db63 by Alex Lorenz:
[index] Record references to class receivers used in property references

edit: test/Index/Core/index-source.m
edit: lib/Index/IndexBody.cpp

Commit 46a5fd691764e2e04b09b481bb9131a607ceb3e3 by Alex Lorenz:
[Lexer] Ensure that the token is not an annotation token when retrieving

edit: lib/Lex/Lexer.cpp
add: test/Modules/Inputs/objcAtKeywordMissingEnd.h
edit: test/Modules/Inputs/module.map
add: test/Modules/objc-at-keyword.m


(Ankit Aggarwal) #3

https://github.com/apple/swift-llbuild/pull/175

···

On 19-May-2017, at 11:45 PM, Ankit Aggarwal <ankit_aggarwal@apple.com> wrote:

Boris is pushing a fix.

On 19-May-2017, at 11:38 PM, Joe Shajrawi <shajrawi@apple.com <mailto:shajrawi@apple.com>> wrote:

Same issue as the OS X bot, Ankit please advise.

Regards,
—Joe |  | :e-mail: shajrawi@apple.com <mailto:shajrawi@apple.com> | :iphone:(+1) 408-930-5203

On May 19, 2017, at 11:07 AM, no-reply@swift.org <mailto:no-reply@swift.org> wrote:

[FAILURE] oss-swift-incremental-RA-linux-ubuntu-14_04 [#2706]

Build URL: https://ci.swift.org/job/oss-swift-incremental-RA-linux-ubuntu-14_04/2706/
Project: oss-swift-incremental-RA-linux-ubuntu-14_04
Date of build: Fri, 19 May 2017 10:30:47 -0700
Build duration: 37 min
Identified problems:

Regression test failed: This build failed because a regression test in the test suite FAILed. Below is a list of all errors:
Indication 1 <https://ci.swift.org//job/oss-swift-incremental-RA-linux-ubuntu-14_04/2706/consoleFull#-1366378527fca400bf-2f4a-462e-b517-e058d770b2d7>
Changes

Commit fc3d9db5dcce5c5b5ceb7538efeb294445235b54 by Ankit Aggarwal:
[BuildSystem] Check command result in MockBuildSystemDelegate

edit: unittests/BuildSystem/MockBuildSystemDelegate.h
edit: unittests/BuildSystem/BuildSystemTaskTests.cpp

Commit 3278886410cdf3d98e7368276ae74f00cfbe372c by Erik Eckstein:
benchmarks: only search in benchmark source directories in

edit: utils/gyb_benchmark_support.py

Commit f9893a9758ea08ade1a1f1a09ac94ae5b568f4fe by github:
Un-XFAIL Lazy.swift test (#9777)

edit: validation-test/stdlib/Lazy.swift.gyb

Commit 3682bb12dbcd39110f7a44dd86354bc5aa9971cb by David Grove:
update README and INSTALL for libpwq removal

edit: README.md
edit: INSTALL.md

Commit ee2c36bc301ced372e45ba4847a490680db9c6e5 by Tim Northover:
AArch64: use linker-private symbols for globals in MachO.

add: test/CodeGen/AArch64/macho-global-symbols.ll
edit: lib/Target/AArch64/AArch64TargetObjectFile.cpp
edit: test/CodeGen/AArch64/arm64-hello.ll
edit: lib/Target/AArch64/AArch64TargetObjectFile.h

Commit 49806fb811a17dcd1303bbe60cbd29c556e4db63 by Alex Lorenz:
[index] Record references to class receivers used in property references

edit: test/Index/Core/index-source.m
edit: lib/Index/IndexBody.cpp

Commit 46a5fd691764e2e04b09b481bb9131a607ceb3e3 by Alex Lorenz:
[Lexer] Ensure that the token is not an annotation token when retrieving

edit: lib/Lex/Lexer.cpp
add: test/Modules/Inputs/objcAtKeywordMissingEnd.h
edit: test/Modules/Inputs/module.map
add: test/Modules/objc-at-keyword.m