[Swift CI] Build Failure: 0. OSS - Swift Incremental RA - Ubuntu 14.04 (master) #1989


(Mishal Shah) #1

Hi,

Test Case 'MiscellaneousTestCase.testCanKillSubprocessOnSigInt' started at 16:06:36.733
<>/home/buildnode/disk2/workspace/oss-swift-incremental-RA-linux-ubuntu-14_04/swiftpm/Tests/FunctionalTests/MiscellaneousTests.swift:457: error: MiscellaneousTestCase.testCanKillSubprocessOnSigInt : failed - Couldn't launch the process
Test Case 'MiscellaneousTestCase.testCanKillSubprocessOnSigInt' failed (11.063 seconds)

Thanks,
Mishal Shah

···

On Apr 11, 2017, at 9:09 AM, no-reply@swift.org wrote:

[FAILURE] oss-swift-incremental-RA-linux-ubuntu-14_04 [#1989]

Build URL: https://ci.swift.org/job/oss-swift-incremental-RA-linux-ubuntu-14_04/1989/
Project: oss-swift-incremental-RA-linux-ubuntu-14_04
Date of build: Tue, 11 Apr 2017 08:26:30 -0700
Build duration: 42 min
Identified problems:

Compile Error: This build failed because of a compile error. Below is a list of all errors in the build log:
Indication 1 <https://ci.swift.org//job/oss-swift-incremental-RA-linux-ubuntu-14_04/1989/consoleFull#-1554866728ee1a197b-acac-4b17-83cf-a53b95139a76>
Changes

Commit a8a8a5b9f032823be097e1ec9ae536f1903e6fe0 by Ankit Aggarwal:
[Basic] Add Path.contains(other:) method

edit: Sources/Basic/Path.swift
edit: Tests/BasicTests/PathTests.swift


(Ankit Aggarwal) #2

I am not sure why this happened but I'll keep an eye out. Can you restart the job for now?

···

On 11-Apr-2017, at 10:06 PM, mishal_shah <mishal_shah@apple.com> wrote:

Hi,

Test Case 'MiscellaneousTestCase.testCanKillSubprocessOnSigInt' started at 16:06:36.733
<>/home/buildnode/disk2/workspace/oss-swift-incremental-RA-linux-ubuntu-14_04/swiftpm/Tests/FunctionalTests/MiscellaneousTests.swift:457: error: MiscellaneousTestCase.testCanKillSubprocessOnSigInt : failed - Couldn't launch the process
Test Case 'MiscellaneousTestCase.testCanKillSubprocessOnSigInt' failed (11.063 seconds)

Thanks,
Mishal Shah

On Apr 11, 2017, at 9:09 AM, no-reply@swift.org <mailto:no-reply@swift.org> wrote:

[FAILURE] oss-swift-incremental-RA-linux-ubuntu-14_04 [#1989]

Build URL: https://ci.swift.org/job/oss-swift-incremental-RA-linux-ubuntu-14_04/1989/
Project: oss-swift-incremental-RA-linux-ubuntu-14_04
Date of build: Tue, 11 Apr 2017 08:26:30 -0700
Build duration: 42 min
Identified problems:

Compile Error: This build failed because of a compile error. Below is a list of all errors in the build log:
Indication 1 <https://ci.swift.org//job/oss-swift-incremental-RA-linux-ubuntu-14_04/1989/consoleFull#-1554866728ee1a197b-acac-4b17-83cf-a53b95139a76>
Changes

Commit a8a8a5b9f032823be097e1ec9ae536f1903e6fe0 by Ankit Aggarwal:
[Basic] Add Path.contains(other:) method

edit: Sources/Basic/Path.swift
edit: Tests/BasicTests/PathTests.swift


(Mishal Shah) #3

Next build passed - https://ci.swift.org/job/oss-swift-incremental-RA-linux-ubuntu-14_04/1990/

Mishal Shah

···

On Apr 11, 2017, at 9:40 AM, Ankit Aggarwal <ankit_aggarwal@apple.com> wrote:

I am not sure why this happened but I'll keep an eye out. Can you restart the job for now?

On 11-Apr-2017, at 10:06 PM, mishal_shah <mishal_shah@apple.com <mailto:mishal_shah@apple.com>> wrote:

Hi,

Test Case 'MiscellaneousTestCase.testCanKillSubprocessOnSigInt' started at 16:06:36.733
<>/home/buildnode/disk2/workspace/oss-swift-incremental-RA-linux-ubuntu-14_04/swiftpm/Tests/FunctionalTests/MiscellaneousTests.swift:457: error: MiscellaneousTestCase.testCanKillSubprocessOnSigInt : failed - Couldn't launch the process
Test Case 'MiscellaneousTestCase.testCanKillSubprocessOnSigInt' failed (11.063 seconds)

Thanks,
Mishal Shah

On Apr 11, 2017, at 9:09 AM, no-reply@swift.org <mailto:no-reply@swift.org> wrote:

[FAILURE] oss-swift-incremental-RA-linux-ubuntu-14_04 [#1989]

Build URL: https://ci.swift.org/job/oss-swift-incremental-RA-linux-ubuntu-14_04/1989/
Project: oss-swift-incremental-RA-linux-ubuntu-14_04
Date of build: Tue, 11 Apr 2017 08:26:30 -0700
Build duration: 42 min
Identified problems:

Compile Error: This build failed because of a compile error. Below is a list of all errors in the build log:
Indication 1 <https://ci.swift.org//job/oss-swift-incremental-RA-linux-ubuntu-14_04/1989/consoleFull#-1554866728ee1a197b-acac-4b17-83cf-a53b95139a76>
Changes

Commit a8a8a5b9f032823be097e1ec9ae536f1903e6fe0 by Ankit Aggarwal:
[Basic] Add Path.contains(other:) method

edit: Sources/Basic/Path.swift
edit: Tests/BasicTests/PathTests.swift