[Swift CI] Build Failure: 0. OSS - Swift Incremental RA - Ubuntu 14.04 - Long Test (master) #654


(Douglas Gregor) #1

Not sure what this is…

results/x86_64-unknown-linux-gnu/lit-tests.xml' relative to '/home/buildnode/jenkins/workspace/oss-swift-incremental-RA-linux-ubuntu-14_04-long-test' for the testing framework 'JUnit'. Did you enter a pattern relative to the correct directory? Did you generate the result report(s) for 'JUnit'?
[xUnit] [ERROR] - No test reports found for the metric 'JUnit' with the resolved pattern 'Ninja-ReleaseAssert/swift-linux-x86_64/swift-test-results/x86_64-unknown-linux-gnu/lit-tests.xml'. Configuration error?.
[xUnit] [INFO] - Failing BUILD.
[xUnit] [INFO] - There are errors when processing test results.
[xUnit] [INFO] - Skipping tests recording.
[xUnit] [INFO] - Stop build.
Build step 'Publish xUnit test result report' changed build result to FAILURE
[BFA] Scanning build for known causes...
[BFA] No failure causes found
[BFA] Done. 0s

···

On Aug 5, 2016, at 1:45 AM, no-reply@swift.org wrote:

[FAILURE] oss-swift-incremental-RA-linux-ubuntu-14_04-long-test [#654]

Build URL: https://ci.swift.org/job/oss-swift-incremental-RA-linux-ubuntu-14_04-long-test/654/
Project: oss-swift-incremental-RA-linux-ubuntu-14_04-long-test
Date of build: Fri, 05 Aug 2016 00:34:00 -0700
Build duration: 1 hr 11 min

Changes

Commit 3bc81f7df42af7950fec939f6846da89a12d0745 by kyrtzidis:
[Serialization] Fix deserialization crash occurring when a mixed

add: test/Serialization/Inputs/objcfail/module.modulemap
add: test/Serialization/Inputs/MixModA.modulemap
edit: lib/Serialization/ModuleFile.cpp
add: test/Serialization/Inputs/SwiftModA.swift
add: test/Serialization/Inputs/objcfail/objcfail.h
add: test/Serialization/Inputs/SwiftModB.swift
add: test/Serialization/failed-clang-module.swift

Commit 2bcf5558969890fed26db1f10ddf2efe5262901c by dgregor:
[Constraint solver] Introduce a *trivial* 'meet' operation for types.

edit: include/swift/AST/Type.h
edit: lib/AST/CMakeLists.txt
edit: lib/Sema/CSSolver.cpp
add: lib/AST/TypeJoinMeet.cpp

Commit 22287ddb580dfe4207c37ef1886c062976870c4a by dgregor:
[Type system] Infer 'Any' for array elements and dictionary values and

edit: lib/Sema/CSApply.cpp
edit: lib/Sema/MiscDiagnostics.cpp
edit: test/Constraints/subscript.swift
edit: test/Constraints/bridging.swift
edit: lib/Sema/TypeCheckConstraints.cpp
edit: test/expr/expressions.swift
edit: lib/Sema/CSGen.cpp
edit: lib/Sema/CSSolver.cpp
edit: lib/Sema/ConstraintSystem.h
edit: test/Constraints/array_literal.swift
edit: test/Constraints/dictionary_literal.swift
edit: test/IDE/complete_at_top_level.swift

Commit a6e1e875856724eb236b1e93edbeb49ce7b4ab59 by rjmccall:
Add implicit conversions and casts from T:Hashable <-> AnyHashable.

edit: lib/SILGen/SILGenFunction.h
edit: lib/Sema/Constraint.cpp
edit: test/SILOptimizer/cast_folding.swift
edit: lib/Sema/ConstraintSystem.h
edit: lib/AST/Expr.cpp
edit: stdlib/public/core/AnyHashable.swift
edit: lib/SILGen/SILGenExpr.cpp
edit: lib/Sema/Constraint.h
edit: include/swift/AST/KnownDecls.def
edit: lib/AST/ASTDumper.cpp
edit: include/swift/AST/ExprNodes.def
edit: lib/SIL/DynamicCasts.cpp
edit: stdlib/public/runtime/Casting.cpp
edit: lib/SILGen/SILGenPoly.cpp
edit: lib/Sema/ConstraintSystem.cpp
add: test/1_stdlib/AnyHashableCasts.swift.gyb
edit: test/Sema/diag_type_conversion.swift
edit: lib/Sema/CSApply.cpp
edit: include/swift/Runtime/Metadata.h
edit: lib/AST/ASTVerifier.cpp
edit: lib/Sema/CSSimplify.cpp
edit: include/swift/AST/Expr.h
edit: lib/Sema/TypeCheckConstraints.cpp