[Swift CI] Build Failure: 0. OSS - Swift Incremental RA - OS X (master) #8539


(Jordan Rose) #1

Doug?

···

On Feb 23, 2017, at 15:05, no-reply@swift.org wrote:

[FAILURE] oss-swift-incremental-RA-osx [#8539]

Build URL: https://ci.swift.org/job/oss-swift-incremental-RA-osx/8539/
Project: oss-swift-incremental-RA-osx
Date of build: Thu, 23 Feb 2017 14:35:52 -0800
Build duration: 29 min
Identified problems:

Regression test failed: This build failed because a regression test in the test suite FAILed. Below is a list of all errors:
Indication 1 <https://ci.swift.org//job/oss-swift-incremental-RA-osx/8539/consoleFull#1453428010fca400bf-2f4a-462e-b517-e058d770b2d7>
Changes

Commit 51d07154340e2f776636407563f7041200b92aaf by jordan_rose:
[CMake] Update dependencies for CloudKit for Apple-internal configs.

edit: stdlib/public/SDK/CloudKit/CMakeLists.txt

Commit e71788d7a6cf1992210efff67fae999b1d8ab6d7 by dgregor:
[GenericSigBuilder] Conformances due to concrete types can be abstract.

edit: test/Generics/requirement_inference.swift
edit: lib/AST/GenericSignatureBuilder.cpp

Commit cbbf4154359f62c628f1b171de253fa4ab1f23e1 by dgregor:
[GenericSigBuilder] Archetypes no longer make it to this path. NFC

edit: lib/AST/GenericSignatureBuilder.cpp


(Douglas Gregor) #2

Very suspicious:

OSError: [Errno 35] Resource temporarily unavailable

···

On Feb 23, 2017, at 3:08 PM, Jordan Rose <jordan_rose@apple.com> wrote:

Doug?

On Feb 23, 2017, at 15:05, no-reply@swift.org <mailto:no-reply@swift.org> wrote:

[FAILURE] oss-swift-incremental-RA-osx [#8539]

Build URL: https://ci.swift.org/job/oss-swift-incremental-RA-osx/8539/
Project: oss-swift-incremental-RA-osx
Date of build: Thu, 23 Feb 2017 14:35:52 -0800
Build duration: 29 min
Identified problems:

Regression test failed: This build failed because a regression test in the test suite FAILed. Below is a list of all errors:
Indication 1 <https://ci.swift.org//job/oss-swift-incremental-RA-osx/8539/consoleFull#1453428010fca400bf-2f4a-462e-b517-e058d770b2d7>
Changes

Commit 51d07154340e2f776636407563f7041200b92aaf by jordan_rose:
[CMake] Update dependencies for CloudKit for Apple-internal configs.

edit: stdlib/public/SDK/CloudKit/CMakeLists.txt

Commit e71788d7a6cf1992210efff67fae999b1d8ab6d7 by dgregor:
[GenericSigBuilder] Conformances due to concrete types can be abstract.

edit: test/Generics/requirement_inference.swift
edit: lib/AST/GenericSignatureBuilder.cpp

Commit cbbf4154359f62c628f1b171de253fa4ab1f23e1 by dgregor:
[GenericSigBuilder] Archetypes no longer make it to this path. NFC

edit: lib/AST/GenericSignatureBuilder.cpp


(Mishal Shah) #3

Hi Doug,

******************** TEST 'Swift(macosx-x86_64) :: stdlib/NSNumberBridging.swift.gyb' FAILED ********************

Script:

···

--
rm -rf /Users/buildnode/jenkins/workspace/oss-swift-incremental-RA-osx/buildbot_incremental/swift-macosx-x86_64/test-macosx-x86_64/stdlib/Output/NSNumberBridging.swift.gyb.tmp && mkdir -p /Users/buildnode/jenkins/workspace/oss-swift-incremental-RA-osx/buildbot_incremental/swift-macosx-x86_64/test-macosx-x86_64/stdlib/Output/NSNumberBridging.swift.gyb.tmp
/Users/buildnode/jenkins/workspace/oss-swift-incremental-RA-osx/swift/utils/gyb /Users/buildnode/jenkins/workspace/oss-swift-incremental-RA-osx/swift/test/stdlib/NSNumberBridging.swift.gyb -o /Users/buildnode/jenkins/workspace/oss-swift-incremental-RA-osx/buildbot_incremental/swift-macosx-x86_64/test-macosx-x86_64/stdlib/Output/NSNumberBridging.swift.gyb.tmp/NSValueBridging.swift
xcrun --toolchain default --sdk /Applications/Xcode-beta.app/Contents/Developer/Platforms/MacOSX.platform/Developer/SDKs/MacOSX10.12.sdk /Users/buildnode/jenkins/workspace/oss-swift-incremental-RA-osx/buildbot_incremental/swift-macosx-x86_64/bin/swiftc -target x86_64-apple-macosx10.9 -module-cache-path '/var/folders/_8/79jmzf2142z2xydc_01btlx00000gn/T/swift-testsuite-clang-module-cachev9VwS6' -F /Applications/Xcode-beta.app/Contents/Developer/Platforms/MacOSX.platform/Developer/SDKs/MacOSX10.12.sdk/../../../Developer/Library/Frameworks -Xlinker -rpath -Xlinker /Applications/Xcode-beta.app/Contents/Developer/Platforms/MacOSX.platform/Developer/SDKs/MacOSX10.12.sdk/../../../Developer/Library/Frameworks -swift-version 3 -g -module-name a /Users/buildnode/jenkins/workspace/oss-swift-incremental-RA-osx/buildbot_incremental/swift-macosx-x86_64/test-macosx-x86_64/stdlib/Output/NSNumberBridging.swift.gyb.tmp/NSValueBridging.swift -o /Users/buildnode/jenkins/workspace/oss-swift-incremental-RA-osx/buildbot_incremental/swift-macosx-x86_64/test-macosx-x86_64/stdlib/Output/NSNumberBridging.swift.gyb.tmp.out
/Users/buildnode/jenkins/workspace/oss-swift-incremental-RA-osx/buildbot_incremental/swift-macosx-x86_64/test-macosx-x86_64/stdlib/Output/NSNumberBridging.swift.gyb.tmp.out
--
Exit Code: 132

Command Output (stderr):
--
/Users/buildnode/jenkins/workspace/oss-swift-incremental-RA-osx/buildbot_incremental/swift-macosx-x86_64/test-macosx-x86_64/stdlib/Output/NSNumberBridging.swift.gyb.script: line 4: 73488 Illegal instruction: 4 /Users/buildnode/jenkins/workspace/oss-swift-incremental-RA-osx/buildbot_incremental/swift-macosx-x86_64/test-macosx-x86_64/stdlib/Output/NSNumberBridging.swift.gyb.tmp.out

--

Thanks,
Mishal Shah

On Feb 23, 2017, at 3:09 PM, Douglas Gregor <dgregor@apple.com> wrote:

Very suspicious:

OSError: [Errno 35] Resource temporarily unavailable

On Feb 23, 2017, at 3:08 PM, Jordan Rose <jordan_rose@apple.com <mailto:jordan_rose@apple.com>> wrote:

Doug?

On Feb 23, 2017, at 15:05, no-reply@swift.org <mailto:no-reply@swift.org> wrote:

[FAILURE] oss-swift-incremental-RA-osx [#8539]

Build URL: https://ci.swift.org/job/oss-swift-incremental-RA-osx/8539/
Project: oss-swift-incremental-RA-osx
Date of build: Thu, 23 Feb 2017 14:35:52 -0800
Build duration: 29 min
Identified problems:

Regression test failed: This build failed because a regression test in the test suite FAILed. Below is a list of all errors:
Indication 1 <https://ci.swift.org//job/oss-swift-incremental-RA-osx/8539/consoleFull#1453428010fca400bf-2f4a-462e-b517-e058d770b2d7>
Changes

Commit 51d07154340e2f776636407563f7041200b92aaf by jordan_rose:
[CMake] Update dependencies for CloudKit for Apple-internal configs.

edit: stdlib/public/SDK/CloudKit/CMakeLists.txt

Commit e71788d7a6cf1992210efff67fae999b1d8ab6d7 by dgregor:
[GenericSigBuilder] Conformances due to concrete types can be abstract.

edit: test/Generics/requirement_inference.swift
edit: lib/AST/GenericSignatureBuilder.cpp

Commit cbbf4154359f62c628f1b171de253fa4ab1f23e1 by dgregor:
[GenericSigBuilder] Archetypes no longer make it to this path. NFC

edit: lib/AST/GenericSignatureBuilder.cpp