[Swift CI] Build Failure: 0. OSS - Swift Incremental RA - OS X (master) #6213


(John McCall) #1

Merge conflict with Jordan's a335ebce805cd8246a5b8127180e318a399a9984. Fix is trivial; I'll send a patch momentarily.

John.

···

On Sep 9, 2016, at 10:46 AM, no-reply@swift.org wrote:
[FAILURE] oss-swift-incremental-RA-osx [#6213]

Build URL: https://ci.swift.org/job/oss-swift-incremental-RA-osx/6213/
Project: oss-swift-incremental-RA-osx
Date of build: Fri, 09 Sep 2016 10:21:35 -0700
Build duration: 24 min
Identified problems:

Compile Error: This build failed because of a compile error. Below is a list of all errors in the build log:
Indication 1 <https://ci.swift.org//job/oss-swift-incremental-RA-osx/6213/consoleFull#-796435461ee1a197b-acac-4b17-83cf-a53b95139a76>
Regression test failed: This build failed because a regression test in the test suite FAILed. Below is a list of all errors:
Indication 1 <https://ci.swift.org//job/oss-swift-incremental-RA-osx/6213/consoleFull#529951938fca400bf-2f4a-462e-b517-e058d770b2d7>
Tests:

Name: Swift(macosx-x86_64)
Failed: 1 test(s), Passed: 8288 test(s), Total: 8289 test(s)
Failed: Swift(macosx-x86_64).SILGen.foreign_errors.swift <https://ci.swift.org/job/oss-swift-incremental-RA-osx/6213/testReport/junit/Swift(macosx-x86_64)/SILGen/foreign_errors_swift>


(John McCall) #2

https://github.com/apple/swift/pull/4695

Would someone mind mashing the admin override here?

John.

···

On Sep 9, 2016, at 10:51 AM, John McCall via swift-dev <swift-dev@swift.org> wrote:

On Sep 9, 2016, at 10:46 AM, no-reply@swift.org <mailto:no-reply@swift.org> wrote:
[FAILURE] oss-swift-incremental-RA-osx [#6213]

Build URL: https://ci.swift.org/job/oss-swift-incremental-RA-osx/6213/
Project: oss-swift-incremental-RA-osx
Date of build: Fri, 09 Sep 2016 10:21:35 -0700
Build duration: 24 min
Identified problems:

Compile Error: This build failed because of a compile error. Below is a list of all errors in the build log:
Indication 1 <https://ci.swift.org//job/oss-swift-incremental-RA-osx/6213/consoleFull#-796435461ee1a197b-acac-4b17-83cf-a53b95139a76>
Regression test failed: This build failed because a regression test in the test suite FAILed. Below is a list of all errors:
Indication 1 <https://ci.swift.org//job/oss-swift-incremental-RA-osx/6213/consoleFull#529951938fca400bf-2f4a-462e-b517-e058d770b2d7>
Tests:

Name: Swift(macosx-x86_64)
Failed: 1 test(s), Passed: 8288 test(s), Total: 8289 test(s)
Failed: Swift(macosx-x86_64).SILGen.foreign_errors.swift <https://ci.swift.org/job/oss-swift-incremental-RA-osx/6213/testReport/junit/Swift(macosx-x86_64)/SILGen/foreign_errors_swift>

Merge conflict with Jordan's a335ebce805cd8246a5b8127180e318a399a9984. Fix is trivial; I'll send a patch momentarily.


(Mishal Shah) #3

Hi John,

Merged, thanks for fixing the issue.

Mishal Shah

···

On Sep 9, 2016, at 11:16 AM, John McCall via swift-dev <swift-dev@swift.org> wrote:

On Sep 9, 2016, at 10:51 AM, John McCall via swift-dev <swift-dev@swift.org <mailto:swift-dev@swift.org>> wrote:

On Sep 9, 2016, at 10:46 AM, no-reply@swift.org <mailto:no-reply@swift.org> wrote:
[FAILURE] oss-swift-incremental-RA-osx [#6213]

Build URL: https://ci.swift.org/job/oss-swift-incremental-RA-osx/6213/
Project: oss-swift-incremental-RA-osx
Date of build: Fri, 09 Sep 2016 10:21:35 -0700
Build duration: 24 min
Identified problems:

Compile Error: This build failed because of a compile error. Below is a list of all errors in the build log:
Indication 1 <https://ci.swift.org//job/oss-swift-incremental-RA-osx/6213/consoleFull#-796435461ee1a197b-acac-4b17-83cf-a53b95139a76>
Regression test failed: This build failed because a regression test in the test suite FAILed. Below is a list of all errors:
Indication 1 <https://ci.swift.org//job/oss-swift-incremental-RA-osx/6213/consoleFull#529951938fca400bf-2f4a-462e-b517-e058d770b2d7>
Tests:

Name: Swift(macosx-x86_64)
Failed: 1 test(s), Passed: 8288 test(s), Total: 8289 test(s)
Failed: Swift(macosx-x86_64).SILGen.foreign_errors.swift <https://ci.swift.org/job/oss-swift-incremental-RA-osx/6213/testReport/junit/Swift(macosx-x86_64)/SILGen/foreign_errors_swift>

Merge conflict with Jordan's a335ebce805cd8246a5b8127180e318a399a9984. Fix is trivial; I'll send a patch momentarily.

https://github.com/apple/swift/pull/4695

Would someone mind mashing the admin override here?

John.
_______________________________________________
swift-dev mailing list
swift-dev@swift.org <mailto:swift-dev@swift.org>
https://lists.swift.org/mailman/listinfo/swift-dev