[Swift CI] Build Failure: 0. OSS - Swift Incremental RA - OS X (master) #5502


(Andrew Trick) #1

/Users/buildnode/jenkins/workspace/oss-swift-incremental-RA-osx/swiftpm/Sources/Basic/OutputByteStream.swift:475:47: error: adjacent operators are in non-associative precedence group 'DefaultPrecedence'
                stream <<< Format.asJSON(key) <<< ":" <<< Format.asJSON(value)
                                              ^ ~~~
/Users/buildnode/jenkins/workspace/oss-swift-incremental-RA-osx/swiftpm/Sources/Basic/JSON.swift:139:24: error: adjacent operators are in non-associative precedence group 'DefaultPrecedence'
                stream <<< Format.asJSON(key) <<< ": " <<< contents[key]!
                       ^ ~~~
/Users/buildnode/jenkins/workspace/oss-swift-incremental-RA-osx/swiftpm/Sources/Basic/JSON.swift:139:47: error: adjacent operators are in non-associative precedence group 'DefaultPrecedence'
                stream <<< Format.asJSON(key) <<< ": " <<< contents[key]!
                                              ^ ~~~

···

On Jul 26, 2016, at 2:40 PM, no-reply@swift.org wrote:

[FAILURE] oss-swift-incremental-RA-osx [#5502]

Build URL: https://ci.swift.org/job/oss-swift-incremental-RA-osx/5502/
Project: oss-swift-incremental-RA-osx
Date of build: Tue, 26 Jul 2016 14:25:23 -0700
Build duration: 15 min
Identified problems:

Compile Error: This build failed because of a compile error. Below is a list of all errors in the build log:
Indication 1 <https://ci.swift.org//job/oss-swift-incremental-RA-osx/5502/consoleFull#-386431574ee1a197b-acac-4b17-83cf-a53b95139a76>
Changes

Commit 1621f7e0502e86a1a35dc3295f04d5a475222756 by mren:
Modules: add command line option fmodules-disable-diagnostic-validation

edit: lib/Frontend/FrontendActions.cpp
edit: include/clang/Serialization/ASTReader.h
edit: test/Driver/modules.m
edit: test/Modules/Inputs/module.map
edit: include/clang/Driver/Options.td
edit: include/clang/Lex/HeaderSearchOptions.h
add: test/Modules/Inputs/DiagOutOfDate.h
edit: lib/Frontend/CompilerInvocation.cpp
add: test/Modules/diagnostic-options-out-of-date.m
add: test/Modules/Inputs/pch-import-module-out-of-date.pch
edit: lib/Serialization/ASTReader.cpp

Commit 0d90f01b7b53742a3ec145aa6477e14ccffaedc9 by mren:
Modules: follow up to r276769.

edit: lib/Driver/Tools.cpp

Commit 2eec5f717893f683c81c03cf81cde5b1ad2951e5 by friss:
Revert "Modules: follow up to r276769."

edit: lib/Driver/Tools.cpp

Commit 5bbc8bcb3843795f0106abaf015d6c77c8b6d28b by friss:
Revert "Modules: add command line option

delete: test/Modules/Inputs/pch-import-module-out-of-date.pch
edit: include/clang/Serialization/ASTReader.h
edit: lib/Serialization/ASTReader.cpp
edit: test/Driver/modules.m
edit: include/clang/Driver/Options.td
edit: include/clang/Lex/HeaderSearchOptions.h
delete: test/Modules/diagnostic-options-out-of-date.m
edit: lib/Frontend/FrontendActions.cpp
delete: test/Modules/Inputs/DiagOutOfDate.h
edit: lib/Frontend/CompilerInvocation.cpp
edit: test/Modules/Inputs/module.map

Commit e8639fe501bd1d1b0860b5292e11f46b818d8cff by phausler:
[Foundation] Update UndoManager registerUndo to adopt new naming rules

edit: stdlib/public/SDK/Foundation/Foundation.swift

Commit 3cf2692fc11c806031bbaf8052f104589df16680 by phausler:
Update interperter tests for new naming of registerUndo

edit: test/Interpreter/SDK/Foundation_test.swift

Commit 6c03c553aa8ad6052adc1f92b8ed62b657c9a115 by mjmdavis:
Correct Swift Decimal.divide to call NSDecimalDivide.

edit: stdlib/public/SDK/Foundation/Decimal.swift
edit: test/Interpreter/SDK/NSDecimal.swift

Commit 647c55b40364dcdd81f55482fab07a0a454f60e9 by gottesmm:
Fill out pull request testing section/multiple repo testing section of

edit: docs/ContinuousIntegration.md

Commit 47053c6f7afe8f678f11376f5977545fb207b002 by mgottesman:
[docs] Fix the ContinuousIntegration.md table of contents.

edit: docs/ContinuousIntegration.md

Commit c77a21d1a39c190af59fead1423434621770f8b9 by gottesmm:
[docs] Small styling change in ContinuousIntegration.

edit: docs/ContinuousIntegration.md

Commit c8c41b385c0312e562abe4952fa2d6794dec2e0f by rjmccall:
Implement SE-0077: precedence group declarations.

edit: lib/FrontendTool/FrontendTool.cpp
edit: test/Constraints/generics.swift
edit: test/Constraints/associated_self_types.swift
edit: test/Constraints/diagnostics.swift
edit: test/SIL/Serialization/Inputs/nontransparent.swift
edit: lib/AST/Decl.cpp
edit: include/swift/AST/Attr.h
edit: test/Generics/associated_types.swift
edit: test/Serialization/Inputs/vtable-function-deserialization-input.swift
edit: test/SILGen/address_only_types.swift
edit: lib/AST/ASTPrinter.cpp
edit: test/IDE/complete_operators.swift
edit: lib/AST/ASTContext.cpp
edit: include/swift/AST/Module.h
edit: lib/IRGen/GenDecl.cpp
edit: include/swift/Serialization/ModuleFile.h
edit: include/swift/Serialization/SerializedModuleLoader.h
edit: tools/SourceKit/lib/SwiftLang/SwiftLangSupport.cpp
edit: test/Generics/same_type_constraints.swift
edit: stdlib/public/core/Policy.swift
edit: stdlib/private/StdlibUnittest/StdlibCoreExtras.swift
edit: test/decl/protocol/protocols.swift
edit: lib/Serialization/SerializedModuleLoader.cpp
edit: lib/Serialization/Deserialization.cpp
edit: test/NameBinding/name-binding.swift
edit: test/SILOptimizer/mandatory_inlining.swift
edit: test/Constraints/diag_ambiguities.swift
edit: include/swift/AST/Expr.h
edit: test/Parse/operators.swift
edit: lib/SILGen/SILGenDecl.cpp
edit: test/Generics/deduction.swift
edit: test/IDE/Inputs/foo_swift_module.swift
edit: test/SILGen/copy_lvalue_peepholes.swift
edit: test/SourceKit/CodeComplete/complete_override.swift.response
add: test/decl/precedencegroup/Inputs/ExternPrecedences.swift
edit: test/Generics/slice_test.swift
edit: include/swift/AST/AttrKind.h
edit: lib/AST/Module.cpp
edit: lib/Sema/CSApply.cpp
edit: test/Parse/invalid.swift
edit: stdlib/public/core/Integers.swift.gyb
edit: lib/Sema/CSDiag.cpp
edit: lib/IDE/REPLCodeCompletion.cpp
edit: test/NameBinding/Inputs/tilde_tilde_high_precedence.swift
edit: include/swift/AST/KnownIdentifiers.def
edit: test/Serialization/Inputs/def_operator.swift
edit: include/swift/AST/ASTContext.h
edit: lib/Sema/TypeCheckExpr.cpp
edit: lib/IDE/CodeCompletion.cpp
edit: test/IDE/print_ast_tc_decls.swift
edit: include/swift/AST/Decl.h
edit: test/attr/attr_availability.swift
edit: include/swift/AST/DiagnosticsParse.def
edit: lib/Sema/NameBinding.cpp
edit: include/swift/Serialization/ModuleFormat.h
edit: lib/IDE/SyntaxModel.cpp
edit: test/Parse/try.swift
edit: test/Parse/builtin_word.swift
edit: lib/Serialization/Serialization.cpp
edit: test/decl/func/operator.swift
edit: test/Constraints/operator.swift
edit: include/swift/IDE/CodeCompletion.h
edit: lib/Sema/TypeChecker.h
edit: test/attr/attr_dynamic.swift
edit: lib/Sema/TypeCheckDecl.cpp
edit: test/Interpreter/SDK/GLKit.swift
edit: test/SILGen/enum.swift
edit: test/Parse/operator_decl.swift
edit: include/swift/AST/DiagnosticsSema.def
edit: test/Parse/conflict_markers.swift
edit: test/decl/func/arg_rename.swift
edit: include/swift/Parse/Tokens.def
edit: include/swift/Parse/Parser.h
edit: include/swift/AST/DeclNodes.def
edit: test/IRGen/swift3-metadata-coff.swift
edit: test/SourceKit/CodeFormat/indent-basic.swift
edit: test/Parse/builtin_bridge_object.swift
edit: test/attr/accessibility.swift
edit: lib/SILGen/SILGen.h
add: test/decl/precedencegroup/circularity.swift
edit: lib/Serialization/ModuleFile.cpp
edit: test/SILOptimizer/allocbox_to_stack_not_crash.swift
edit: include/swift/Serialization/DeclTypeRecordNodes.def
edit: test/IDE/Inputs/foo_swift_module.printed.comments.txt
edit: test/Constraints/protocols.swift
edit: test/Constraints/generic_protocol_witness.swift
edit: lib/AST/ASTWalker.cpp
edit: stdlib/internal/SwiftExperimental/SwiftExperimental.swift
edit: test/Constraints/array_literal.swift
edit: test/DebugInfo/autoclosure.swift
edit: test/decl/protocol/req/func.swift
edit: test/expr/expressions.swift
edit: test/Parse/if_expr.swift
edit: test/Parse/matching_patterns.swift
edit: lib/AST/ASTDumper.cpp
edit: test/NameBinding/Inputs/tilde_tilde_low_precedence.swift
edit: test/IDE/coloring.swift
edit: test/decl/func/functions.swift
edit: lib/AST/SourceEntityWalker.cpp
edit: include/swift/AST/TypeMemberVisitor.h
edit: lib/Parse/ParseDecl.cpp

Commit a18d490d6a9026915bfa61eb8b7e8d7b29ee13aa by atrick:
Migrate from UnsafePointer to UnsafeRawPointer. (#3773)

edit: test/Generics/slice_test.swift
edit: stdlib/public/core/UnsafeRawPointer.swift.gyb
edit: test/Interpreter/SDK/objc_inner_pointer.swift
edit: docs/proposals/CPointerInteropLanguageModel.rst
edit: test/1_stdlib/Runtime.swift.gyb
edit: stdlib/public/core/SliceBuffer.swift
edit: test/SILGen/objc_ownership_conventions.swift
edit: stdlib/private/SwiftReflectionTest/SwiftReflectionTest.swift
edit: stdlib/public/core/ShadowProtocols.swift
edit: test/ClangModules/objc_ir.swift
edit: stdlib/public/core/Runtime.swift.gyb
edit: test/ClangModules/serialization-sil.swift
edit: lib/AST/Module.cpp
edit: stdlib/public/core/ContiguousArrayBuffer.swift
edit: stdlib/public/core/ArrayBufferProtocol.swift
edit: test/Interpreter/SDK/Reflection_KVO.swift
edit: test/1_stdlib/Unmanaged.swift
edit: test/ClangModules/cvars_parse.swift
edit: stdlib/public/core/HashedCollections.swift.gyb
edit: stdlib/public/SDK/Foundation/Data.swift
edit: test/1_stdlib/POSIX.swift
edit: test/SILGen/lying_about_optional_return.swift
edit: test/1_stdlib/ErrorBridged.swift
edit: validation-test/stdlib/ArrayNew.swift.gyb
edit: stdlib/public/SDK/Dispatch/Data.swift
edit: test/Constraints/lvalues.swift
edit: test/Interpreter/errors_imported.swift
edit: stdlib/public/core/VarArgs.swift
edit: lib/PrintAsObjC/PrintAsObjC.cpp
edit: stdlib/public/core/ArrayBuffer.swift
edit: validation-test/stdlib/CoreAudio.swift
edit: stdlib/public/core/Unmanaged.swift
edit: test/ClangModules/ctypes_parse.swift
edit: test/ClangModules/objc_bridging.swift
edit: test/Parse/pointer_conversion.swift.gyb
edit: test/PrintAsObjC/classes.swift
edit: test/1_stdlib/TestData.swift
edit: test/attr/attr_objc.swift
edit: validation-test/stdlib/Arrays.swift.gyb
edit: stdlib/public/SDK/Foundation/IndexPath.swift
edit: test/Constraints/diagnostics.swift
edit: test/1_stdlib/Renames.swift
edit: stdlib/public/SDK/Foundation/NSStringAPI.swift
edit: test/Interpreter/SDK/autolinking.swift
edit: test/SILGen/dso_handle.swift
edit: validation-test/stdlib/NewArray.swift.gyb
edit: validation-test/IDE/complete_from_cocoa.swift
edit: stdlib/public/SDK/Foundation/NSError.swift
edit: test/SILGen/pointer_conversion.swift
edit: test/Interpreter/SDK/KVO.swift
edit: validation-test/stdlib/SceneKit.swift
edit: lib/ClangImporter/ImportType.cpp
edit: stdlib/public/Platform/Platform.swift
edit: stdlib/public/SDK/Foundation/Foundation.swift
edit: stdlib/public/core/BridgeObjectiveC.swift
edit: test/IRGen/objc_pointers.swift
edit: test/SILGen/default_arguments.swift
edit: stdlib/private/SwiftPrivatePthreadExtras/SwiftPrivatePthreadExtras.swift
edit: stdlib/public/SDK/CoreAudio/CoreAudio.swift
edit: benchmark/utils/DriverUtils.swift
edit: stdlib/public/SDK/Dispatch/Private.swift
edit: stdlib/public/core/Arrays.swift.gyb
edit: lib/Sema/CSGen.cpp
edit: test/Interpreter/SDK/c_pointers.swift
edit: test/Parse/pointer_conversion_objc.swift.gyb
edit: test/ClangModules/cfuncs_parse.swift
edit: test/SILGen/objc_currying.swift
edit: validation-test/IDE/complete_from_cocoa_2.swift
edit: test/1_stdlib/KVO.swift
edit: stdlib/public/core/Builtin.swift
edit: stdlib/public/core/CTypes.swift
edit: lib/IDE/CodeCompletion.cpp
edit: stdlib/public/SDK/Dispatch/Queue.swift
edit: stdlib/public/core/Pointer.swift