[Swift CI] Build Failure: 0. OSS - Swift Incremental RA - OS X (master) #3573


(Greg Parker) #1

Doug, a validation test needs an update after your conformance checking changes.

******************** TEST 'Swift :: attr/attr_objc.swift' FAILED ********************
Script:

···

On Apr 22, 2016, at 3:14 PM, no-reply@swift.org wrote:

[FAILURE] oss-swift-incremental-RA-osx [#3573]

Build URL: https://ci.swift.org/job/oss-swift-incremental-RA-osx/3573/
Project: oss-swift-incremental-RA-osx
Date of build: Fri, 22 Apr 2016 14:51:48 -0700
Build duration: 22 min
Identified problems:

  • Compile Error: This build failed because of a compile error. Below is a list of all errors in the build log:
    • Indication 1
  • Regression test failed: This build failed because a regression test in the test suite FAILed. Below is a list of all errors:
    • Indication 1
Tests:

Name: Swift
Failed: 1 test(s), Passed: 7816 test(s), Total: 7817 test(s)
  • Failed: Swift.attr.attr_objc.swift

--
/Users/buildnode/jenkins/workspace/oss-swift-incremental-RA-osx/buildbot_incremental/swift-macosx-x86_64/bin/swiftc -frontend -target x86_64-apple-macosx10.9 -module-cache-path '/var/folders/_8/79jmzf2142z2xydc_01btlx00000gn/T/swift-testsuite-clang-module-cacheubiZe_' -sdk /Applications/Xcode.app/Contents/Developer/Platforms/MacOSX.platform/Developer/SDKs/MacOSX10.11.sdk -parse -verify -disable-objc-attr-requires-foundation-module /Users/buildnode/jenkins/workspace/oss-swift-incremental-RA-osx/swift/test/attr/attr_objc.swift
xcrun --toolchain default --sdk /Applications/Xcode.app/Contents/Developer/Platforms/MacOSX.platform/Developer/SDKs/MacOSX10.11.sdk /Users/buildnode/jenkins/workspace/oss-swift-incremental-RA-osx/buildbot_incremental/swift-macosx-x86_64/bin/swift-ide-test -target x86_64-apple-macosx10.9 -module-cache-path '/var/folders/_8/79jmzf2142z2xydc_01btlx00000gn/T/swift-testsuite-clang-module-cacheubiZe_' -completion-cache-path '/var/folders/_8/79jmzf2142z2xydc_01btlx00000gn/T/swift-testsuite-completion-cachecIh12B' -skip-deinit=false -print-ast-typechecked -source-filename /Users/buildnode/jenkins/workspace/oss-swift-incremental-RA-osx/swift/test/attr/attr_objc.swift -function-definitions=true -prefer-type-repr=false -print-implicit-attrs=true -explode-pattern-binding-decls=true -disable-objc-attr-requires-foundation-module | FileCheck /Users/buildnode/jenkins/workspace/oss-swift-incremental-RA-osx/swift/test/attr/attr_objc.swift
not /Users/buildnode/jenkins/workspace/oss-swift-incremental-RA-osx/buildbot_incremental/swift-macosx-x86_64/bin/swiftc -frontend -target x86_64-apple-macosx10.9 -module-cache-path '/var/folders/_8/79jmzf2142z2xydc_01btlx00000gn/T/swift-testsuite-clang-module-cacheubiZe_' -sdk /Applications/Xcode.app/Contents/Developer/Platforms/MacOSX.platform/Developer/SDKs/MacOSX10.11.sdk -parse -dump-ast -disable-objc-attr-requires-foundation-module /Users/buildnode/jenkins/workspace/oss-swift-incremental-RA-osx/swift/test/attr/attr_objc.swift 2> /Users/buildnode/jenkins/workspace/oss-swift-incremental-RA-osx/buildbot_incremental/swift-macosx-x86_64/test-macosx-x86_64/attr/Output/attr_objc.swift.tmp.dump
FileCheck -check-prefix CHECK-DUMP /Users/buildnode/jenkins/workspace/oss-swift-incremental-RA-osx/swift/test/attr/attr_objc.swift < /Users/buildnode/jenkins/workspace/oss-swift-incremental-RA-osx/buildbot_incremental/swift-macosx-x86_64/test-macosx-x86_64/attr/Output/attr_objc.swift.tmp.dump
--
Exit Code: 1

Command Output (stderr):
--
/Users/buildnode/jenkins/workspace/oss-swift-incremental-RA-osx/swift/test/attr/attr_objc.swift:2032:14: error: unexpected note produced: candidate has non-matching type '(Int) throws -> String'
  @objc func doThing(_ x: Int) throws -> String { return "" }
             ^

--
Greg Parker gparker@apple.com Runtime Wrangler


(Greg Parker) #2

… and you already fixed it an hour ago. Thanks.

···

On Apr 22, 2016, at 4:13 PM, Greg Parker <gparker@apple.com> wrote:

On Apr 22, 2016, at 3:14 PM, no-reply@swift.org wrote:

[FAILURE] oss-swift-incremental-RA-osx [#3573]

Build URL: https://ci.swift.org/job/oss-swift-incremental-RA-osx/3573/
Project: oss-swift-incremental-RA-osx
Date of build: Fri, 22 Apr 2016 14:51:48 -0700
Build duration: 22 min
Identified problems:

  • Compile Error: This build failed because of a compile error. Below is a list of all errors in the build log:
    • Indication 1
  • Regression test failed: This build failed because a regression test in the test suite FAILed. Below is a list of all errors:
    • Indication 1
Tests:

Name: Swift
Failed: 1 test(s), Passed: 7816 test(s), Total: 7817 test(s)
  • Failed: Swift.attr.attr_objc.swift

Doug, a validation test needs an update after your conformance checking changes.

--
Greg Parker gparker@apple.com <mailto:gparker@apple.com> Runtime Wrangler