[Swift CI] Build Failure: 0. OSS - Swift Incremental RA - OS X (master) #2146


(Daniel Dunbar) #1

This is failing to build in the Foundation overlay:

···

--
FAILED: cd /Users/buildnode/jenkins/workspace/oss-swift-incremental-RA-osx/buildbot_incremental/swift-macosx-x86_64/stdlib/public/SDK/Foundation && /Applications/CMake.app/Contents/bin/cmake -E make_directory /Users/buildnode/jenkins/workspace/oss-swift-incremental-RA-osx/buildbot_incremental/swift-macosx-x86_64/stdlib/public/SDK/Foundation/macosx/x86_64 && /Applications/CMake.app/Contents/bin/cmake -E make_directory /Users/buildnode/jenkins/workspace/oss-swift-incremental-RA-osx/buildbot_incremental/swift-macosx-x86_64/./lib/swift/macosx/x86_64 && /Users/buildnode/jenkins/workspace/oss-swift-incremental-RA-osx/buildbot_incremental/llvm-macosx-x86_64/bin/clang -cc1apinotes -yaml-to-binary -o /Users/buildnode/jenkins/workspace/oss-swift-incremental-RA-osx/buildbot_incremental/swift-macosx-x86_64/./lib/swift/macosx/x86_64/Foundation.apinotesc -target x86_64-apple-macosx10.9 /Users/buildnode/jenkins/workspace/oss-swift-incremental-RA-osx/swift/apinotes/Foundation.apinotes && /Users/buildnode/jenkins/workspace/oss-swift-incremental-RA-osx/swift/utils/line-directive /Users/buildnode/jenkins/workspace/oss-swift-incremental-RA-osx/swift/stdlib/public/SDK/Foundation/Foundation.swift /Users/buildnode/jenkins/workspace/oss-swift-incremental-RA-osx/swift/stdlib/public/SDK/Foundation/NSError.swift /Users/buildnode/jenkins/workspace/oss-swift-incremental-RA-osx/swift/stdlib/public/SDK/Foundation/NSStringAPI.swift /Users/buildnode/jenkins/workspace/oss-swift-incremental-RA-osx/swift/stdlib/public/SDK/Foundation/NSValue.swift /Users/buildnode/jenkins/workspace/oss-swift-incremental-RA-osx/swift/stdlib/public/SDK/Foundation/ExtraStringAPIs.swift -- /Users/buildnode/jenkins/workspace/oss-swift-incremental-RA-osx/buildbot_incremental/swift-macosx-x86_64/./bin/swiftc -c -sdk /Applications/Xcode.app/Contents/Developer/Platforms/MacOSX.platform/Developer/SDKs/MacOSX10.11.sdk -target x86_64-apple-macosx10.9 -F /Applications/Xcode.app/Contents/Developer/Platforms/MacOSX.platform/Developer/SDKs/MacOSX10.11.sdk/../../../Developer/Library/Frameworks -O -D INTERNAL_CHECKS_ENABLED -I /Users/buildnode/jenkins/workspace/oss-swift-incremental-RA-osx/buildbot_incremental/swift-macosx-x86_64/./lib/swift/macosx/x86_64 -module-cache-path /Users/buildnode/jenkins/workspace/oss-swift-incremental-RA-osx/buildbot_incremental/swift-macosx-x86_64/./clang-module-cache -no-link-objc-runtime -autolink-force-load -module-link-name swiftFoundation -force-single-frontend-invocation -parse-as-library -emit-module -emit-module-path /Users/buildnode/jenkins/workspace/oss-swift-incremental-RA-osx/buildbot_incremental/swift-macosx-x86_64/./lib/swift/macosx/x86_64/Foundation.swiftmodule -o /Users/buildnode/jenkins/workspace/oss-swift-incremental-RA-osx/buildbot_incremental/swift-macosx-x86_64/stdlib/public/SDK/Foundation/macosx/x86_64/Foundation.o /Users/buildnode/jenkins/workspace/oss-swift-incremental-RA-osx/swift/stdlib/public/SDK/Foundation/Foundation.swift /Users/buildnode/jenkins/workspace/oss-swift-incremental-RA-osx/swift/stdlib/public/SDK/Foundation/NSError.swift /Users/buildnode/jenkins/workspace/oss-swift-incremental-RA-osx/swift/stdlib/public/SDK/Foundation/NSStringAPI.swift /Users/buildnode/jenkins/workspace/oss-swift-incremental-RA-osx/swift/stdlib/public/SDK/Foundation/NSValue.swift /Users/buildnode/jenkins/workspace/oss-swift-incremental-RA-osx/swift/stdlib/public/SDK/Foundation/ExtraStringAPIs.swift
<>/Users/buildnode/jenkins/workspace/oss-swift-incremental-RA-osx/swift/stdlib/public/SDK/Foundation/Foundation.swift:58:1: error: type 'NSObject' does not conform to protocol 'CustomStringConvertible'
extension NSObject : CustomStringConvertible {}
^
Swift.CustomStringConvertible:15:16: note: protocol requires property 'description' with type 'String'
    public var description: String { get }
               ^
ObjectiveC.NSObject:61:23: note: candidate is not a variable
    public class func description() -> String!
                      ^
ObjectiveC.NSObject:122:16: note: candidate has non-matching type 'String!'
    public var description: String! { get }
               ^
/Users/buildnode/jenkins/workspace/oss-swift-incremental-RA-osx/swift/stdlib/public/SDK/Foundation/Foundation.swift:59:1: error: type 'NSObject' does not conform to protocol 'CustomDebugStringConvertible'
extension NSObject : CustomDebugStringConvertible {}
^
Swift.CustomDebugStringConvertible:20:16: note: protocol requires property 'debugDescription' with type 'String'
    public var debugDescription: String { get }
               ^
ObjectiveC.NSObject:62:23: note: candidate is not a variable
    public class func debugDescription() -> String!
                      ^
ObjectiveC.NSObject:124:16: note: candidate has non-matching type 'String!'
    public var debugDescription: String! { get }
--

- Daniel

On Feb 19, 2016, at 9:22 AM, no-reply@swift.org wrote:

[FAILURE] oss-swift-incremental-RA-osx [#2146]

Build URL: https://ci.swift.org/job/oss-swift-incremental-RA-osx/2146/
Project: oss-swift-incremental-RA-osx
Date of build: Fri, 19 Feb 2016 11:19:35 -0600
Build duration: 3 min 14 sec
Identified problems:

Compile Error: This build failed because of a compile error. Below is a list of all errors in the build log:
Indication 1 <https://ci.swift.org//job/oss-swift-incremental-RA-osx/2146/consoleFull#-1706204976ee1a197b-acac-4b17-83cf-a53b95139a76>
Changes

Commit 7ddaafd3182341fe83a2cffcffd7b04949381d58 by daniel_dunbar:
[libllbuild] Remove stray debugging print.

edit: products/libllbuild/BuildSystem-C-API.cpp


(Jordan Rose) #2

This just looks like it failed to pick up Doug's changes in swift-clang. (But if that's not it, it's Doug's fault.)

Jordan

···

On Feb 19, 2016, at 9:23, Daniel Dunbar via swift-dev <swift-dev@swift.org> wrote:

This is failing to build in the Foundation overlay:
--
FAILED: cd /Users/buildnode/jenkins/workspace/oss-swift-incremental-RA-osx/buildbot_incremental/swift-macosx-x86_64/stdlib/public/SDK/Foundation && /Applications/CMake.app/Contents/bin/cmake -E make_directory /Users/buildnode/jenkins/workspace/oss-swift-incremental-RA-osx/buildbot_incremental/swift-macosx-x86_64/stdlib/public/SDK/Foundation/macosx/x86_64 && /Applications/CMake.app/Contents/bin/cmake -E make_directory /Users/buildnode/jenkins/workspace/oss-swift-incremental-RA-osx/buildbot_incremental/swift-macosx-x86_64/./lib/swift/macosx/x86_64 && /Users/buildnode/jenkins/workspace/oss-swift-incremental-RA-osx/buildbot_incremental/llvm-macosx-x86_64/bin/clang -cc1apinotes -yaml-to-binary -o /Users/buildnode/jenkins/workspace/oss-swift-incremental-RA-osx/buildbot_incremental/swift-macosx-x86_64/./lib/swift/macosx/x86_64/Foundation.apinotesc -target x86_64-apple-macosx10.9 /Users/buildnode/jenkins/workspace/oss-swift-incremental-RA-osx/swift/apinotes/Foundation.apinotes && /Users/buildnode/jenkins/workspace/oss-swift-incremental-RA-osx/swift/utils/line-directive /Users/buildnode/jenkins/workspace/oss-swift-incremental-RA-osx/swift/stdlib/public/SDK/Foundation/Foundation.swift /Users/buildnode/jenkins/workspace/oss-swift-incremental-RA-osx/swift/stdlib/public/SDK/Foundation/NSError.swift /Users/buildnode/jenkins/workspace/oss-swift-incremental-RA-osx/swift/stdlib/public/SDK/Foundation/NSStringAPI.swift /Users/buildnode/jenkins/workspace/oss-swift-incremental-RA-osx/swift/stdlib/public/SDK/Foundation/NSValue.swift /Users/buildnode/jenkins/workspace/oss-swift-incremental-RA-osx/swift/stdlib/public/SDK/Foundation/ExtraStringAPIs.swift -- /Users/buildnode/jenkins/workspace/oss-swift-incremental-RA-osx/buildbot_incremental/swift-macosx-x86_64/./bin/swiftc -c -sdk /Applications/Xcode.app/Contents/Developer/Platforms/MacOSX.platform/Developer/SDKs/MacOSX10.11.sdk -target x86_64-apple-macosx10.9 -F /Applications/Xcode.app/Contents/Developer/Platforms/MacOSX.platform/Developer/SDKs/MacOSX10.11.sdk/../../../Developer/Library/Frameworks -O -D INTERNAL_CHECKS_ENABLED -I /Users/buildnode/jenkins/workspace/oss-swift-incremental-RA-osx/buildbot_incremental/swift-macosx-x86_64/./lib/swift/macosx/x86_64 -module-cache-path /Users/buildnode/jenkins/workspace/oss-swift-incremental-RA-osx/buildbot_incremental/swift-macosx-x86_64/./clang-module-cache -no-link-objc-runtime -autolink-force-load -module-link-name swiftFoundation -force-single-frontend-invocation -parse-as-library -emit-module -emit-module-path /Users/buildnode/jenkins/workspace/oss-swift-incremental-RA-osx/buildbot_incremental/swift-macosx-x86_64/./lib/swift/macosx/x86_64/Foundation.swiftmodule -o /Users/buildnode/jenkins/workspace/oss-swift-incremental-RA-osx/buildbot_incremental/swift-macosx-x86_64/stdlib/public/SDK/Foundation/macosx/x86_64/Foundation.o /Users/buildnode/jenkins/workspace/oss-swift-incremental-RA-osx/swift/stdlib/public/SDK/Foundation/Foundation.swift /Users/buildnode/jenkins/workspace/oss-swift-incremental-RA-osx/swift/stdlib/public/SDK/Foundation/NSError.swift /Users/buildnode/jenkins/workspace/oss-swift-incremental-RA-osx/swift/stdlib/public/SDK/Foundation/NSStringAPI.swift /Users/buildnode/jenkins/workspace/oss-swift-incremental-RA-osx/swift/stdlib/public/SDK/Foundation/NSValue.swift /Users/buildnode/jenkins/workspace/oss-swift-incremental-RA-osx/swift/stdlib/public/SDK/Foundation/ExtraStringAPIs.swift
<>/Users/buildnode/jenkins/workspace/oss-swift-incremental-RA-osx/swift/stdlib/public/SDK/Foundation/Foundation.swift:58:1: error: type 'NSObject' does not conform to protocol 'CustomStringConvertible'
extension NSObject : CustomStringConvertible {}
^
Swift.CustomStringConvertible:15:16: note: protocol requires property 'description' with type 'String'
    public var description: String { get }
               ^
ObjectiveC.NSObject:61:23: note: candidate is not a variable
    public class func description() -> String!
                      ^
ObjectiveC.NSObject:122:16: note: candidate has non-matching type 'String!'
    public var description: String! { get }
               ^
/Users/buildnode/jenkins/workspace/oss-swift-incremental-RA-osx/swift/stdlib/public/SDK/Foundation/Foundation.swift:59:1: error: type 'NSObject' does not conform to protocol 'CustomDebugStringConvertible'
extension NSObject : CustomDebugStringConvertible {}
^
Swift.CustomDebugStringConvertible:20:16: note: protocol requires property 'debugDescription' with type 'String'
    public var debugDescription: String { get }
               ^
ObjectiveC.NSObject:62:23: note: candidate is not a variable
    public class func debugDescription() -> String!
                      ^
ObjectiveC.NSObject:124:16: note: candidate has non-matching type 'String!'
    public var debugDescription: String! { get }
--

- Daniel

On Feb 19, 2016, at 9:22 AM, no-reply@swift.org <mailto:no-reply@swift.org> wrote:

[FAILURE] oss-swift-incremental-RA-osx [#2146]

Build URL: https://ci.swift.org/job/oss-swift-incremental-RA-osx/2146/
Project: oss-swift-incremental-RA-osx
Date of build: Fri, 19 Feb 2016 11:19:35 -0600
Build duration: 3 min 14 sec
Identified problems:

Compile Error: This build failed because of a compile error. Below is a list of all errors in the build log:
Indication 1 <https://ci.swift.org//job/oss-swift-incremental-RA-osx/2146/consoleFull#-1706204976ee1a197b-acac-4b17-83cf-a53b95139a76>
Changes

Commit 7ddaafd3182341fe83a2cffcffd7b04949381d58 by daniel_dunbar:
[libllbuild] Remove stray debugging print.

edit: products/libllbuild/BuildSystem-C-API.cpp

_______________________________________________
swift-dev mailing list
swift-dev@swift.org
https://lists.swift.org/mailman/listinfo/swift-dev


(Dmitri Gribenko) #3

+Mishal

···

On Fri, Feb 19, 2016 at 10:04 AM, Jordan Rose via swift-dev < swift-dev@swift.org> wrote:

This just looks like it failed to pick up Doug's changes in swift-clang.
(But if that's not it, it's Doug's fault.)

Jordan

On Feb 19, 2016, at 9:23, Daniel Dunbar via swift-dev <swift-dev@swift.org> > wrote:

This is failing to build in the Foundation overlay:
--

FAILED: cd /Users/buildnode/jenkins/workspace/oss-swift-incremental-RA-osx/buildbot_incremental/swift-macosx-x86_64/stdlib/public/SDK/Foundation && /Applications/CMake.app/Contents/bin/cmake -E make_directory /Users/buildnode/jenkins/workspace/oss-swift-incremental-RA-osx/buildbot_incremental/swift-macosx-x86_64/stdlib/public/SDK/Foundation/macosx/x86_64 && /Applications/CMake.app/Contents/bin/cmake -E make_directory /Users/buildnode/jenkins/workspace/oss-swift-incremental-RA-osx/buildbot_incremental/swift-macosx-x86_64/./lib/swift/macosx/x86_64 && /Users/buildnode/jenkins/workspace/oss-swift-incremental-RA-osx/buildbot_incremental/llvm-macosx-x86_64/bin/clang -cc1apinotes -yaml-to-binary -o /Users/buildnode/jenkins/workspace/oss-swift-incremental-RA-osx/buildbot_incremental/swift-macosx-x86_64/./lib/swift/macosx/x86_64/Foundation.apinotesc -target x86_64-apple-macosx10.9 /Users/buildnode/jenkins/workspace/oss-swift-incremental-RA-osx/swift/apinotes/Foundation.apinotes && /Users/buildnode/jenkins/workspace/oss-swift-incremental-RA-osx/swift/utils/line-directive /Users/buildnode/jenkins/workspace/oss-swift-incremental-RA-osx/swift/stdlib/public/SDK/Foundation/Foundation.swift /Users/buildnode/jenkins/workspace/oss-swift-incremental-RA-osx/swift/stdlib/public/SDK/Foundation/NSError.swift /Users/buildnode/jenkins/workspace/oss-swift-incremental-RA-osx/swift/stdlib/public/SDK/Foundation/NSStringAPI.swift /Users/buildnode/jenkins/workspace/oss-swift-incremental-RA-osx/swift/stdlib/public/SDK/Foundation/NSValue.swift /Users/buildnode/jenkins/workspace/oss-swift-incremental-RA-osx/swift/stdlib/public/SDK/Foundation/ExtraStringAPIs.swift -- /Users/buildnode/jenkins/workspace/oss-swift-incremental-RA-osx/buildbot_incremental/swift-macosx-x86_64/./bin/swiftc -c -sdk /Applications/Xcode.app/Contents/Developer/Platforms/MacOSX.platform/Developer/SDKs/MacOSX10.11.sdk -target x86_64-apple-macosx10.9 -F /Applications/Xcode.app/Contents/Developer/Platforms/MacOSX.platform/Developer/SDKs/MacOSX10.11.sdk/../../../Developer/Library/Frameworks -O -D INTERNAL_CHECKS_ENABLED -I /Users/buildnode/jenkins/workspace/oss-swift-incremental-RA-osx/buildbot_incremental/swift-macosx-x86_64/./lib/swift/macosx/x86_64 -module-cache-path /Users/buildnode/jenkins/workspace/oss-swift-incremental-RA-osx/buildbot_incremental/swift-macosx-x86_64/./clang-module-cache -no-link-objc-runtime -autolink-force-load -module-link-name swiftFoundation -force-single-frontend-invocation -parse-as-library -emit-module -emit-module-path /Users/buildnode/jenkins/workspace/oss-swift-incremental-RA-osx/buildbot_incremental/swift-macosx-x86_64/./lib/swift/macosx/x86_64/Foundation.swiftmodule -o /Users/buildnode/jenkins/workspace/oss-swift-incremental-RA-osx/buildbot_incremental/swift-macosx-x86_64/stdlib/public/SDK/Foundation/macosx/x86_64/Foundation.o /Users/buildnode/jenkins/workspace/oss-swift-incremental-RA-osx/swift/stdlib/public/SDK/Foundation/Foundation.swift /Users/buildnode/jenkins/workspace/oss-swift-incremental-RA-osx/swift/stdlib/public/SDK/Foundation/NSError.swift /Users/buildnode/jenkins/workspace/oss-swift-incremental-RA-osx/swift/stdlib/public/SDK/Foundation/NSStringAPI.swift /Users/buildnode/jenkins/workspace/oss-swift-incremental-RA-osx/swift/stdlib/public/SDK/Foundation/NSValue.swift /Users/buildnode/jenkins/workspace/oss-swift-incremental-RA-osx/swift/stdlib/public/SDK/Foundation/ExtraStringAPIs.swift/Users/buildnode/jenkins/workspace/oss-swift-incremental-RA-osx/swift/stdlib/public/SDK/Foundation/Foundation.swift:58:1: error: type 'NSObject' does not conform to protocol 'CustomStringConvertible'extension NSObject : CustomStringConvertible {}
^
Swift.CustomStringConvertible:15:16: note: protocol requires property 'description' with type 'String'
    public var description: String { get }
               ^
ObjectiveC.NSObject:61:23: note: candidate is not a variable
    public class func description() -> String!
                      ^
ObjectiveC.NSObject:122:16: note: candidate has non-matching type 'String!'
    public var description: String! { get }
               ^
/Users/buildnode/jenkins/workspace/oss-swift-incremental-RA-osx/swift/stdlib/public/SDK/Foundation/Foundation.swift:59:1: error: type 'NSObject' does not conform to protocol 'CustomDebugStringConvertible'
extension NSObject : CustomDebugStringConvertible {}
^
Swift.CustomDebugStringConvertible:20:16: note: protocol requires property 'debugDescription' with type 'String'
    public var debugDescription: String { get }
               ^
ObjectiveC.NSObject:62:23: note: candidate is not a variable
    public class func debugDescription() -> String!
                      ^
ObjectiveC.NSObject:124:16: note: candidate has non-matching type 'String!'
    public var debugDescription: String! { get }

--

- Daniel

On Feb 19, 2016, at 9:22 AM, no-reply@swift.org wrote:

[FAILURE] oss-swift-incremental-RA-osx [#2146]
Build URL: https://ci.swift.org/job/oss-swift-incremental-RA-osx/2146/
Project: oss-swift-incremental-RA-osx
Date of build: Fri, 19 Feb 2016 11:19:35 -0600
Build duration: 3 min 14 secIdentified problems:

   - Compile Error: This build failed because of a compile error. Below
   is a list of all errors in the build log:
      - Indication 1
      <https://ci.swift.org//job/oss-swift-incremental-RA-osx/2146/consoleFull#-1706204976ee1a197b-acac-4b17-83cf-a53b95139a76>

Changes

   - Commit *7ddaafd3182341fe83a2cffcffd7b04949381d58* by *daniel_dunbar:*

   [libllbuild] Remove stray debugging print.
   - *edit*: products/libllbuild/BuildSystem-C-API.cpp

_______________________________________________
swift-dev mailing list
swift-dev@swift.org
https://lists.swift.org/mailman/listinfo/swift-dev

_______________________________________________
swift-dev mailing list
swift-dev@swift.org
https://lists.swift.org/mailman/listinfo/swift-dev

--
main(i,j){for(i=2;;i++){for(j=2;j<i;j++){if(!(i%j)){j=0;break;}}if
(j){printf("%d\n",i);}}} /*Dmitri Gribenko <gribozavr@gmail.com>*/


(Douglas Gregor) #4

It didn't pick up my clang changes

···

Sent from my iPhone

On Feb 19, 2016, at 10:04 AM, Jordan Rose <jordan_rose@apple.com> wrote:

This just looks like it failed to pick up Doug's changes in swift-clang. (But if that's not it, it's Doug's fault.)

Jordan

On Feb 19, 2016, at 9:23, Daniel Dunbar via swift-dev <swift-dev@swift.org> wrote:

This is failing to build in the Foundation overlay:
--
FAILED: cd /Users/buildnode/jenkins/workspace/oss-swift-incremental-RA-osx/buildbot_incremental/swift-macosx-x86_64/stdlib/public/SDK/Foundation && /Applications/CMake.app/Contents/bin/cmake -E make_directory /Users/buildnode/jenkins/workspace/oss-swift-incremental-RA-osx/buildbot_incremental/swift-macosx-x86_64/stdlib/public/SDK/Foundation/macosx/x86_64 && /Applications/CMake.app/Contents/bin/cmake -E make_directory /Users/buildnode/jenkins/workspace/oss-swift-incremental-RA-osx/buildbot_incremental/swift-macosx-x86_64/./lib/swift/macosx/x86_64 && /Users/buildnode/jenkins/workspace/oss-swift-incremental-RA-osx/buildbot_incremental/llvm-macosx-x86_64/bin/clang -cc1apinotes -yaml-to-binary -o /Users/buildnode/jenkins/workspace/oss-swift-incremental-RA-osx/buildbot_incremental/swift-macosx-x86_64/./lib/swift/macosx/x86_64/Foundation.apinotesc -target x86_64-apple-macosx10.9 /Users/buildnode/jenkins/workspace/oss-swift-incremental-RA-osx/swift/apinotes/Foundation.apinotes && /Users/buildnode/jenkins/workspace/oss-swift-incremental-RA-osx/swift/utils/line-directive /Users/buildnode/jenkins/workspace/oss-swift-incremental-RA-osx/swift/stdlib/public/SDK/Foundation/Foundation.swift /Users/buildnode/jenkins/workspace/oss-swift-incremental-RA-osx/swift/stdlib/public/SDK/Foundation/NSError.swift /Users/buildnode/jenkins/workspace/oss-swift-incremental-RA-osx/swift/stdlib/public/SDK/Foundation/NSStringAPI.swift /Users/buildnode/jenkins/workspace/oss-swift-incremental-RA-osx/swift/stdlib/public/SDK/Foundation/NSValue.swift /Users/buildnode/jenkins/workspace/oss-swift-incremental-RA-osx/swift/stdlib/public/SDK/Foundation/ExtraStringAPIs.swift -- /Users/buildnode/jenkins/workspace/oss-swift-incremental-RA-osx/buildbot_incremental/swift-macosx-x86_64/./bin/swiftc -c -sdk /Applications/Xcode.app/Contents/Developer/Platforms/MacOSX.platform/Developer/SDKs/MacOSX10.11.sdk -target x86_64-apple-macosx10.9 -F /Applications/Xcode.app/Contents/Developer/Platforms/MacOSX.platform/Developer/SDKs/MacOSX10.11.sdk/../../../Developer/Library/Frameworks -O -D INTERNAL_CHECKS_ENABLED -I /Users/buildnode/jenkins/workspace/oss-swift-incremental-RA-osx/buildbot_incremental/swift-macosx-x86_64/./lib/swift/macosx/x86_64 -module-cache-path /Users/buildnode/jenkins/workspace/oss-swift-incremental-RA-osx/buildbot_incremental/swift-macosx-x86_64/./clang-module-cache -no-link-objc-runtime -autolink-force-load -module-link-name swiftFoundation -force-single-frontend-invocation -parse-as-library -emit-module -emit-module-path /Users/buildnode/jenkins/workspace/oss-swift-incremental-RA-osx/buildbot_incremental/swift-macosx-x86_64/./lib/swift/macosx/x86_64/Foundation.swiftmodule -o /Users/buildnode/jenkins/workspace/oss-swift-incremental-RA-osx/buildbot_incremental/swift-macosx-x86_64/stdlib/public/SDK/Foundation/macosx/x86_64/Foundation.o /Users/buildnode/jenkins/workspace/oss-swift-incremental-RA-osx/swift/stdlib/public/SDK/Foundation/Foundation.swift /Users/buildnode/jenkins/workspace/oss-swift-incremental-RA-osx/swift/stdlib/public/SDK/Foundation/NSError.swift /Users/buildnode/jenkins/workspace/oss-swift-incremental-RA-osx/swift/stdlib/public/SDK/Foundation/NSStringAPI.swift /Users/buildnode/jenkins/workspace/oss-swift-incremental-RA-osx/swift/stdlib/public/SDK/Foundation/NSValue.swift /Users/buildnode/jenkins/workspace/oss-swift-incremental-RA-osx/swift/stdlib/public/SDK/Foundation/ExtraStringAPIs.swift
/Users/buildnode/jenkins/workspace/oss-swift-incremental-RA-osx/swift/stdlib/public/SDK/Foundation/Foundation.swift:58:1: error: type 'NSObject' does not conform to protocol 'CustomStringConvertible'
extension NSObject : CustomStringConvertible {}
^
Swift.CustomStringConvertible:15:16: note: protocol requires property 'description' with type 'String'
    public var description: String { get }
               ^
ObjectiveC.NSObject:61:23: note: candidate is not a variable
    public class func description() -> String!
                      ^
ObjectiveC.NSObject:122:16: note: candidate has non-matching type 'String!'
    public var description: String! { get }
               ^
/Users/buildnode/jenkins/workspace/oss-swift-incremental-RA-osx/swift/stdlib/public/SDK/Foundation/Foundation.swift:59:1: error: type 'NSObject' does not conform to protocol 'CustomDebugStringConvertible'
extension NSObject : CustomDebugStringConvertible {}
^
Swift.CustomDebugStringConvertible:20:16: note: protocol requires property 'debugDescription' with type 'String'
    public var debugDescription: String { get }
               ^
ObjectiveC.NSObject:62:23: note: candidate is not a variable
    public class func debugDescription() -> String!
                      ^
ObjectiveC.NSObject:124:16: note: candidate has non-matching type 'String!'
    public var debugDescription: String! { get }
--

- Daniel

On Feb 19, 2016, at 9:22 AM, no-reply@swift.org wrote:

[FAILURE] oss-swift-incremental-RA-osx [#2146]

Build URL: https://ci.swift.org/job/oss-swift-incremental-RA-osx/2146/
Project: oss-swift-incremental-RA-osx
Date of build: Fri, 19 Feb 2016 11:19:35 -0600
Build duration: 3 min 14 sec
Identified problems:

Compile Error: This build failed because of a compile error. Below is a list of all errors in the build log:
Indication 1

Changes

Commit 7ddaafd3182341fe83a2cffcffd7b04949381d58 by daniel_dunbar:
[libllbuild] Remove stray debugging print.

edit: products/libllbuild/BuildSystem-C-API.cpp

_______________________________________________
swift-dev mailing list
swift-dev@swift.org
https://lists.swift.org/mailman/listinfo/swift-dev


(Mishal Shah) #5

Hi Jordan,

This build on CI picked up latest commit on swift-clang stable branch.

Revision: 3d015ad63e94f179bb9154e8a0905d4cb62ea64c from SCM: clang
refs/remotes/origin/stable
Thanks,
Mishal Shah

···

On Feb 19, 2016, at 10:42 AM, Dmitri Gribenko <gribozavr@gmail.com> wrote:

+Mishal

On Fri, Feb 19, 2016 at 10:04 AM, Jordan Rose via swift-dev <swift-dev@swift.org <mailto:swift-dev@swift.org>> wrote:
This just looks like it failed to pick up Doug's changes in swift-clang. (But if that's not it, it's Doug's fault.)

Jordan

On Feb 19, 2016, at 9:23, Daniel Dunbar via swift-dev <swift-dev@swift.org <mailto:swift-dev@swift.org>> wrote:

This is failing to build in the Foundation overlay:
--
FAILED: cd /Users/buildnode/jenkins/workspace/oss-swift-incremental-RA-osx/buildbot_incremental/swift-macosx-x86_64/stdlib/public/SDK/Foundation && /Applications/CMake.app/Contents/bin/cmake -E make_directory /Users/buildnode/jenkins/workspace/oss-swift-incremental-RA-osx/buildbot_incremental/swift-macosx-x86_64/stdlib/public/SDK/Foundation/macosx/x86_64 && /Applications/CMake.app/Contents/bin/cmake -E make_directory /Users/buildnode/jenkins/workspace/oss-swift-incremental-RA-osx/buildbot_incremental/swift-macosx-x86_64/./lib/swift/macosx/x86_64 && /Users/buildnode/jenkins/workspace/oss-swift-incremental-RA-osx/buildbot_incremental/llvm-macosx-x86_64/bin/clang -cc1apinotes -yaml-to-binary -o /Users/buildnode/jenkins/workspace/oss-swift-incremental-RA-osx/buildbot_incremental/swift-macosx-x86_64/./lib/swift/macosx/x86_64/Foundation.apinotesc -target x86_64-apple-macosx10.9 /Users/buildnode/jenkins/workspace/oss-swift-incremental-RA-osx/swift/apinotes/Foundation.apinotes && /Users/buildnode/jenkins/workspace/oss-swift-incremental-RA-osx/swift/utils/line-directive /Users/buildnode/jenkins/workspace/oss-swift-incremental-RA-osx/swift/stdlib/public/SDK/Foundation/Foundation.swift /Users/buildnode/jenkins/workspace/oss-swift-incremental-RA-osx/swift/stdlib/public/SDK/Foundation/NSError.swift /Users/buildnode/jenkins/workspace/oss-swift-incremental-RA-osx/swift/stdlib/public/SDK/Foundation/NSStringAPI.swift /Users/buildnode/jenkins/workspace/oss-swift-incremental-RA-osx/swift/stdlib/public/SDK/Foundation/NSValue.swift /Users/buildnode/jenkins/workspace/oss-swift-incremental-RA-osx/swift/stdlib/public/SDK/Foundation/ExtraStringAPIs.swift -- /Users/buildnode/jenkins/workspace/oss-swift-incremental-RA-osx/buildbot_incremental/swift-macosx-x86_64/./bin/swiftc -c -sdk /Applications/Xcode.app/Contents/Developer/Platforms/MacOSX.platform/Developer/SDKs/MacOSX10.11.sdk -target x86_64-apple-macosx10.9 -F /Applications/Xcode.app/Contents/Developer/Platforms/MacOSX.platform/Developer/SDKs/MacOSX10.11.sdk/../../../Developer/Library/Frameworks -O -D INTERNAL_CHECKS_ENABLED -I /Users/buildnode/jenkins/workspace/oss-swift-incremental-RA-osx/buildbot_incremental/swift-macosx-x86_64/./lib/swift/macosx/x86_64 -module-cache-path /Users/buildnode/jenkins/workspace/oss-swift-incremental-RA-osx/buildbot_incremental/swift-macosx-x86_64/./clang-module-cache -no-link-objc-runtime -autolink-force-load -module-link-name swiftFoundation -force-single-frontend-invocation -parse-as-library -emit-module -emit-module-path /Users/buildnode/jenkins/workspace/oss-swift-incremental-RA-osx/buildbot_incremental/swift-macosx-x86_64/./lib/swift/macosx/x86_64/Foundation.swiftmodule -o /Users/buildnode/jenkins/workspace/oss-swift-incremental-RA-osx/buildbot_incremental/swift-macosx-x86_64/stdlib/public/SDK/Foundation/macosx/x86_64/Foundation.o /Users/buildnode/jenkins/workspace/oss-swift-incremental-RA-osx/swift/stdlib/public/SDK/Foundation/Foundation.swift /Users/buildnode/jenkins/workspace/oss-swift-incremental-RA-osx/swift/stdlib/public/SDK/Foundation/NSError.swift /Users/buildnode/jenkins/workspace/oss-swift-incremental-RA-osx/swift/stdlib/public/SDK/Foundation/NSStringAPI.swift /Users/buildnode/jenkins/workspace/oss-swift-incremental-RA-osx/swift/stdlib/public/SDK/Foundation/NSValue.swift /Users/buildnode/jenkins/workspace/oss-swift-incremental-RA-osx/swift/stdlib/public/SDK/Foundation/ExtraStringAPIs.swift
<>/Users/buildnode/jenkins/workspace/oss-swift-incremental-RA-osx/swift/stdlib/public/SDK/Foundation/Foundation.swift:58:1: error: type 'NSObject' does not conform to protocol 'CustomStringConvertible'
extension NSObject : CustomStringConvertible {}
^
Swift.CustomStringConvertible:15:16: note: protocol requires property 'description' with type 'String'
    public var description: String { get }
               ^
ObjectiveC.NSObject:61:23: note: candidate is not a variable
    public class func description() -> String!
                      ^
ObjectiveC.NSObject:122:16: note: candidate has non-matching type 'String!'
    public var description: String! { get }
               ^
/Users/buildnode/jenkins/workspace/oss-swift-incremental-RA-osx/swift/stdlib/public/SDK/Foundation/Foundation.swift:59:1: error: type 'NSObject' does not conform to protocol 'CustomDebugStringConvertible'
extension NSObject : CustomDebugStringConvertible {}
^
Swift.CustomDebugStringConvertible:20:16: note: protocol requires property 'debugDescription' with type 'String'
    public var debugDescription: String { get }
               ^
ObjectiveC.NSObject:62:23: note: candidate is not a variable
    public class func debugDescription() -> String!
                      ^
ObjectiveC.NSObject:124:16: note: candidate has non-matching type 'String!'
    public var debugDescription: String! { get }
--

- Daniel

On Feb 19, 2016, at 9:22 AM, no-reply@swift.org <mailto:no-reply@swift.org> wrote:

[FAILURE] oss-swift-incremental-RA-osx [#2146]

Build URL: https://ci.swift.org/job/oss-swift-incremental-RA-osx/2146/
Project: oss-swift-incremental-RA-osx
Date of build: Fri, 19 Feb 2016 11:19:35 -0600
Build duration: 3 min 14 sec
Identified problems:

Compile Error: This build failed because of a compile error. Below is a list of all errors in the build log:
Indication 1 <https://ci.swift.org//job/oss-swift-incremental-RA-osx/2146/consoleFull#-1706204976ee1a197b-acac-4b17-83cf-a53b95139a76>
Changes

Commit 7ddaafd3182341fe83a2cffcffd7b04949381d58 by daniel_dunbar:
[libllbuild] Remove stray debugging print.

edit: products/libllbuild/BuildSystem-C-API.cpp

_______________________________________________
swift-dev mailing list
swift-dev@swift.org <mailto:swift-dev@swift.org>
https://lists.swift.org/mailman/listinfo/swift-dev

_______________________________________________
swift-dev mailing list
swift-dev@swift.org <mailto:swift-dev@swift.org>
https://lists.swift.org/mailman/listinfo/swift-dev

--
main(i,j){for(i=2;;i++){for(j=2;j<i;j++){if(!(i%j)){j=0;break;}}if
(j){printf("%d\n",i);}}} /*Dmitri Gribenko <gribozavr@gmail.com <mailto:gribozavr@gmail.com>>*/


(Mishal Shah) #6

After cleaning the workspace the bot is blue again.

https://ci.swift.org/job/oss-swift-incremental-RA-osx/2151/

Thanks,
Mishal Shah

···

On Feb 19, 2016, at 11:48 AM, Douglas Gregor via swift-dev <swift-dev@swift.org> wrote:

It didn't pick up my clang changes

Sent from my iPhone

On Feb 19, 2016, at 10:04 AM, Jordan Rose <jordan_rose@apple.com <mailto:jordan_rose@apple.com>> wrote:

This just looks like it failed to pick up Doug's changes in swift-clang. (But if that's not it, it's Doug's fault.)

Jordan

On Feb 19, 2016, at 9:23, Daniel Dunbar via swift-dev <swift-dev@swift.org <mailto:swift-dev@swift.org>> wrote:

This is failing to build in the Foundation overlay:
--
FAILED: cd /Users/buildnode/jenkins/workspace/oss-swift-incremental-RA-osx/buildbot_incremental/swift-macosx-x86_64/stdlib/public/SDK/Foundation && /Applications/CMake.app/Contents/bin/cmake -E make_directory /Users/buildnode/jenkins/workspace/oss-swift-incremental-RA-osx/buildbot_incremental/swift-macosx-x86_64/stdlib/public/SDK/Foundation/macosx/x86_64 && /Applications/CMake.app/Contents/bin/cmake -E make_directory /Users/buildnode/jenkins/workspace/oss-swift-incremental-RA-osx/buildbot_incremental/swift-macosx-x86_64/./lib/swift/macosx/x86_64 && /Users/buildnode/jenkins/workspace/oss-swift-incremental-RA-osx/buildbot_incremental/llvm-macosx-x86_64/bin/clang -cc1apinotes -yaml-to-binary -o /Users/buildnode/jenkins/workspace/oss-swift-incremental-RA-osx/buildbot_incremental/swift-macosx-x86_64/./lib/swift/macosx/x86_64/Foundation.apinotesc -target x86_64-apple-macosx10.9 /Users/buildnode/jenkins/workspace/oss-swift-incremental-RA-osx/swift/apinotes/Foundation.apinotes && /Users/buildnode/jenkins/workspace/oss-swift-incremental-RA-osx/swift/utils/line-directive /Users/buildnode/jenkins/workspace/oss-swift-incremental-RA-osx/swift/stdlib/public/SDK/Foundation/Foundation.swift /Users/buildnode/jenkins/workspace/oss-swift-incremental-RA-osx/swift/stdlib/public/SDK/Foundation/NSError.swift /Users/buildnode/jenkins/workspace/oss-swift-incremental-RA-osx/swift/stdlib/public/SDK/Foundation/NSStringAPI.swift /Users/buildnode/jenkins/workspace/oss-swift-incremental-RA-osx/swift/stdlib/public/SDK/Foundation/NSValue.swift /Users/buildnode/jenkins/workspace/oss-swift-incremental-RA-osx/swift/stdlib/public/SDK/Foundation/ExtraStringAPIs.swift -- /Users/buildnode/jenkins/workspace/oss-swift-incremental-RA-osx/buildbot_incremental/swift-macosx-x86_64/./bin/swiftc -c -sdk /Applications/Xcode.app/Contents/Developer/Platforms/MacOSX.platform/Developer/SDKs/MacOSX10.11.sdk -target x86_64-apple-macosx10.9 -F /Applications/Xcode.app/Contents/Developer/Platforms/MacOSX.platform/Developer/SDKs/MacOSX10.11.sdk/../../../Developer/Library/Frameworks -O -D INTERNAL_CHECKS_ENABLED -I /Users/buildnode/jenkins/workspace/oss-swift-incremental-RA-osx/buildbot_incremental/swift-macosx-x86_64/./lib/swift/macosx/x86_64 -module-cache-path /Users/buildnode/jenkins/workspace/oss-swift-incremental-RA-osx/buildbot_incremental/swift-macosx-x86_64/./clang-module-cache -no-link-objc-runtime -autolink-force-load -module-link-name swiftFoundation -force-single-frontend-invocation -parse-as-library -emit-module -emit-module-path /Users/buildnode/jenkins/workspace/oss-swift-incremental-RA-osx/buildbot_incremental/swift-macosx-x86_64/./lib/swift/macosx/x86_64/Foundation.swiftmodule -o /Users/buildnode/jenkins/workspace/oss-swift-incremental-RA-osx/buildbot_incremental/swift-macosx-x86_64/stdlib/public/SDK/Foundation/macosx/x86_64/Foundation.o /Users/buildnode/jenkins/workspace/oss-swift-incremental-RA-osx/swift/stdlib/public/SDK/Foundation/Foundation.swift /Users/buildnode/jenkins/workspace/oss-swift-incremental-RA-osx/swift/stdlib/public/SDK/Foundation/NSError.swift /Users/buildnode/jenkins/workspace/oss-swift-incremental-RA-osx/swift/stdlib/public/SDK/Foundation/NSStringAPI.swift /Users/buildnode/jenkins/workspace/oss-swift-incremental-RA-osx/swift/stdlib/public/SDK/Foundation/NSValue.swift /Users/buildnode/jenkins/workspace/oss-swift-incremental-RA-osx/swift/stdlib/public/SDK/Foundation/ExtraStringAPIs.swift
<>/Users/buildnode/jenkins/workspace/oss-swift-incremental-RA-osx/swift/stdlib/public/SDK/Foundation/Foundation.swift:58:1: error: type 'NSObject' does not conform to protocol 'CustomStringConvertible'
extension NSObject : CustomStringConvertible {}
^
Swift.CustomStringConvertible:15:16: note: protocol requires property 'description' with type 'String'
    public var description: String { get }
               ^
ObjectiveC.NSObject:61:23: note: candidate is not a variable
    public class func description() -> String!
                      ^
ObjectiveC.NSObject:122:16: note: candidate has non-matching type 'String!'
    public var description: String! { get }
               ^
/Users/buildnode/jenkins/workspace/oss-swift-incremental-RA-osx/swift/stdlib/public/SDK/Foundation/Foundation.swift:59:1: error: type 'NSObject' does not conform to protocol 'CustomDebugStringConvertible'
extension NSObject : CustomDebugStringConvertible {}
^
Swift.CustomDebugStringConvertible:20:16: note: protocol requires property 'debugDescription' with type 'String'
    public var debugDescription: String { get }
               ^
ObjectiveC.NSObject:62:23: note: candidate is not a variable
    public class func debugDescription() -> String!
                      ^
ObjectiveC.NSObject:124:16: note: candidate has non-matching type 'String!'
    public var debugDescription: String! { get }
--

- Daniel

On Feb 19, 2016, at 9:22 AM, no-reply@swift.org <mailto:no-reply@swift.org> wrote:

[FAILURE] oss-swift-incremental-RA-osx [#2146]

Build URL: https://ci.swift.org/job/oss-swift-incremental-RA-osx/2146/
Project: oss-swift-incremental-RA-osx
Date of build: Fri, 19 Feb 2016 11:19:35 -0600
Build duration: 3 min 14 sec
Identified problems:

Compile Error: This build failed because of a compile error. Below is a list of all errors in the build log:
Indication 1 <https://ci.swift.org//job/oss-swift-incremental-RA-osx/2146/consoleFull#-1706204976ee1a197b-acac-4b17-83cf-a53b95139a76>
Changes

Commit 7ddaafd3182341fe83a2cffcffd7b04949381d58 by daniel_dunbar:
[libllbuild] Remove stray debugging print.

edit: products/libllbuild/BuildSystem-C-API.cpp

_______________________________________________
swift-dev mailing list
swift-dev@swift.org <mailto:swift-dev@swift.org>
https://lists.swift.org/mailman/listinfo/swift-dev

_______________________________________________
swift-dev mailing list
swift-dev@swift.org
https://lists.swift.org/mailman/listinfo/swift-dev