[Swift CI] Build Failure: 0. OSS - Swift Incremental RA - OS X (master) #11124


(David Hart) #1

This is due to my commit "Improve the manifest generation”. I had the same error when smoke testing and it seems to be caused by a stale cache or something in LLBuild. Can something be done to clean the build folders?

David.

···

On 14 Jul 2017, at 22:19, no-reply@swift.org wrote:

[FAILURE] oss-swift-incremental-RA-osx [#11124]

Build URL: https://ci.swift.org/job/oss-swift-incremental-RA-osx/11124/
Project: oss-swift-incremental-RA-osx
Date of build: Fri, 14 Jul 2017 13:01:51 -0700
Build duration: 18 min
Identified problems:

Compile Error: This build failed because of a compile error. Below is a list of all errors in the build log:
Indication 1 <https://ci.swift.org//job/oss-swift-incremental-RA-osx/11124/consoleFull#-1957916200ee1a197b-acac-4b17-83cf-a53b95139a76>
Changes

Commit 386a2bdb0307df2f3cac6fcee23841ebe326ea5d by Arnold Schwaighofer:
[4.0] MergeFunctions: Fix the cmpAttrs function

edit: test/Transforms/MergeFunc/apply_function_attributes.ll
edit: lib/Transforms/Utils/FunctionComparator.cpp

Commit a675e39544699930511a6d3a09751777c528bd17 by David Hart:
Improve the manifest generation

edit: Sources/Build/ToolProtocol.swift
edit: Sources/Build/llbuild.swift
edit: Sources/Build/Command.swift


(Ankit Aggarwal) #2

Mishal, please clean the swiftpm build folder.

···

On Sat, Jul 15, 2017 at 1:58 AM, David Hart via swift-dev < swift-dev@swift.org> wrote:

This is due to my commit *"Improve the manifest generation”*. I had the
same error when smoke testing and it seems to be caused by a stale cache or
something in LLBuild. Can something be done to clean the build folders?

David.

On 14 Jul 2017, at 22:19, no-reply@swift.org wrote:

[FAILURE] oss-swift-incremental-RA-osx [#11124]
Build URL: https://ci.swift.org/job/oss-swift-incremental-RA-osx/11124/
Project: oss-swift-incremental-RA-osx
Date of build: Fri, 14 Jul 2017 13:01:51 -0700
Build duration: 18 minIdentified problems:

   - Compile Error: This build failed because of a compile error. Below
   is a list of all errors in the build log:
      - Indication 1
      <https://ci.swift.org//job/oss-swift-incremental-RA-osx/11124/consoleFull#-1957916200ee1a197b-acac-4b17-83cf-a53b95139a76>

Changes

   - Commit *386a2bdb0307df2f3cac6fcee23841ebe326ea5d* by *Arnold
   Schwaighofer:*

   [4.0] MergeFunctions: Fix the cmpAttrs function
   - *edit*: test/Transforms/MergeFunc/apply_function_attributes.ll
      - *edit*: lib/Transforms/Utils/FunctionComparator.cpp

   - Commit *a675e39544699930511a6d3a09751777c528bd17* by *David Hart:*

   Improve the manifest generation
   - *edit*: Sources/Build/ToolProtocol.swift
      - *edit*: Sources/Build/llbuild.swift
      - *edit*: Sources/Build/Command.swift

_______________________________________________
swift-dev mailing list
swift-dev@swift.org
https://lists.swift.org/mailman/listinfo/swift-dev


(Mishal Shah) #3

Workspace cleaned.

Thanks,
Mishal Shah

···

On Jul 14, 2017, at 1:30 PM, Ankit Aggarwal <ankit_aggarwal@apple.com> wrote:

Mishal, please clean the swiftpm build folder.

On Sat, Jul 15, 2017 at 1:58 AM, David Hart via swift-dev <swift-dev@swift.org <mailto:swift-dev@swift.org>> wrote:
This is due to my commit "Improve the manifest generation”. I had the same error when smoke testing and it seems to be caused by a stale cache or something in LLBuild. Can something be done to clean the build folders?

David.

On 14 Jul 2017, at 22:19, no-reply@swift.org <mailto:no-reply@swift.org> wrote:

[FAILURE] oss-swift-incremental-RA-osx [#11124]

Build URL: https://ci.swift.org/job/oss-swift-incremental-RA-osx/11124/
Project: oss-swift-incremental-RA-osx
Date of build: Fri, 14 Jul 2017 13:01:51 -0700
Build duration: 18 min
Identified problems:

Compile Error: This build failed because of a compile error. Below is a list of all errors in the build log:
Indication 1 <https://ci.swift.org//job/oss-swift-incremental-RA-osx/11124/consoleFull#-1957916200ee1a197b-acac-4b17-83cf-a53b95139a76>
Changes

Commit 386a2bdb0307df2f3cac6fcee23841ebe326ea5d by Arnold Schwaighofer:
[4.0] MergeFunctions: Fix the cmpAttrs function

edit: test/Transforms/MergeFunc/apply_function_attributes.ll
edit: lib/Transforms/Utils/FunctionComparator.cpp

Commit a675e39544699930511a6d3a09751777c528bd17 by David Hart:
Improve the manifest generation

edit: Sources/Build/ToolProtocol.swift
edit: Sources/Build/llbuild.swift
edit: Sources/Build/Command.swift

_______________________________________________
swift-dev mailing list
swift-dev@swift.org <mailto:swift-dev@swift.org>
https://lists.swift.org/mailman/listinfo/swift-dev