[Swift CI] Build Failure: 0. OSS - Swift Incremental RA - OS X (master) #11070

Report

[FAILURE] oss-swift-incremental-RA-osx [#11070]

Build URL:
https://ci.swift.org/job/oss-swift-incremental-RA-osx/11070/
Project:
oss-swift-incremental-RA-osx
Date of build:
Thu, 26 Mar 2020 11:34:55 -0500
Build duration:
1 hr 8 min

Identified problems:

  • Jenkins Error: This build failed because of a Jenkins Error; typically a Java exception.

Changes

  • Commit 95be170e4635f9184e6206afd955eca0996fb414 by pyaskevich:
    [CSApply] Support dynamic member lookup as component of key path dynamic

    • edit: lib/Sema/CSApply.cpp
    • edit: test/attr/attr_dynamic_member_lookup.swift
**12:43:52** FATAL: command execution failed
**12:43:52** java.io.EOFException
**12:43:52** 	at java.io.ObjectInputStream$PeekInputStream.readFully(ObjectInputStream.java:2735)
**12:43:52** 	at java.io.ObjectInputStream$BlockDataInputStream.readShort(ObjectInputStream.java:3210)
**12:43:52** 	at java.io.ObjectInputStream.readStreamHeader(ObjectInputStream.java:895)
**12:43:52** 	at java.io.ObjectInputStream.<init>(ObjectInputStream.java:357)
**12:43:52** 	at hudson.remoting.ObjectInputStreamEx.<init>(ObjectInputStreamEx.java:49)
**12:43:52** 	at hudson.remoting.Command.readFrom(Command.java:140)
**12:43:52** 	at hudson.remoting.Command.readFrom(Command.java:126)
**12:43:52** 	at hudson.remoting.AbstractSynchronousByteArrayCommandTransport.read(AbstractSynchronousByteArrayCommandTransport.java:36)
**12:43:52** 	at hudson.remoting.SynchronousCommandTransport$ReaderThread.run(SynchronousCommandTransport.java:63)
**12:43:52** Caused: java.io.IOException: Unexpected termination of the channel
**12:43:52** 	at hudson.remoting.SynchronousCommandTransport$ReaderThread.run(SynchronousCommandTransport.java:77)
**12:43:52** Caused: java.io.IOException: Backing channel 'macOS-18' is disconnected.
**12:43:52** 	at hudson.remoting.RemoteInvocationHandler.channelOrFail(RemoteInvocationHandler.java:214)
**12:43:52** 	at hudson.remoting.RemoteInvocationHandler.invoke(RemoteInvocationHandler.java:283)
**12:43:52** 	at com.sun.proxy.$Proxy73.isAlive(Unknown Source)
**12:43:52** 	at hudson.Launcher$RemoteLauncher$ProcImpl.isAlive(Launcher.java:1150)
**12:43:52** 	at hudson.Launcher$RemoteLauncher$ProcImpl.join(Launcher.java:1142)
**12:43:52** 	at hudson.tasks.CommandInterpreter.join(CommandInterpreter.java:155)
**12:43:52** 	at hudson.tasks.CommandInterpreter.perform(CommandInterpreter.java:109)
**12:43:52** 	at hudson.tasks.CommandInterpreter.perform(CommandInterpreter.java:66)
**12:43:52** 	at hudson.tasks.BuildStepMonitor$1.perform(BuildStepMonitor.java:20)
**12:43:52** 	at hudson.model.AbstractBuild$AbstractBuildExecution.perform(AbstractBuild.java:741)
**12:43:52** 	at hudson.model.Build$BuildExecution.build(Build.java:206)
**12:43:52** 	at hudson.model.Build$BuildExecution.doRun(Build.java:163)
**12:43:52** 	at hudson.model.AbstractBuild$AbstractBuildExecution.run(AbstractBuild.java:504)
**12:43:52** 	at hudson.model.Run.execute(Run.java:1815)
**12:43:52** 	at hudson.model.FreeStyleBuild.run(FreeStyleBuild.java:43)
**12:43:52** 	at hudson.model.ResourceController.execute(ResourceController.java:97)
**12:43:52** 	at hudson.model.Executor.run(Executor.java:429)
**12:43:52** FATAL: Unable to delete script file /var/folders/_8/79jmzf2142z2xydc_01btlx00000gn/T/jenkins6678669394292081231.sh
Terms of Service

Privacy Policy

Cookie Policy