[Swift CI] Build Failure: 0. OSS - Swift Incremental RA - OS X (master) #10383


(Joe Shajrawi) #1

Dave, this appears to have been caused by your commit:
/Users/buildnode/jenkins/workspace/oss-swift-incremental-RA-osx/swift/benchmark/utils/main.swift:233:69: error: use of unresolved identifier 'run_EqualStringSubstringGenericStringProtocol'

Regards,
—Joe |  | :e-mail: shajrawi@apple.com <mailto:shajrawi@apple.com> | :iphone:(+1) 408-930-5203

···

On May 24, 2017, at 19:36, no-reply@swift.org wrote:

[FAILURE] oss-swift-incremental-RA-osx [#10383]

Build URL: https://ci.swift.org/job/oss-swift-incremental-RA-osx/10383/
Project: oss-swift-incremental-RA-osx
Date of build: Wed, 24 May 2017 19:23:44 -0700
Build duration: 12 min
Identified problems:

Compile Error: This build failed because of a compile error. Below is a list of all errors in the build log:
Indication 1 <https://ci.swift.org//job/oss-swift-incremental-RA-osx/10383/consoleFull#-270639991ee1a197b-acac-4b17-83cf-a53b95139a76>
Changes

Commit 01e0f0aceb5fcc75a707940d8e81fe25bc6aabf7 by Dave Abrahams:
[stdlib] Add Substring comparison benchmarks

edit: benchmark/single-source/Substring.swift

Commit dc184b5e96262645ee9ca33664d36332d445a008 by Dave Abrahams:
[stdlib] Update main.swift for added benchmarks

edit: benchmark/utils/main.swift


(Joe Shajrawi) #2

Reverted https://github.com/apple/swift/pull/9922

Regards,
—Joe |  | :e-mail: shajrawi@apple.com <mailto:shajrawi@apple.com> | :iphone:(+1) 408-930-5203

···

On May 24, 2017, at 20:09, Joe Shajrawi <shajrawi@apple.com> wrote:

Dave, this appears to have been caused by your commit:
/Users/buildnode/jenkins/workspace/oss-swift-incremental-RA-osx/swift/benchmark/utils/main.swift:233:69: error: use of unresolved identifier 'run_EqualStringSubstringGenericStringProtocol'

Regards,
—Joe |  | :e-mail: shajrawi@apple.com <mailto:shajrawi@apple.com> | :iphone:(+1) 408-930-5203

On May 24, 2017, at 19:36, no-reply@swift.org <mailto:no-reply@swift.org> wrote:

[FAILURE] oss-swift-incremental-RA-osx [#10383]

Build URL: https://ci.swift.org/job/oss-swift-incremental-RA-osx/10383/
Project: oss-swift-incremental-RA-osx
Date of build: Wed, 24 May 2017 19:23:44 -0700
Build duration: 12 min
Identified problems:

Compile Error: This build failed because of a compile error. Below is a list of all errors in the build log:
Indication 1 <https://ci.swift.org//job/oss-swift-incremental-RA-osx/10383/consoleFull#-270639991ee1a197b-acac-4b17-83cf-a53b95139a76>
Changes

Commit 01e0f0aceb5fcc75a707940d8e81fe25bc6aabf7 by Dave Abrahams:
[stdlib] Add Substring comparison benchmarks

edit: benchmark/single-source/Substring.swift

Commit dc184b5e96262645ee9ca33664d36332d445a008 by Dave Abrahams:
[stdlib] Update main.swift for added benchmarks

edit: benchmark/utils/main.swift