[Swift CI] Build Failure: 0. OSS - Swift Incremental RA - OS X (master) #10262


(Michael Ilseman) #1

Ankit, any chance this is related?

FAIL: llbuild-unit :: BuildSystem/BuildSystemTests/BuildSystemTaskTests.staleFileRemovalWithManyFiles (113 of 158)
<>******************** TEST 'llbuild-unit :: BuildSystem/BuildSystemTests/BuildSystemTaskTests.staleFileRemovalWithManyFiles' FAILED ********************
Note: Google Test filter = BuildSystemTaskTests.staleFileRemovalWithManyFiles
[==========] Running 1 test from 1 test case.
[----------] Global test environment set-up.
[----------] 1 test from BuildSystemTaskTests
[ RUN ] BuildSystemTaskTests.staleFileRemovalWithManyFiles
/Users/buildnode/jenkins/workspace/oss-swift-incremental-RA-osx/llbuild/unittests/BuildSystem/BuildSystemTaskTests.cpp:732: Failure
Value of: delegate.getMessages()
  Actual: { "commandPreparing(C.1)", "commandStarted(C.1)", "commandFinished(C.1: 0)" }
Expected: std::vector<std::string>({ "commandPreparing(C.1)", "commandStarted(C.1)", "commandFinished(C.1)", })
Which is: { "commandPreparing(C.1)", "commandStarted(C.1)", "commandFinished(C.1)" }
[ FAILED ] BuildSystemTaskTests.staleFileRemovalWithManyFiles (10 ms)
[----------] 1 test from BuildSystemTaskTests (10 ms total)

[----------] Global test environment tear-down
[==========] 1 test from 1 test case ran. (10 ms total)
[ PASSED ] 0 tests.
[ FAILED ] 1 test, listed below:
[ FAILED ] BuildSystemTaskTests.staleFileRemovalWithManyFiles

1 FAILED TEST

···

On May 19, 2017, at 10:42 AM, no-reply@swift.org wrote:

[FAILURE] oss-swift-incremental-RA-osx [#10262]

Build URL: https://ci.swift.org/job/oss-swift-incremental-RA-osx/10262/
Project: oss-swift-incremental-RA-osx
Date of build: Fri, 19 May 2017 10:12:45 -0700
Build duration: 29 min
Identified problems:

Regression test failed: This build failed because a regression test in the test suite FAILed. Below is a list of all errors:
Indication 1 <https://ci.swift.org//job/oss-swift-incremental-RA-osx/10262/consoleFull#-1366378527fca400bf-2f4a-462e-b517-e058d770b2d7>
Tests:

Name: Swift(macosx-x86_64)
Failed: 0 test(s), Passed: 9413 test(s), Total: 9413 test(s)
Name: Swift-Unit
Failed: 0 test(s), Passed: 492 test(s), Total: 492 test(s)

Changes

Commit fc3d9db5dcce5c5b5ceb7538efeb294445235b54 by Ankit Aggarwal:
[BuildSystem] Check command result in MockBuildSystemDelegate

edit: unittests/BuildSystem/BuildSystemTaskTests.cpp
edit: unittests/BuildSystem/MockBuildSystemDelegate.h


(Boris Buegling) #2

It was unfortunate timing between both our changes :slight_smile:

https://github.com/apple/swift-llbuild/pull/175 will fix it, sorry about that.

Thanks,
Boris

···

On 19. May 2017, at 19:45, Michael Ilseman via swift-dev <swift-dev@swift.org> wrote:

Ankit, any chance this is related?

FAIL: llbuild-unit :: BuildSystem/BuildSystemTests/BuildSystemTaskTests.staleFileRemovalWithManyFiles (113 of 158)

******************** TEST 'llbuild-unit :: BuildSystem/BuildSystemTests/BuildSystemTaskTests.staleFileRemovalWithManyFiles' FAILED ********************

Note: Google Test filter = BuildSystemTaskTests.staleFileRemovalWithManyFiles
[==========] Running 1 test from 1 test case.
[----------] Global test environment set-up.
[----------] 1 test from BuildSystemTaskTests
[ RUN ] BuildSystemTaskTests.staleFileRemovalWithManyFiles
/Users/buildnode/jenkins/workspace/oss-swift-incremental-RA-osx/llbuild/unittests/BuildSystem/BuildSystemTaskTests.cpp:732: Failure
Value of: delegate.getMessages()
  Actual: { "commandPreparing(C.1)", "commandStarted(C.1)", "commandFinished(C.1: 0)" }
Expected: std::vector<std::string>({ "commandPreparing(C.1)", "commandStarted(C.1)", "commandFinished(C.1)", })
Which is: { "commandPreparing(C.1)", "commandStarted(C.1)", "commandFinished(C.1)" }
[ FAILED ] BuildSystemTaskTests.staleFileRemovalWithManyFiles (10 ms)
[----------] 1 test from BuildSystemTaskTests (10 ms total)

[----------] Global test environment tear-down
[==========] 1 test from 1 test case ran. (10 ms total)
[ PASSED ] 0 tests.
[ FAILED ] 1 test, listed below:
[ FAILED ] BuildSystemTaskTests.staleFileRemovalWithManyFiles

1 FAILED TEST

On May 19, 2017, at 10:42 AM, no-reply@swift.org wrote:

[FAILURE] oss-swift-incremental-RA-osx [#10262]

Build URL: https://ci.swift.org/job/oss-swift-incremental-RA-osx/10262/
Project: oss-swift-incremental-RA-osx
Date of build: Fri, 19 May 2017 10:12:45 -0700
Build duration: 29 min
Identified problems:

  • Regression test failed: This build failed because a regression test in the test suite FAILed. Below is a list of all errors:
    • Indication 1
Tests:

Name: Swift(macosx-x86_64)
Failed: 0 test(s), Passed: 9413 test(s), Total: 9413 test(s)
Name: Swift-Unit
Failed: 0 test(s), Passed: 492 test(s), Total: 492 test(s)

Changes

  • Commit fc3d9db5dcce5c5b5ceb7538efeb294445235b54 by Ankit Aggarwal:
[BuildSystem] Check command result in MockBuildSystemDelegate

    • edit: unittests/BuildSystem/BuildSystemTaskTests.cpp
    • edit: unittests/BuildSystem/MockBuildSystemDelegate.h

_______________________________________________
swift-dev mailing list
swift-dev@swift.org
https://lists.swift.org/mailman/listinfo/swift-dev


(Ankit Aggarwal) #3

This is probably related to Boris's changes.

···

On 19-May-2017, at 11:15 PM, Michael Ilseman <milseman@apple.com> wrote:

Ankit, any chance this is related?

FAIL: llbuild-unit :: BuildSystem/BuildSystemTests/BuildSystemTaskTests.staleFileRemovalWithManyFiles (113 of 158)
<>******************** TEST 'llbuild-unit :: BuildSystem/BuildSystemTests/BuildSystemTaskTests.staleFileRemovalWithManyFiles' FAILED ********************
Note: Google Test filter = BuildSystemTaskTests.staleFileRemovalWithManyFiles
[==========] Running 1 test from 1 test case.
[----------] Global test environment set-up.
[----------] 1 test from BuildSystemTaskTests
[ RUN ] BuildSystemTaskTests.staleFileRemovalWithManyFiles
/Users/buildnode/jenkins/workspace/oss-swift-incremental-RA-osx/llbuild/unittests/BuildSystem/BuildSystemTaskTests.cpp:732: Failure
Value of: delegate.getMessages()
  Actual: { "commandPreparing(C.1)", "commandStarted(C.1)", "commandFinished(C.1: 0)" }
Expected: std::vector<std::string>({ "commandPreparing(C.1)", "commandStarted(C.1)", "commandFinished(C.1)", })
Which is: { "commandPreparing(C.1)", "commandStarted(C.1)", "commandFinished(C.1)" }
[ FAILED ] BuildSystemTaskTests.staleFileRemovalWithManyFiles (10 ms)
[----------] 1 test from BuildSystemTaskTests (10 ms total)

[----------] Global test environment tear-down
[==========] 1 test from 1 test case ran. (10 ms total)
[ PASSED ] 0 tests.
[ FAILED ] 1 test, listed below:
[ FAILED ] BuildSystemTaskTests.staleFileRemovalWithManyFiles

1 FAILED TEST

On May 19, 2017, at 10:42 AM, no-reply@swift.org <mailto:no-reply@swift.org> wrote:

[FAILURE] oss-swift-incremental-RA-osx [#10262]

Build URL: https://ci.swift.org/job/oss-swift-incremental-RA-osx/10262/
Project: oss-swift-incremental-RA-osx
Date of build: Fri, 19 May 2017 10:12:45 -0700
Build duration: 29 min
Identified problems:

Regression test failed: This build failed because a regression test in the test suite FAILed. Below is a list of all errors:
Indication 1 <https://ci.swift.org//job/oss-swift-incremental-RA-osx/10262/consoleFull#-1366378527fca400bf-2f4a-462e-b517-e058d770b2d7>
Tests:

Name: Swift(macosx-x86_64)
Failed: 0 test(s), Passed: 9413 test(s), Total: 9413 test(s)
Name: Swift-Unit
Failed: 0 test(s), Passed: 492 test(s), Total: 492 test(s)

Changes

Commit fc3d9db5dcce5c5b5ceb7538efeb294445235b54 by Ankit Aggarwal:
[BuildSystem] Check command result in MockBuildSystemDelegate

edit: unittests/BuildSystem/BuildSystemTaskTests.cpp
edit: unittests/BuildSystem/MockBuildSystemDelegate.h