[Swift CI] Build Failure: 0. OSS - LLDB - OS X (master) (Release) #4500

Report

[FAILURE] oss-lldb-osx [#4500]

Build URL:
https://ci.swift.org/job/oss-lldb-osx/4500/
Project:
oss-lldb-osx
Date of build:
Fri, 08 Mar 2019 17:01:27 -0600
Build duration:
38 min

Identified problems:

  • Compile Error: This build failed because of a compile error. Below is a list of all errors in the build log:

Changes

  • Commit a5485d8ae20be69335e57ecfce5cb3577ca13f19 by pyaskevich:
    [CSSimplify] Detect missing optional unwraps in operator/call arguments

    • edit: lib/Sema/CSSimplify.cpp
  • Commit 39dd6306c69132035dca169491f5d54e98141cd0 by pyaskevich:
    [Diagnostics] Refactor missing optional unwrap diagnostic

    • edit: lib/Sema/CSDiagnostics.cpp
    • edit: lib/Sema/CSDiagnostics.h
  • Commit 3940cebebf8df6ceba76f9b4bab2ec2bf15f5015 by pyaskevich:
    [Diagnostics] Don't suggest unwrap with default value if type is not

    • edit: lib/Sema/CSDiagnostics.cpp
    • edit: lib/Sema/CSDiagnostics.h
  • Commit f950360cddb74ff487ac9fa5f0537fe76094db57 by pyaskevich:
    [TypeChecker] NFC: Add a test-case for rdar://problem/47776586

    • edit: test/Constraints/optional.swift
  • Commit 3a95da9a691dcf708c607f4ee71610154b94586e by ross.m.bayer:
    [Build System: CMake] Partially revert PR #22840, manually adding the

    • edit: cmake/modules/StandaloneOverlay.cmake

Looks unrelated to any of these changes:

**17:39:35** [1/962][ 0%][0.026s] Copying compiler-rt's sanitizer/common_interface_defs.h...
**17:39:35** FAILED: /Users/buildnode/jenkins/workspace/oss-lldb-osx/Ninja-ReleaseAssert/llvm-macosx-x86_64/lib/clang/7.0.0/include/sanitizer/common_interface_defs.h **17:39:35** cd /Users/buildnode/jenkins/workspace/oss-lldb-osx/Ninja-ReleaseAssert/llvm-macosx-x86_64/tools/clang/runtime/compiler-rt-bins/include && /Applications/CMake.app/Contents/bin/cmake -E copy_if_different /Users/buildnode/jenkins/workspace/oss-lldb-osx/llvm/projects/compiler-rt/include/sanitizer/common_interface_defs.h /Users/buildnode/jenkins/workspace/oss-lldb-osx/Ninja-ReleaseAssert/llvm-macosx-x86_64/lib/clang/7.0.0/include/sanitizer/common_interface_defs.h
**17:39:35** /bin/sh: line 1: 37773 Killed: 9 /Applications/CMake.app/Contents/bin/cmake -E copy_if_different /Users/buildnode/jenkins/workspace/oss-lldb-osx/llvm/projects/compiler-rt/include/sanitizer/common_interface_defs.h /Users/buildnode/jenkins/workspace/oss-lldb-osx/Ninja-ReleaseAssert/llvm-macosx-x86_64/lib/clang/7.0.0/include/sanitizer/common_interface_defs.h
**17:39:35** [2/962][ 0%][0.026s] Copying compiler-rt's sanitizer/esan_interface.h...
**17:39:35** FAILED: /Users/buildnode/jenkins/workspace/oss-lldb-osx/Ninja-ReleaseAssert/llvm-macosx-x86_64/lib/clang/7.0.0/include/sanitizer/esan_interface.h **17:39:35** cd /Users/buildnode/jenkins/workspace/oss-lldb-osx/Ninja-ReleaseAssert/llvm-macosx-x86_64/tools/clang/runtime/compiler-rt-bins/include && /Applications/CMake.app/Contents/bin/cmake -E copy_if_different /Users/buildnode/jenkins/workspace/oss-lldb-osx/llvm/projects/compiler-rt/include/sanitizer/esan_interface.h /Users/buildnode/jenkins/workspace/oss-lldb-osx/Ninja-ReleaseAssert/llvm-macosx-x86_64/lib/clang/7.0.0/include/sanitizer/esan_interface.h
**17:39:35** /bin/sh: line 1: 37775 Killed: 9 /Applications/CMake.app/Contents/bin/cmake -E copy_if_different /Users/buildnode/jenkins/workspace/oss-lldb-osx/llvm/projects/compiler-rt/include/sanitizer/esan_interface.h /Users/buildnode/jenkins/workspace/oss-lldb-osx/Ninja-ReleaseAssert/llvm-macosx-x86_64/lib/clang/7.0.0/include/sanitizer/esan_interface.h

Terms of Service

Privacy Policy

Cookie Policy