[Swift CI] Build Failure: 0. OSS - LLDB Incremental - Ubuntu 16.04 (master) #1720


(Ben Langmuir) #1

Michael, this was yours. This bot is building like this (no preset):

./swift/utils/build-script --debug-lldb --test --build-ninja -- --skip-test-cmark --skip-test-swift

And is trying to build benchmarks that it can’t find:

ninja: error: unknown target 'swift-benchmark-linux-x86_64'

I can’t fix this at the moment, but I’ll revert when I can if you don’t get to it first.

Ben

···

On Mar 5, 2017, at 3:01 PM, no-reply@swift.org wrote:

[FAILURE] oss-lldb-incremental-linux-ubuntu-16_04 [#1720]

Build URL: https://ci.swift.org/job/oss-lldb-incremental-linux-ubuntu-16_04/1720/
Project: oss-lldb-incremental-linux-ubuntu-16_04
Date of build: Sun, 05 Mar 2017 14:30:53 -0800
Build duration: 30 min
Identified problems:

Compile Error: This build failed because of a compile error. Below is a list of all errors in the build log:
Indication 1 <https://ci.swift.org//job/oss-lldb-incremental-linux-ubuntu-16_04/1720/consoleFull#416961937ee1a197b-acac-4b17-83cf-a53b95139a76>
Changes

Commit 33767380f9a211c6b259d967b42c9ff658d93aab by mgottesman:
[build-script-impl] Add support for building benchmarks on linux but

edit: utils/build-script-impl
edit: utils/build-presets.ini

Commit 5dbc58c8a46a23b1764813510727ac335cead9ea by mgottesman:
[build-script] Add preset for building swift and the benchmarks and

edit: utils/build-presets.ini

Commit a1cf6d34cd94db366178c2c7419a7df460fe6339 by mgottesman:
[swift_build_support] Add support for building benchmarks on

edit: utils/swift_build_support/swift_build_support/targets.py


(Ben Langmuir) #2

Revert PR is https://github.com/apple/swift/pull/7931

···

On Mar 6, 2017, at 7:21 AM, Ben Langmuir <blangmuir@apple.com> wrote:

Michael, this was yours. This bot is building like this (no preset):

./swift/utils/build-script --debug-lldb --test --build-ninja -- --skip-test-cmark --skip-test-swift

And is trying to build benchmarks that it can’t find:

ninja: error: unknown target 'swift-benchmark-linux-x86_64'

I can’t fix this at the moment, but I’ll revert when I can if you don’t get to it first.

Ben

On Mar 5, 2017, at 3:01 PM, no-reply@swift.org <mailto:no-reply@swift.org> wrote:

[FAILURE] oss-lldb-incremental-linux-ubuntu-16_04 [#1720]

Build URL: https://ci.swift.org/job/oss-lldb-incremental-linux-ubuntu-16_04/1720/
Project: oss-lldb-incremental-linux-ubuntu-16_04
Date of build: Sun, 05 Mar 2017 14:30:53 -0800
Build duration: 30 min
Identified problems:

Compile Error: This build failed because of a compile error. Below is a list of all errors in the build log:
Indication 1 <https://ci.swift.org//job/oss-lldb-incremental-linux-ubuntu-16_04/1720/consoleFull#416961937ee1a197b-acac-4b17-83cf-a53b95139a76>
Changes

Commit 33767380f9a211c6b259d967b42c9ff658d93aab by mgottesman:
[build-script-impl] Add support for building benchmarks on linux but

edit: utils/build-script-impl
edit: utils/build-presets.ini

Commit 5dbc58c8a46a23b1764813510727ac335cead9ea by mgottesman:
[build-script] Add preset for building swift and the benchmarks and

edit: utils/build-presets.ini

Commit a1cf6d34cd94db366178c2c7419a7df460fe6339 by mgottesman:
[swift_build_support] Add support for building benchmarks on

edit: utils/swift_build_support/swift_build_support/targets.py