[Swift CI] Build Failure: 0. OSS - LLDB Incremental - Ubuntu 15.10 (master) #6231


(Enrico Granata) #1

I am wondering if my LLDB change went in before the corresponding Swift change.. I'll keep an eye out...

···

On Sep 28, 2016, at 1:52 PM, no-reply@swift.org wrote:

[FAILURE] oss-lldb-incremental-linux-ubuntu-15_10 [#6231]

Build URL: https://ci.swift.org/job/oss-lldb-incremental-linux-ubuntu-15_10/6231/
Project: oss-lldb-incremental-linux-ubuntu-15_10
Date of build: Wed, 28 Sep 2016 13:37:19 -0700
Build duration: 14 min
Identified problems:

Regression test failed: This build failed because a regression test in the test suite FAILed. Below is a list of all errors:
Indication 1 <https://ci.swift.org//job/oss-lldb-incremental-linux-ubuntu-15_10/6231/consoleFull#1565365029fca400bf-2f4a-462e-b517-e058d770b2d7>
Tests:

Name: Test-rdar-12481949
Failed: 0 test(s), Passed: 3 test(s), Total: 3 test(s)
Name: Test-rdar-9974002
Failed: 0 test(s), Passed: 3 test(s), Total: 3 test(s)
Name: Test11588
Failed: 0 test(s), Passed: 3 test(s), Total: 3 test(s)
Name: Test8638051
Failed: 0 test(s), Passed: 3 test(s), Total: 3 test(s)
Name: TestAbbreviations
Failed: 0 test(s), Passed: 1 test(s), Total: 1 test(s)
Name: TestAddressBreakpoints
Failed: 0 test(s), Passed: 3 test(s), Total: 3 test(s)
Name: TestAnonymous
Failed: 0 test(s), Passed: 21 test(s), Total: 21 test(s)
Name: TestApropos
Failed: 0 test(s), Passed: 1 test(s), Total: 1 test(s)
Name: TestAproposWithProcess
Failed: 0 test(s), Passed: 3 test(s), Total: 3 test(s)
Name: TestArrayTypes
Failed: 0 test(s), Passed: 6 test(s), Total: 6 test(s)
Name: TestAsanSwift
Failed: 0 test(s), Passed: 0 test(s), Total: 3 test(s)
Name: TestAttachDenied
Failed: 0 test(s), Passed: 3 test(s), Total: 3 test(s)
Name: TestAttachResume
Failed: 0 test(s), Passed: 3 test(s), Total: 3 test(s)
Name: TestAvoidBreakpointInDelaySlot
Failed: 0 test(s), Passed: 0 test(s), Total: 3 test(s)
Name: TestBSDArchives
Failed: 0 test(s), Passed: 3 test(s), Total: 3 test(s)
Name: TestBackticksWithoutATarget
Failed: 0 test(s), Passed: 1 test(s), Total: 1 test(s)
Name: TestBacktraceAll
Failed: 0 test(s), Passed: 3 test(s), Total: 3 test(s)
Name: TestBadAddressBreakpoints
Failed: 0 test(s), Passed: 3 test(s), Total: 3 test(s)
Name: TestBatchMode
Failed: 0 test(s), Passed: 9 test(s), Total: 9 test(s)
Name: TestBitfields
Failed: 0 test(s), Passed: 6 test(s), Total: 6 test(s)
Name: TestBreakAfterJoin
Failed: 0 test(s), Passed: 3 test(s), Total: 3 test(s)
Name: TestBreakpointAPI
Failed: 0 test(s), Passed: 3 test(s), Total: 3 test(s)
Name: TestBreakpointCaseSensitivity
Failed: 0 test(s), Passed: 3 test(s), Total: 6 test(s)
Name: TestBreakpointCommand
Failed: 0 test(s), Passed: 3 test(s), Total: 3 test(s)
Name: TestBreakpointCommandsFromPython
Failed: 0 test(s), Passed: 3 test(s), Total: 3 test(s)
Name: TestBreakpointConditions
Failed: 0 test(s), Passed: 12 test(s), Total: 12 test(s)
Name: TestBreakpointIDs
Failed: 0 test(s), Passed: 3 test(s), Total: 3 test(s)
Name: TestBreakpointIgnoreCount
Failed: 0 test(s), Passed: 6 test(s), Total: 6 test(s)
Name: TestBreakpointLanguage
Failed: 0 test(s), Passed: 6 test(s), Total: 6 test(s)
Name: TestBreakpointLocations
Failed: 0 test(s), Passed: 3 test(s), Total: 3 test(s)
Name: TestBreakpointOptions
Failed: 0 test(s), Passed: 3 test(s), Total: 3 test(s)
Name: TestBreakpointSetRestart
Failed: 0 test(s), Passed: 3 test(s), Total: 3 test(s)
Name: TestBreakpointsWithNoTargets
Failed: 0 test(s), Passed: 3 test(s), Total: 3 test(s)
Name: TestBuiltinTrap
Failed: 0 test(s), Passed: 3 test(s), Total: 3 test(s)
Name: TestBulkyEnumsVariables
Failed: 0 test(s), Passed: 3 test(s), Total: 3 test(s)
Name: TestCInlines
Failed: 0 test(s), Passed: 3 test(s), Total: 3 test(s)
Name: TestCModules
Failed: 0 test(s), Passed: 3 test(s), Total: 3 test(s)
Name: TestCPP11EnumTypes
Failed: 0 test(s), Passed: 24 test(s), Total: 24 test(s)
Name: TestCPPAuto
Failed: 0 test(s), Passed: 3 test(s), Total: 3 test(s)
Name: TestCPPBool
Failed: 0 test(s), Passed: 3 test(s), Total: 3 test(s)
Name: TestCPPBreakpointCommands
Failed: 0 test(s), Passed: 3 test(s), Total: 3 test(s)
Name: TestCPPBreakpointLocations
Failed: 0 test(s), Passed: 6 test(s), Total: 6 test(s)
Name: TestCPPExceptionBreakpoint
Failed: 0 test(s), Passed: 3 test(s), Total: 3 test(s)
Name: TestCPPExceptionBreakpoints
Failed: 0 test(s), Passed: 3 test(s), Total: 3 test(s)
Name: TestCPPStaticMembers
Failed: 0 test(s), Passed: 3 test(s), Total: 3 test(s)
Name: TestCPPStaticMethods
Failed: 0 test(s), Passed: 3 test(s), Total: 3 test(s)
Name: TestCPPThis
Failed: 0 test(s), Passed: 3 test(s), Total: 3 test(s)
Name: TestCStrings
Failed: 0 test(s), Passed: 3 test(s), Total: 3 test(s)
Name: TestCallCPPFunction
Failed: 0 test(s), Passed: 3 test(s), Total: 3 test(s)
Name: TestCallStdStringFunction
Failed: 0 test(s), Passed: 3 test(s), Total: 3 test(s)
Name: TestCallStopAndContinue
Failed: 0 test(s), Passed: 3 test(s), Total: 3 test(s)
Name: TestCallThatRestarts
Failed: 0 test(s), Passed: 3 test(s), Total: 3 test(s)
Name: TestCallUserAnonTypedef
Failed: 0 test(s), Passed: 3 test(s), Total: 3 test(s)
Name: TestCallUserDefinedFunction
Failed: 0 test(s), Passed: 3 test(s), Total: 3 test(s)
Name: TestCallWithTimeout
Failed: 0 test(s), Passed: 3 test(s), Total: 3 test(s)
Name: TestChangeProcessGroup
Failed: 0 test(s), Passed: 3 test(s), Total: 3 test(s)
Name: TestChangeValueAPI
Failed: 0 test(s), Passed: 3 test(s), Total: 3 test(s)
Name: TestChar1632T
Failed: 0 test(s), Passed: 3 test(s), Total: 3 test(s)
Name: TestClassTypes
Failed: 0 test(s), Passed: 12 test(s), Total: 12 test(s)
Name: TestClassTypesDisassembly
Failed: 0 test(s), Passed: 6 test(s), Total: 6 test(s)
Name: TestCommandHistory
Failed: 0 test(s), Passed: 1 test(s), Total: 1 test(s)
Name: TestCommandInterpreterAPI
Failed: 0 test(s), Passed: 3 test(s), Total: 3 test(s)
Name: TestCommandRegex
Failed: 0 test(s), Passed: 1 test(s), Total: 1 test(s)
Name: TestCommandScript
Failed: 0 test(s), Passed: 3 test(s), Total: 3 test(s)
Name: TestCommandScriptAlias
Failed: 0 test(s), Passed: 3 test(s), Total: 3 test(s)
Name: TestCommandScriptImmediateOutput
Failed: 0 test(s), Passed: 2 test(s), Total: 2 test(s)
Name: TestCommandSource
Failed: 0 test(s), Passed: 1 test(s), Total: 1 test(s)
Name: TestCommonShortSpellings
Failed: 0 test(s), Passed: 1 test(s), Total: 1 test(s)
Name: TestCompDirSymLink
Failed: 0 test(s), Passed: 9 test(s), Total: 9 test(s)
Name: TestCompletion
Failed: 0 test(s), Passed: 34 test(s), Total: 34 test(s)
Name: TestConcurrentBreakpointDelayBreakpointOneSignal
Failed: 0 test(s), Passed: 1 test(s), Total: 1 test(s)
Name: TestConcurrentBreakpointOneDelayBreakpointThreads
Failed: 0 test(s), Passed: 1 test(s), Total: 1 test(s)
Name: TestConcurrentBreakpointsDelayedBreakpointOneWatchpoint
Failed: 0 test(s), Passed: 1 test(s), Total: 1 test(s)
Name: TestConcurrentCrashWithBreak
Failed: 0 test(s), Passed: 1 test(s), Total: 1 test(s)
Name: TestConcurrentCrashWithSignal
Failed: 0 test(s), Passed: 1 test(s), Total: 1 test(s)
Name: TestConcurrentCrashWithWatchpoint
Failed: 0 test(s), Passed: 1 test(s), Total: 1 test(s)
Name: TestConcurrentCrashWithWatchpointBreakpointSignal
Failed: 0 test(s), Passed: 1 test(s), Total: 1 test(s)
Name: TestConcurrentDelaySignalBreak
Failed: 0 test(s), Passed: 1 test(s), Total: 1 test(s)
Name: TestConcurrentDelaySignalWatch
Failed: 0 test(s), Passed: 1 test(s), Total: 1 test(s)
Name: TestConcurrentDelayWatchBreak
Failed: 0 test(s), Passed: 1 test(s), Total: 1 test(s)
Name: TestConcurrentDelayedCrashWithBreakpointSignal
Failed: 0 test(s), Passed: 1 test(s), Total: 1 test(s)
Name: TestConcurrentDelayedCrashWithBreakpointWatchpoint
Failed: 0 test(s), Passed: 1 test(s), Total: 1 test(s)
Name: TestConcurrentNWatchNBreak
Failed: 0 test(s), Passed: 1 test(s), Total: 1 test(s)
Name: TestConcurrentSignalBreak
Failed: 0 test(s), Passed: 1 test(s), Total: 1 test(s)
Name: TestConcurrentSignalDelayBreak
Failed: 0 test(s), Passed: 1 test(s), Total: 1 test(s)
Name: TestConcurrentSignalDelayWatch
Failed: 0 test(s), Passed: 1 test(s), Total: 1 test(s)
Name: TestConcurrentSignalNWatchNBreak
Failed: 0 test(s), Passed: 1 test(s), Total: 1 test(s)
Name: TestConcurrentSignalWatch
Failed: 0 test(s), Passed: 1 test(s), Total: 1 test(s)
Name: TestConcurrentSignalWatchBreak
Failed: 0 test(s), Passed: 1 test(s), Total: 1 test(s)
Name: TestConcurrentTwoBreakpointThreads
Failed: 0 test(s), Passed: 1 test(s), Total: 1 test(s)
Name: TestConcurrentTwoBreakpointsOneDelaySignal
Failed: 0 test(s), Passed: 1 test(s), Total: 1 test(s)
Name: TestConcurrentTwoBreakpointsOneSignal
Failed: 0 test(s), Passed: 1 test(s), Total: 1 test(s)
Name: TestConcurrentTwoBreakpointsOneWatchpoint
Failed: 0 test(s), Passed: 1 test(s), Total: 1 test(s)
Name: TestConcurrentTwoWatchpointThreads
Failed: 0 test(s), Passed: 1 test(s), Total: 1 test(s)
Name: TestConcurrentTwoWatchpointsOneBreakpoint
Failed: 0 test(s), Passed: 1 test(s), Total: 1 test(s)
Name: TestConcurrentTwoWatchpointsOneDelayBreakpoint
Failed: 0 test(s), Passed: 1 test(s), Total: 1 test(s)
Name: TestConcurrentTwoWatchpointsOneSignal
Failed: 0 test(s), Passed: 1 test(s), Total: 1 test(s)
Name: TestConcurrentWatchBreak
Failed: 0 test(s), Passed: 1 test(s), Total: 1 test(s)
Name: TestConcurrentWatchBreakDelay
Failed: 0 test(s), Passed: 1 test(s), Total: 1 test(s)
Name: TestConcurrentWatchpointDelayWatchpointOneBreakpoint
Failed: 0 test(s), Passed: 1 test(s), Total: 1 test(s)
Name: TestConcurrentWatchpointWithDelayWatchpointThreads
Failed: 0 test(s), Passed: 1 test(s), Total: 1 test(s)
Name: TestConditionalBreak
Failed: 0 test(s), Passed: 6 test(s), Total: 6 test(s)
Name: TestConsecutiveBreakpoints
Failed: 0 test(s), Passed: 3 test(s), Total: 3 test(s)
Name: TestConstVariables
Failed: 0 test(s), Passed: 3 test(s), Total: 3 test(s)
Name: TestConvenienceVariables
Failed: 0 test(s), Passed: 3 test(s), Total: 3 test(s)
Name: TestCppChainedCalls
Failed: 0 test(s), Passed: 3 test(s), Total: 3 test(s)
Name: TestCppGlobalOperators
Failed: 0 test(s), Passed: 6 test(s), Total: 6 test(s)
Name: TestCppIncompleteTypes
Failed: 0 test(s), Passed: 6 test(s), Total: 6 test(s)
Name: TestCppNsImport
Failed: 0 test(s), Passed: 3 test(s), Total: 3 test(s)
Name: TestCppScope
Failed: 0 test(s), Passed: 3 test(s), Total: 3 test(s)
Name: TestCppValueCast
Failed: 0 test(s), Passed: 6 test(s), Total: 6 test(s)
Name: TestCrashDuringStep
Failed: 0 test(s), Passed: 3 test(s), Total: 3 test(s)
Name: TestCreateAfterAttach
Failed: 0 test(s), Passed: 6 test(s), Total: 6 test(s)
Name: TestCreateDuringInstructionStep
Failed: 0 test(s), Passed: 3 test(s), Total: 3 test(s)
Name: TestCreateDuringStep
Failed: 0 test(s), Passed: 9 test(s), Total: 9 test(s)
Name: TestCxxWCharT
Failed: 0 test(s), Passed: 3 test(s), Total: 3 test(s)
Name: TestDataFormatterAdv
Failed: 0 test(s), Passed: 3 test(s), Total: 3 test(s)
Name: TestDataFormatterCategories
Failed: 0 test(s), Passed: 3 test(s), Total: 3 test(s)
Name: TestDataFormatterCpp
Failed: 0 test(s), Passed: 3 test(s), Total: 3 test(s)
Name: TestDataFormatterDisabling
Failed: 0 test(s), Passed: 3 test(s), Total: 3 test(s)
Name: TestDataFormatterEnumFormat
Failed: 0 test(s), Passed: 3 test(s), Total: 3 test(s)
Name: TestDataFormatterGlobals
Failed: 0 test(s), Passed: 3 test(s), Total: 3 test(s)
Name: TestDataFormatterHexCaps
Failed: 0 test(s), Passed: 3 test(s), Total: 3 test(s)
Name: TestDataFormatterLanguageCategoryUpdates
Failed: 0 test(s), Passed: 3 test(s), Total: 3 test(s)
Name: TestDataFormatterLibccIterator
Failed: 0 test(s), Passed: 0 test(s), Total: 3 test(s)
Name: TestDataFormatterLibccMap
Failed: 0 test(s), Passed: 0 test(s), Total: 3 test(s)
Name: TestDataFormatterLibccMultiMap
Failed: 0 test(s), Passed: 0 test(s), Total: 3 test(s)
Name: TestDataFormatterLibcxxList
Failed: 0 test(s), Passed: 0 test(s), Total: 3 test(s)
Name: TestDataFormatterLibcxxListLoop
Failed: 0 test(s), Passed: 0 test(s), Total: 3 test(s)
Name: TestDataFormatterLibcxxMultiSet
Failed: 0 test(s), Passed: 0 test(s), Total: 3 test(s)
Name: TestDataFormatterLibcxxSet
Failed: 0 test(s), Passed: 3 test(s), Total: 3 test(s)
Name: TestDataFormatterLibcxxString
Failed: 0 test(s), Passed: 0 test(s), Total: 3 test(s)
Name: TestDataFormatterLibcxxVBool
Failed: 0 test(s), Passed: 0 test(s), Total: 3 test(s)
Name: TestDataFormatterLibcxxVector
Failed: 0 test(s), Passed: 0 test(s), Total: 3 test(s)
Name: TestDataFormatterNamedSummaries
Failed: 0 test(s), Passed: 3 test(s), Total: 3 test(s)
Name: TestDataFormatterPythonSynth
Failed: 0 test(s), Passed: 6 test(s), Total: 6 test(s)
Name: TestDataFormatterRefPtrRecursion
Failed: 0 test(s), Passed: 3 test(s), Total: 3 test(s)
Name: TestDataFormatterScript
Failed: 0 test(s), Passed: 3 test(s), Total: 3 test(s)
Name: TestDataFormatterSkipSummary
Failed: 0 test(s), Passed: 3 test(s), Total: 3 test(s)
Name: TestDataFormatterSmartArray
Failed: 0 test(s), Passed: 3 test(s), Total: 3 test(s)
Name: TestDataFormatterStdIterator
Failed: 0 test(s), Passed: 3 test(s), Total: 3 test(s)
Name: TestDataFormatterStdList
Failed: 0 test(s), Passed: 3 test(s), Total: 3 test(s)
Name: TestDataFormatterStdMap
Failed: 0 test(s), Passed: 3 test(s), Total: 3 test(s)
Name: TestDataFormatterStdSmartPtr
Failed: 0 test(s), Passed: 3 test(s), Total: 3 test(s)
Name: TestDataFormatterStdString
Failed: 0 test(s), Passed: 3 test(s), Total: 3 test(s)
Name: TestDataFormatterStdVBool
Failed: 0 test(s), Passed: 3 test(s), Total: 3 test(s)
Name: TestDataFormatterStdVector
Failed: 0 test(s), Passed: 3 test(s), Total: 3 test(s)
Name: TestDataFormatterSynth
Failed: 0 test(s), Passed: 3 test(s), Total: 3 test(s)
Name: TestDataFormatterSynthType
Failed: 0 test(s), Passed: 3 test(s), Total: 3 test(s)
Name: TestDataFormatterSynthVal
Failed: 0 test(s), Passed: 3 test(s), Total: 3 test(s)
Name: TestDataFormatterUnordered
Failed: 0 test(s), Passed: 0 test(s), Total: 3 test(s)
Name: TestDataFormatterVarScriptFormatting
Failed: 0 test(s), Passed: 3 test(s), Total: 3 test(s)
Name: TestDeadStrip
Failed: 0 test(s), Passed: 3 test(s), Total: 3 test(s)
Name: TestDebugBreak
Failed: 0 test(s), Passed: 1 test(s), Total: 1 test(s)
Name: TestDebuggerAPI
Failed: 0 test(s), Passed: 4 test(s), Total: 4 test(s)
Name: TestDefaultCacheLineSize
Failed: 0 test(s), Passed: 0 test(s), Total: 3 test(s)
Name: TestDefaultConstructorForAPIObjects
Failed: 0 test(s), Passed: 35 test(s), Total: 35 test(s)
Name: TestDefiningOverloadedFunctions
Failed: 0 test(s), Passed: 3 test(s), Total: 3 test(s)
Name: TestDiamond
Failed: 0 test(s), Passed: 3 test(s), Total: 3 test(s)
Name: TestDisasmAPI
Failed: 0 test(s), Passed: 3 test(s), Total: 3 test(s)
Name: TestDisassembleBreakpoint
Failed: 0 test(s), Passed: 3 test(s), Total: 3 test(s)
Name: TestDisassembleRawData
Failed: 0 test(s), Passed: 1 test(s), Total: 1 test(s)
Name: TestDisassemble_VST1_64
Failed: 0 test(s), Passed: 0 test(s), Total: 1 test(s)
Name: TestDynamicValue
Failed: 0 test(s), Passed: 3 test(s), Total: 3 test(s)
Name: TestDynamicValueChildCount
Failed: 0 test(s), Passed: 3 test(s), Total: 3 test(s)
Name: TestEhFrameUnwind
Failed: 0 test(s), Passed: 3 test(s), Total: 3 test(s)
Name: TestEmulations
Failed: 0 test(s), Passed: 2 test(s), Total: 2 test(s)
Name: TestEnumTypes
Failed: 0 test(s), Passed: 3 test(s), Total: 3 test(s)
Name: TestEnumVariables
Failed: 0 test(s), Passed: 3 test(s), Total: 3 test(s)
Name: TestEqualityOperators
Failed: 0 test(s), Passed: 9 test(s), Total: 9 test(s)
Name: TestEvents
Failed: 0 test(s), Passed: 0 test(s), Total: 9 test(s)
Name: TestExitDuringBreak
Failed: 0 test(s), Passed: 3 test(s), Total: 3 test(s)
Name: TestExitDuringStep
Failed: 0 test(s), Passed: 9 test(s), Total: 9 test(s)
Name: TestExprDoesntBlock
Failed: 0 test(s), Passed: 3 test(s), Total: 3 test(s)
Name: TestExprHelpExamples
Failed: 0 test(s), Passed: 3 test(s), Total: 3 test(s)
Name: TestExprInProtocolExtension
Failed: 0 test(s), Passed: 3 test(s), Total: 3 test(s)
Name: TestExprOptions
Failed: 0 test(s), Passed: 3 test(s), Total: 3 test(s)
Name: TestExpressionAccessControl
Failed: 0 test(s), Passed: 3 test(s), Total: 3 test(s)
Name: TestExpressionErrorBreakpoint
Failed: 0 test(s), Passed: 12 test(s), Total: 12 test(s)
Name: TestExpressionErrors
Failed: 0 test(s), Passed: 3 test(s), Total: 3 test(s)
Name: TestExpressionInSyscall
Failed: 0 test(s), Passed: 3 test(s), Total: 3 test(s)
Name: TestExpressionScopes
Failed: 0 test(s), Passed: 3 test(s), Total: 3 test(s)
Name: TestExprs
Failed: 0 test(s), Passed: 12 test(s), Total: 12 test(s)
Name: TestExprs2
Failed: 0 test(s), Passed: 3 test(s), Total: 3 test(s)
Name: TestExprsChar
Failed: 0 test(s), Passed: 9 test(s), Total: 9 test(s)
Name: TestFdLeak
Failed: 0 test(s), Passed: 3 test(s), Total: 3 test(s)
Name: TestFilePrivate
Failed: 0 test(s), Passed: 3 test(s), Total: 3 test(s)
Name: TestFloatTypes
Failed: 0 test(s), Passed: 6 test(s), Total: 6 test(s)
Name: TestFloatTypesExpr
Failed: 0 test(s), Passed: 6 test(s), Total: 6 test(s)
Name: TestFormatPropagation
Failed: 0 test(s), Passed: 3 test(s), Total: 3 test(s)
Name: TestFormats
Failed: 0 test(s), Passed: 3 test(s), Total: 3 test(s)
Name: TestFormatters
Failed: 0 test(s), Passed: 3 test(s), Total: 3 test(s)
Name: TestFormattersSBAPI
Failed: 0 test(s), Passed: 6 test(s), Total: 6 test(s)
Name: TestForwardDeclaration
Failed: 0 test(s), Passed: 3 test(s), Total: 3 test(s)
Name: TestFrameFormatSmallStruct
Failed: 0 test(s), Passed: 3 test(s), Total: 3 test(s)
Name: TestFrameUtils
Failed: 0 test(s), Passed: 3 test(s), Total: 3 test(s)
Name: TestFrameVariableAnonymousUnions
Failed: 0 test(s), Passed: 3 test(s), Total: 3 test(s)
Name: TestFrames
Failed: 0 test(s), Passed: 9 test(s), Total: 9 test(s)
Name: TestFunctionTypes
Failed: 0 test(s), Passed: 6 test(s), Total: 6 test(s)
Name: TestFunctionVariables
Failed: 0 test(s), Passed: 3 test(s), Total: 3 test(s)
Name: TestGdbRemoteAbort
Failed: 0 test(s), Passed: 1 test(s), Total: 1 test(s)
Name: TestGdbRemoteAttach
Failed: 0 test(s), Passed: 1 test(s), Total: 1 test(s)
Name: TestGdbRemoteAuxvSupport
Failed: 0 test(s), Passed: 4 test(s), Total: 4 test(s)
Name: TestGdbRemoteExitCode
Failed: 0 test(s), Passed: 3 test(s), Total: 3 test(s)
Name: TestGdbRemoteExpeditedRegisters
Failed: 0 test(s), Passed: 5 test(s), Total: 5 test(s)
Name: TestGdbRemoteHostInfo
Failed: 0 test(s), Passed: 1 test(s), Total: 1 test(s)
Name: TestGdbRemoteKill
Failed: 0 test(s), Passed: 1 test(s), Total: 1 test(s)
Name: TestGdbRemoteModuleInfo
Failed: 0 test(s), Passed: 1 test(s), Total: 1 test(s)
Name: TestGdbRemoteProcessInfo
Failed: 0 test(s), Passed: 5 test(s), Total: 5 test(s)
Name: TestGdbRemoteRegisterState
Failed: 0 test(s), Passed: 2 test(s), Total: 2 test(s)
Name: TestGdbRemoteSegFault
Failed: 0 test(s), Passed: 1 test(s), Total: 1 test(s)
Name: TestGdbRemoteSingleStep
Failed: 0 test(s), Passed: 1 test(s), Total: 1 test(s)
Name: TestGdbRemoteThreadsInStopReply
Failed: 0 test(s), Passed: 4 test(s), Total: 4 test(s)
Name: TestGdbRemote_qThreadStopInfo
Failed: 0 test(s), Passed: 3 test(s), Total: 4 test(s)
Name: TestGdbRemote_vCont
Failed: 0 test(s), Passed: 6 test(s), Total: 6 test(s)
Name: TestGlobalVariables
Failed: 0 test(s), Passed: 3 test(s), Total: 3 test(s)
Name: TestGoFormatters
Failed: 0 test(s), Passed: 0 test(s), Total: 1 test(s)
Name: TestGoroutines
Failed: 0 test(s), Passed: 0 test(s), Total: 1 test(s)
Name: TestHandleSegv
Failed: 0 test(s), Passed: 3 test(s), Total: 3 test(s)
Name: TestHelloWorld
Failed: 0 test(s), Passed: 9 test(s), Total: 9 test(s)
Name: TestHelp
Failed: 0 test(s), Passed: 18 test(s), Total: 18 test(s)
Name: TestIRInterpreter
Failed: 0 test(s), Passed: 3 test(s), Total: 3 test(s)
Name: TestIRInterpreterPHINodes
Failed: 0 test(s), Passed: 3 test(s), Total: 3 test(s)
Name: TestImageListMultiArchitecture
Failed: 0 test(s), Passed: 1 test(s), Total: 1 test(s)
Name: TestImport
Failed: 0 test(s), Passed: 1 test(s), Total: 1 test(s)
Name: TestInOutVariables
Failed: 0 test(s), Passed: 3 test(s), Total: 3 test(s)
Name: TestIndexVariable
Failed: 0 test(s), Passed: 3 test(s), Total: 3 test(s)
Name: TestIndirectEnumVariables
Failed: 0 test(s), Passed: 0 test(s), Total: 3 test(s)
Name: TestInferiorAssert
Failed: 0 test(s), Passed: 18 test(s), Total: 18 test(s)
Name: TestInferiorChanged
Failed: 0 test(s), Passed: 1 test(s), Total: 1 test(s)
Name: TestInferiorCrashing
Failed: 0 test(s), Passed: 18 test(s), Total: 21 test(s)
Name: TestInitializerList
Failed: 0 test(s), Passed: 3 test(s), Total: 3 test(s)
Name: TestInlineStepping
Failed: 0 test(s), Passed: 0 test(s), Total: 9 test(s)
Name: TestInlinedBreakpoints
Failed: 0 test(s), Passed: 3 test(s), Total: 3 test(s)
Name: TestInlinedFrame
Failed: 0 test(s), Passed: 3 test(s), Total: 3 test(s)
Name: TestInlines
Failed: 0 test(s), Passed: 3 test(s), Total: 3 test(s)
Name: TestIntegerTypes
Failed: 0 test(s), Passed: 30 test(s), Total: 30 test(s)
Name: TestIntegerTypesExpr
Failed: 0 test(s), Passed: 30 test(s), Total: 30 test(s)
Name: TestJITLoaderGDB
Failed: 0 test(s), Passed: 0 test(s), Total: 3 test(s)
Name: TestLLDBIterator
Failed: 0 test(s), Passed: 9 test(s), Total: 9 test(s)
Name: TestLLVM
Failed: 0 test(s), Passed: 1 test(s), Total: 1 test(s)
Name: TestLaunchWithShellExpand
Failed: 0 test(s), Passed: 3 test(s), Total: 3 test(s)
Name: TestLazyReverse
Failed: 0 test(s), Passed: 1 test(s), Total: 1 test(s)
Name: TestLibCxxAtomic
Failed: 0 test(s), Passed: 0 test(s), Total: 3 test(s)
Name: TestLibCxxFunction
Failed: 0 test(s), Passed: 0 test(s), Total: 3 test(s)
Name: TestLinuxCore
Failed: 0 test(s), Passed: 4 test(s), Total: 5 test(s)
Name: TestListener
Failed: 0 test(s), Passed: 3 test(s), Total: 3 test(s)
Name: TestLldbGdbServer
Failed: 0 test(s), Passed: 33 test(s), Total: 33 test(s)
Name: TestLoadUnload
Failed: 0 test(s), Passed: 18 test(s), Total: 18 test(s)
Name: TestLogging
Failed: 0 test(s), Passed: 5 test(s), Total: 5 test(s)
Name: TestLongjmp
Failed: 0 test(s), Passed: 9 test(s), Total: 9 test(s)
Name: TestMPXRegisters
Failed: 0 test(s), Passed: 0 test(s), Total: 3 test(s)
Name: TestMacros
Failed: 0 test(s), Passed: 3 test(s), Total: 3 test(s)
Name: TestMembersAndLocalsWithSameName
Failed: 0 test(s), Passed: 6 test(s), Total: 6 test(s)
Name: TestMemoryCache
Failed: 0 test(s), Passed: 3 test(s), Total: 3 test(s)
Name: TestMemoryFind
Failed: 0 test(s), Passed: 3 test(s), Total: 3 test(s)
Name: TestMemoryHistory
Failed: 0 test(s), Passed: 3 test(s), Total: 3 test(s)
Name: TestMemoryRead
Failed: 0 test(s), Passed: 3 test(s), Total: 3 test(s)
Name: TestMiBreak
Failed: 0 test(s), Passed: 0 test(s), Total: 7 test(s)
Name: TestMiCliSupport
Failed: 0 test(s), Passed: 0 test(s), Total: 8 test(s)
Name: TestMiData
Failed: 0 test(s), Passed: 0 test(s), Total: 7 test(s)
Name: TestMiExec
Failed: 0 test(s), Passed: 0 test(s), Total: 9 test(s)
Name: TestMiExit
Failed: 0 test(s), Passed: 0 test(s), Total: 3 test(s)
Name: TestMiFile
Failed: 0 test(s), Passed: 0 test(s), Total: 4 test(s)
Name: TestMiGdbSetShow
Failed: 0 test(s), Passed: 0 test(s), Total: 8 test(s)
Name: TestMiGdbSetShowPrint
Failed: 0 test(s), Passed: 0 test(s), Total: 3 test(s)
Name: TestMiInterpreterExec
Failed: 0 test(s), Passed: 0 test(s), Total: 8 test(s)
Name: TestMiLibraryLoaded
Failed: 0 test(s), Passed: 0 test(s), Total: 1 test(s)
Name: TestMiPrompt
Failed: 0 test(s), Passed: 0 test(s), Total: 1 test(s)
Name: TestMiSignal
Failed: 0 test(s), Passed: 0 test(s), Total: 5 test(s)
Name: TestMiStack
Failed: 0 test(s), Passed: 0 test(s), Total: 7 test(s)
Name: TestMiStartupOptions
Failed: 0 test(s), Passed: 0 test(s), Total: 10 test(s)
Name: TestMiSymbol
Failed: 0 test(s), Passed: 0 test(s), Total: 1 test(s)
Name: TestMiSyntax
Failed: 0 test(s), Passed: 0 test(s), Total: 3 test(s)
Name: TestMiTarget
Failed: 0 test(s), Passed: 0 test(s), Total: 3 test(s)
Name: TestMiThreadInfo
Failed: 0 test(s), Passed: 0 test(s), Total: 1 test(s)
Name: TestMiVar
Failed: 0 test(s), Passed: 0 test(s), Total: 6 test(s)
Name: TestMiniDump
Failed: 0 test(s), Passed: 0 test(s), Total: 9 test(s)
Name: TestMixedLanguages
Failed: 0 test(s), Passed: 3 test(s), Total: 3 test(s)
Name: TestModuleAndSection
Failed: 0 test(s), Passed: 9 test(s), Total: 9 test(s)
Name: TestMultilineExpressions
Failed: 0 test(s), Passed: 3 test(s), Total: 3 test(s)
Name: TestMultipleBreakpoints
Failed: 0 test(s), Passed: 3 test(s), Total: 3 test(s)
Name: TestMultipleDebuggers
Failed: 0 test(s), Passed: 3 test(s), Total: 3 test(s)
Name: TestMultipleDebuggersCommands
Failed: 0 test(s), Passed: 1 test(s), Total: 1 test(s)
Name: TestMultithreaded
Failed: 0 test(s), Passed: 0 test(s), Total: 12 test(s)
Name: TestMyFirstWatchpoint
Failed: 0 test(s), Passed: 3 test(s), Total: 3 test(s)
Name: TestNamespace
Failed: 0 test(s), Passed: 12 test(s), Total: 12 test(s)
Name: TestNamespaceDefinitions
Failed: 0 test(s), Passed: 3 test(s), Total: 3 test(s)
Name: TestNamespaceLookup
Failed: 0 test(s), Passed: 24 test(s), Total: 24 test(s)
Name: TestNestedAlias
Failed: 0 test(s), Passed: 3 test(s), Total: 3 test(s)
Name: TestNestedPersistentTypes
Failed: 0 test(s), Passed: 3 test(s), Total: 3 test(s)
Name: TestNoSuchArch
Failed: 0 test(s), Passed: 3 test(s), Total: 3 test(s)
Name: TestNoreturnUnwind
Failed: 0 test(s), Passed: 3 test(s), Total: 3 test(s)
Name: TestNumThreads
Failed: 0 test(s), Passed: 3 test(s), Total: 3 test(s)
Name: TestOverloadedFunctions
Failed: 0 test(s), Passed: 3 test(s), Total: 3 test(s)
Name: TestPOUnwrapping
Failed: 0 test(s), Passed: 1 test(s), Total: 1 test(s)
Name: TestPaths
Failed: 0 test(s), Passed: 2 test(s), Total: 3 test(s)
Name: TestPersistentPtrUpdate
Failed: 0 test(s), Passed: 3 test(s), Total: 3 test(s)
Name: TestPersistentTypes
Failed: 0 test(s), Passed: 3 test(s), Total: 3 test(s)
Name: TestPersistentVariables
Failed: 0 test(s), Passed: 3 test(s), Total: 3 test(s)
Name: TestPlatformCommand
Failed: 0 test(s), Passed: 7 test(s), Total: 8 test(s)
Name: TestPlatformProcessConnect
Failed: 0 test(s), Passed: 0 test(s), Total: 1 test(s)
Name: TestPluginCommands
Failed: 0 test(s), Passed: 1 test(s), Total: 1 test(s)
Name: TestPrintArray
Failed: 0 test(s), Passed: 3 test(s), Total: 3 test(s)
Name: TestPrintStackTraces
Failed: 0 test(s), Passed: 3 test(s), Total: 3 test(s)
Name: TestPrintfAfterUp
Failed: 0 test(s), Passed: 3 test(s), Total: 3 test(s)
Name: TestProcessAPI
Failed: 0 test(s), Passed: 15 test(s), Total: 15 test(s)
Name: TestProcessAttach
Failed: 0 test(s), Passed: 6 test(s), Total: 6 test(s)
Name: TestProcessIO
Failed: 0 test(s), Passed: 15 test(s), Total: 15 test(s)
Name: TestProcessLaunch
Failed: 0 test(s), Passed: 9 test(s), Total: 9 test(s)
Name: TestProcessSaveCore
Failed: 0 test(s), Passed: 0 test(s), Total: 6 test(s)
Name: TestPtrRef2Typedef
Failed: 0 test(s), Passed: 3 test(s), Total: 3 test(s)
Name: TestPtrToArrayFormatting
Failed: 0 test(s), Passed: 3 test(s), Total: 3 test(s)
Name: TestPublicAPIHeaders
Failed: 0 test(s), Passed: 0 test(s), Total: 3 test(s)
Name: TestPyObjSynthProvider
Failed: 0 test(s), Passed: 1 test(s), Total: 1 test(s)
Name: TestPythonOSPlugin
Failed: 0 test(s), Passed: 3 test(s), Total: 3 test(s)
Name: TestQuoting
Failed: 0 test(s), Passed: 11 test(s), Total: 11 test(s)
Name: TestREPLClasses
Failed: 0 test(s), Passed: 1 test(s), Total: 1 test(s)
Name: TestREPLRecursiveClass
Failed: 0 test(s), Passed: 1 test(s), Total: 1 test(s)
Name: TestREPLStructs
Failed: 0 test(s), Passed: 1 test(s), Total: 1 test(s)
Name: TestRaise
Failed: 0 test(s), Passed: 9 test(s), Total: 9 test(s)
Name: TestRdar12586188
Failed: 0 test(s), Passed: 1 test(s), Total: 1 test(s)
Name: TestRecursiveInferior
Failed: 0 test(s), Passed: 18 test(s), Total: 21 test(s)
Name: TestRecursiveTypes
Failed: 0 test(s), Passed: 6 test(s), Total: 6 test(s)
Name: TestRegexpBreakCommand
Failed: 0 test(s), Passed: 3 test(s), Total: 3 test(s)
Name: TestRegisterVariables
Failed: 0 test(s), Passed: 3 test(s), Total: 3 test(s)
Name: TestRegisters
Failed: 0 test(s), Passed: 21 test(s), Total: 21 test(s)
Name: TestRegistersIterator
Failed: 0 test(s), Passed: 3 test(s), Total: 3 test(s)
Name: TestReportData
Failed: 0 test(s), Passed: 3 test(s), Total: 3 test(s)
Name: TestRerun
Failed: 0 test(s), Passed: 3 test(s), Total: 3 test(s)
Name: TestReturnValue
Failed: 0 test(s), Passed: 3 test(s), Total: 3 test(s)
Name: TestRvalueReferences
Failed: 0 test(s), Passed: 3 test(s), Total: 3 test(s)
Name: TestSBData
Failed: 0 test(s), Passed: 3 test(s), Total: 3 test(s)
Name: TestSBFrameFindValue
Failed: 0 test(s), Passed: 3 test(s), Total: 3 test(s)
Name: TestSBValuePersist
Failed: 0 test(s), Passed: 3 test(s), Total: 3 test(s)
Name: TestSBValueUpdates
Failed: 0 test(s), Passed: 3 test(s), Total: 3 test(s)
Name: TestSTL
Failed: 0 test(s), Passed: 6 test(s), Total: 6 test(s)
Name: TestSTTYBeforeAndAfter
Failed: 0 test(s), Passed: 0 test(s), Total: 1 test(s)
Name: TestSaveJITObjects
Failed: 0 test(s), Passed: 3 test(s), Total: 3 test(s)
Name: TestSectionAPI
Failed: 0 test(s), Passed: 3 test(s), Total: 3 test(s)
Name: TestSendSignal
Failed: 0 test(s), Passed: 3 test(s), Total: 3 test(s)
Name: TestSequenceFunctions
Failed: 0 test(s), Passed: 3 test(s), Total: 3 test(s)
Name: TestSetValues
Failed: 0 test(s), Passed: 3 test(s), Total: 3 test(s)
Name: TestSetWatchlocation
Failed: 0 test(s), Passed: 3 test(s), Total: 3 test(s)
Name: TestSetWatchpoint
Failed: 0 test(s), Passed: 3 test(s), Total: 3 test(s)
Name: TestSettings
Failed: 0 test(s), Passed: 29 test(s), Total: 29 test(s)
Name: TestSharedLib
Failed: 0 test(s), Passed: 6 test(s), Total: 6 test(s)
Name: TestSharedLibStrippedSymbols
Failed: 0 test(s), Passed: 6 test(s), Total: 6 test(s)
Name: TestSignalsAPI
Failed: 0 test(s), Passed: 3 test(s), Total: 3 test(s)
Name: TestSignedTypes
Failed: 0 test(s), Passed: 3 test(s), Total: 3 test(s)
Name: TestSimpleExpressions
Failed: 0 test(s), Passed: 3 test(s), Total: 3 test(s)
Name: TestSingleQuoteInFilename
Failed: 0 test(s), Passed: 1 test(s), Total: 1 test(s)
Name: TestSourceManager
Failed: 0 test(s), Passed: 12 test(s), Total: 12 test(s)
Name: TestSourceRegexBreakpoints
Failed: 0 test(s), Passed: 6 test(s), Total: 6 test(s)
Name: TestStaticVariables
Failed: 0 test(s), Passed: 6 test(s), Total: 6 test(s)
Name: TestStepAndBreakpoints
Failed: 0 test(s), Passed: 3 test(s), Total: 3 test(s)
Name: TestStepNoDebug
Failed: 0 test(s), Passed: 9 test(s), Total: 9 test(s)
Name: TestStepOverWatchpoint
Failed: 0 test(s), Passed: 3 test(s), Total: 3 test(s)
Name: TestStepTarget
Failed: 0 test(s), Passed: 15 test(s), Total: 15 test(s)
Name: TestStopHookCmd
Failed: 0 test(s), Passed: 4 test(s), Total: 4 test(s)
Name: TestStopHookMechanism
Failed: 0 test(s), Passed: 3 test(s), Total: 3 test(s)
Name: TestStopHookMultipleThreads
Failed: 0 test(s), Passed: 3 test(s), Total: 3 test(s)
Name: TestStubReverseConnect
Failed: 0 test(s), Passed: 1 test(s), Total: 1 test(s)
Name: TestStubSetSID
Failed: 0 test(s), Passed: 3 test(s), Total: 3 test(s)
Name: TestSwiftAnyObjectType
Failed: 0 test(s), Passed: 3 test(s), Total: 3 test(s)
Name: TestSwiftAnyType
Failed: 0 test(s), Passed: 3 test(s), Total: 3 test(s)
Name: TestSwiftArchetypeResolution
Failed: 0 test(s), Passed: 3 test(s), Total: 3 test(s)
Name: TestSwiftArrayType
Failed: 0 test(s), Passed: 3 test(s), Total: 3 test(s)
Name: TestSwiftBacktracePrinting
Failed: 0 test(s), Passed: 3 test(s), Total: 3 test(s)
Name: TestSwiftBreakByPartialName
Failed: 0 test(s), Passed: 3 test(s), Total: 3 test(s)
Name: TestSwiftClassTypes
Failed: 0 test(s), Passed: 3 test(s), Total: 3 test(s)
Name: TestSwiftConditionalBreakpoint
Failed: 0 test(s), Passed: 3 test(s), Total: 3 test(s)
Name: TestSwiftDynamicValue
Failed: 0 test(s), Passed: 3 test(s), Total: 3 test(s)
Name: TestSwiftExpressionsInClassFunctions
Failed: 0 test(s), Passed: 3 test(s), Total: 3 test(s)
Name: TestSwiftExpressionsInMethodsPureSwift
Failed: 0 test(s), Passed: 3 test(s), Total: 3 test(s)
Name: TestSwiftFixIts
Failed: 0 test(s), Passed: 3 test(s), Total: 3 test(s)
Name: TestSwiftGenericEnums
Failed: 0 test(s), Passed: 3 test(s), Total: 3 test(s)
Name: TestSwiftGenericExpressions
Failed: 0 test(s), Passed: 6 test(s), Total: 6 test(s)
Name: TestSwiftGenericTupleLabels
Failed: 0 test(s), Passed: 3 test(s), Total: 3 test(s)
Name: TestSwiftGenericTypes
Failed: 0 test(s), Passed: 3 test(s), Total: 3 test(s)
Name: TestSwiftGenericsResolution
Failed: 0 test(s), Passed: 3 test(s), Total: 3 test(s)
Name: TestSwiftGetValueAsUnsigned
Failed: 0 test(s), Passed: 3 test(s), Total: 3 test(s)
Name: TestSwiftGlobals
Failed: 0 test(s), Passed: 3 test(s), Total: 3 test(s)
Name: TestSwiftHideRuntimeSupport
Failed: 0 test(s), Passed: 3 test(s), Total: 3 test(s)
Name: TestSwiftInstancePointerSetSP
Failed: 0 test(s), Passed: 3 test(s), Total: 3 test(s)
Name: TestSwiftLetInt
Failed: 0 test(s), Passed: 3 test(s), Total: 3 test(s)
Name: TestSwiftMetadataSymbols
Failed: 0 test(s), Passed: 3 test(s), Total: 3 test(s)
Name: TestSwiftMetadataSymbolsType
Failed: 0 test(s), Passed: 3 test(s), Total: 3 test(s)
Name: TestSwiftMetatype
Failed: 0 test(s), Passed: 3 test(s), Total: 3 test(s)
Name: TestSwiftMultipayloadEnum
Failed: 0 test(s), Passed: 3 test(s), Total: 3 test(s)
Name: TestSwiftNestedArray
Failed: 0 test(s), Passed: 3 test(s), Total: 3 test(s)
Name: TestSwiftOneCaseEnum
Failed: 0 test(s), Passed: 3 test(s), Total: 3 test(s)
Name: TestSwiftOptionals
Failed: 0 test(s), Passed: 3 test(s), Total: 3 test(s)
Name: TestSwiftPrivateDeclName
Failed: 0 test(s), Passed: 3 test(s), Total: 3 test(s)
Name: TestSwiftPrivateTypeAlias
Failed: 0 test(s), Passed: 3 test(s), Total: 3 test(s)
Name: TestSwiftProtocolTypes
Failed: 0 test(s), Passed: 3 test(s), Total: 3 test(s)
Name: TestSwiftRangeTypes
Failed: 0 test(s), Passed: 3 test(s), Total: 3 test(s)
Name: TestSwiftReferenceStorageTypes
Failed: 0 test(s), Passed: 3 test(s), Total: 3 test(s)
Name: TestSwiftReturns
Failed: 0 test(s), Passed: 0 test(s), Total: 3 test(s)
Name: TestSwiftStaticStringVariables
Failed: 0 test(s), Passed: 3 test(s), Total: 3 test(s)
Name: TestSwiftStdlibDictionary
Failed: 0 test(s), Passed: 0 test(s), Total: 3 test(s)
Name: TestSwiftStdlibSet
Failed: 0 test(s), Passed: 3 test(s), Total: 3 test(s)
Name: TestSwiftStepping
Failed: 0 test(s), Passed: 3 test(s), Total: 3 test(s)
Name: TestSwiftStringVariables
Failed: 0 test(s), Passed: 3 test(s), Total: 3 test(s)
Name: TestSwiftStructChangeRerun
Failed: 0 test(s), Passed: 0 test(s), Total: 3 test(s)
Name: TestSwiftStructInit
Failed: 0 test(s), Passed: 3 test(s), Total: 3 test(s)
Name: TestSwiftTupleTypes
Failed: 0 test(s), Passed: 3 test(s), Total: 3 test(s)
Name: TestSwiftTypeAliasFormatters
Failed: 0 test(s), Passed: 3 test(s), Total: 3 test(s)
Name: TestSwiftTypeLookup
Failed: 0 test(s), Passed: 3 test(s), Total: 3 test(s)
Name: TestSwiftTypeMetadata
Failed: 0 test(s), Passed: 3 test(s), Total: 3 test(s)
Name: TestSwiftTypes
Failed: 0 test(s), Passed: 3 test(s), Total: 3 test(s)
Name: TestSwiftValueOfOptionals
Failed: 0 test(s), Passed: 3 test(s), Total: 3 test(s)
Name: TestSymbolAPI
Failed: 0 test(s), Passed: 3 test(s), Total: 3 test(s)
Name: TestSymbolContext
Failed: 0 test(s), Passed: 3 test(s), Total: 3 test(s)
Name: TestSymbolContextTwoFiles
Failed: 0 test(s), Passed: 3 test(s), Total: 3 test(s)
Name: TestSyntheticCapping
Failed: 0 test(s), Passed: 3 test(s), Total: 3 test(s)
Name: TestTargetAPI
Failed: 0 test(s), Passed: 30 test(s), Total: 30 test(s)
Name: TestTargetCommand
Failed: 0 test(s), Passed: 9 test(s), Total: 9 test(s)
Name: TestTargetWatchAddress
Failed: 0 test(s), Passed: 6 test(s), Total: 6 test(s)
Name: TestTemplateArgs
Failed: 0 test(s), Passed: 6 test(s), Total: 6 test(s)
Name: TestThreadAPI
Failed: 0 test(s), Passed: 15 test(s), Total: 15 test(s)
Name: TestThreadExit
Failed: 0 test(s), Passed: 3 test(s), Total: 3 test(s)
Name: TestThreadJump
Failed: 0 test(s), Passed: 3 test(s), Total: 3 test(s)
Name: TestThreadSpecificBpPlusCondition
Failed: 0 test(s), Passed: 3 test(s), Total: 3 test(s)
Name: TestThreadSpecificBreakpoint
Failed: 0 test(s), Passed: 3 test(s), Total: 3 test(s)
Name: TestThreadStates
Failed: 0 test(s), Passed: 15 test(s), Total: 15 test(s)
Name: TestThreadStepOut
Failed: 0 test(s), Passed: 0 test(s), Total: 9 test(s)
Name: TestThreadStepping
Failed: 0 test(s), Passed: 3 test(s), Total: 3 test(s)
Name: TestTlsGlobals
Failed: 0 test(s), Passed: 3 test(s), Total: 3 test(s)
Name: TestTopLevelExprs
Failed: 0 test(s), Passed: 2 test(s), Total: 3 test(s)
Name: TestTsanBasic
Failed: 0 test(s), Passed: 3 test(s), Total: 3 test(s)
Name: TestTsanCPPGlobalLocation
Failed: 0 test(s), Passed: 3 test(s), Total: 3 test(s)
Name: TestTsanGlobalLocation
Failed: 0 test(s), Passed: 3 test(s), Total: 3 test(s)
Name: TestTsanMultiple
Failed: 0 test(s), Passed: 3 test(s), Total: 3 test(s)
Name: TestTsanSwift
Failed: 0 test(s), Passed: 0 test(s), Total: 3 test(s)
Name: TestTsanThreadLeak
Failed: 0 test(s), Passed: 3 test(s), Total: 3 test(s)
Name: TestTsanThreadNumbers
Failed: 0 test(s), Passed: 3 test(s), Total: 3 test(s)
Name: TestTypeCompletion
Failed: 0 test(s), Passed: 3 test(s), Total: 3 test(s)
Name: TestTypeList
Failed: 0 test(s), Passed: 3 test(s), Total: 3 test(s)
Name: TestTypeSummaryListArg
Failed: 0 test(s), Passed: 1 test(s), Total: 1 test(s)
Name: TestTypeSummaryListScript
Failed: 0 test(s), Passed: 3 test(s), Total: 3 test(s)
Name: TestUnicodeLiterals
Failed: 0 test(s), Passed: 9 test(s), Total: 9 test(s)
Name: TestUnionMembers
Failed: 0 test(s), Passed: 3 test(s), Total: 3 test(s)
Name: TestUniqueTypes
Failed: 0 test(s), Passed: 3 test(s), Total: 3 test(s)
Name: TestUnsignedTypes
Failed: 0 test(s), Passed: 3 test(s), Total: 3 test(s)
Name: TestUnwindExpression
Failed: 0 test(s), Passed: 3 test(s), Total: 3 test(s)
Name: TestUserFormatVsSummary
Failed: 0 test(s), Passed: 3 test(s), Total: 3 test(s)
Name: TestValueAPI
Failed: 0 test(s), Passed: 3 test(s), Total: 3 test(s)
Name: TestValueAPILinkedList
Failed: 0 test(s), Passed: 3 test(s), Total: 3 test(s)
Name: TestValueMD5Crash
Failed: 0 test(s), Passed: 3 test(s), Total: 3 test(s)
Name: TestValueObjectRecursion
Failed: 0 test(s), Passed: 3 test(s), Total: 3 test(s)
Name: TestValueOfVectorVariable
Failed: 0 test(s), Passed: 3 test(s), Total: 3 test(s)
Name: TestValueVarUpdate
Failed: 0 test(s), Passed: 3 test(s), Total: 3 test(s)
Name: TestVarInAggregateMisuse
Failed: 0 test(s), Passed: 3 test(s), Total: 3 test(s)
Name: TestVectorTypesFormatting
Failed: 0 test(s), Passed: 3 test(s), Total: 3 test(s)
Name: TestVirtual
Failed: 0 test(s), Passed: 3 test(s), Total: 3 test(s)
Name: TestWatchLocation
Failed: 0 test(s), Passed: 3 test(s), Total: 3 test(s)
Name: TestWatchLocationWithWatchSet
Failed: 0 test(s), Passed: 3 test(s), Total: 3 test(s)
Name: TestWatchedVarHitWhenInScope
Failed: 0 test(s), Passed: 3 test(s), Total: 3 test(s)
Name: TestWatchpointCommandLLDB
Failed: 0 test(s), Passed: 6 test(s), Total: 6 test(s)
Name: TestWatchpointCommandPython
Failed: 0 test(s), Passed: 6 test(s), Total: 6 test(s)
Name: TestWatchpointCommands
Failed: 0 test(s), Passed: 15 test(s), Total: 15 test(s)
Name: TestWatchpointConditionAPI
Failed: 0 test(s), Passed: 3 test(s), Total: 3 test(s)
Name: TestWatchpointConditionCmd
Failed: 0 test(s), Passed: 3 test(s), Total: 3 test(s)
Name: TestWatchpointEvents
Failed: 0 test(s), Passed: 3 test(s), Total: 3 test(s)
Name: TestWatchpointIgnoreCount
Failed: 0 test(s), Passed: 3 test(s), Total: 3 test(s)
Name: TestWatchpointIter
Failed: 0 test(s), Passed: 3 test(s), Total: 3 test(s)
Name: TestWatchpointMultipleThreads
Failed: 0 test(s), Passed: 6 test(s), Total: 6 test(s)
Name: TestWatchpointSetErrorCases
Failed: 0 test(s), Passed: 3 test(s), Total: 3 test(s)
Name: TestWatchpointSizes
Failed: 0 test(s), Passed: 3 test(s), Total: 3 test(s)
Name: TestWithLimitDebugInfo
Failed: 0 test(s), Passed: 1 test(s), Total: 3 test(s)
Name: TestWithModuleDebugging
Failed: 0 test(s), Passed: 1 test(s), Total: 1 test(s)
Name: TestWow64MiniDump
Failed: 0 test(s), Passed: 0 test(s), Total: 3 test(s)
Name: Testtypedef
Failed: 0 test(s), Passed: 3 test(s), Total: 3 test(s)
Name: lldbsuite.test.lldbtest
Failed: 3 test(s), Passed: 124 test(s), Total: 151 test(s)
Failed: lldbsuite.test.lldbtest.TestSwiftAssociatedSelfType.test_with_dwarf <https://ci.swift.org/job/oss-lldb-incremental-linux-ubuntu-15_10/6231/testReport/junit/lldbsuite.test.lldbtest/TestSwiftAssociatedSelfType/test_with_dwarf>
Failed: lldbsuite.test.lldbtest.TestSwiftAssociatedSelfType.test_with_dwo <https://ci.swift.org/job/oss-lldb-incremental-linux-ubuntu-15_10/6231/testReport/junit/lldbsuite.test.lldbtest/TestSwiftAssociatedSelfType/test_with_dwo>
Failed: lldbsuite.test.lldbtest.TestSwiftAssociatedSelfType.test_with_gmodules <https://ci.swift.org/job/oss-lldb-incremental-linux-ubuntu-15_10/6231/testReport/junit/lldbsuite.test.lldbtest/TestSwiftAssociatedSelfType/test_with_gmodules>

Changes

Commit 58ca217e8d19e44c3598b0acff33c7bac11c3cf3 by beanz:
[CMake] Fix bad dependency in symlink_clang_headers

edit: stdlib/public/SwiftShims/CMakeLists.txt
edit: cmake/modules/SwiftComponents.cmake

Commit 6a1d11bba2058924f03f8b131b176ac10e9f361c by egranata:
Teach TypeReconstruction how to look through associated types of the

edit: lib/IDE/TypeReconstruction.cpp

Commit fa01a4fa0273ca648b6a652d2550b1fc8fa710d0 by egranata:
Add a test case for LLDB to be able to resolve associated types in

add: packages/Python/lldbsuite/test/lang/swift/associated_self_type/TestSwiftAssociatedSelfType.py
add: packages/Python/lldbsuite/test/lang/swift/associated_self_type/main.swift
add: packages/Python/lldbsuite/test/lang/swift/associated_self_type/Makefile

Thanks,
- Enrico
:envelope_with_arrow: egranata@.com :phone:️ 27683


(Todd Fiala) #2

I am wondering if my LLDB change went in before the corresponding Swift change.. I'll keep an eye out...

Does it require an SBAPI change? If so, we may just need to put up new static bindings.

-Todd

···

On Sep 28, 2016, at 2:29 PM, Enrico Granata via swift-lldb-dev <swift-lldb-dev@swift.org> wrote:

On Sep 28, 2016, at 1:52 PM, no-reply@swift.org <mailto:no-reply@swift.org> wrote:

[FAILURE] oss-lldb-incremental-linux-ubuntu-15_10 [#6231]

Build URL: https://ci.swift.org/job/oss-lldb-incremental-linux-ubuntu-15_10/6231/
Project: oss-lldb-incremental-linux-ubuntu-15_10
Date of build: Wed, 28 Sep 2016 13:37:19 -0700
Build duration: 14 min
Identified problems:

Regression test failed: This build failed because a regression test in the test suite FAILed. Below is a list of all errors:
Indication 1 <https://ci.swift.org//job/oss-lldb-incremental-linux-ubuntu-15_10/6231/consoleFull#1565365029fca400bf-2f4a-462e-b517-e058d770b2d7>
Tests:

Name: Test-rdar-12481949
Failed: 0 test(s), Passed: 3 test(s), Total: 3 test(s)
Name: Test-rdar-9974002
Failed: 0 test(s), Passed: 3 test(s), Total: 3 test(s)
Name: Test11588
Failed: 0 test(s), Passed: 3 test(s), Total: 3 test(s)
Name: Test8638051
Failed: 0 test(s), Passed: 3 test(s), Total: 3 test(s)
Name: TestAbbreviations
Failed: 0 test(s), Passed: 1 test(s), Total: 1 test(s)
Name: TestAddressBreakpoints
Failed: 0 test(s), Passed: 3 test(s), Total: 3 test(s)
Name: TestAnonymous
Failed: 0 test(s), Passed: 21 test(s), Total: 21 test(s)
Name: TestApropos
Failed: 0 test(s), Passed: 1 test(s), Total: 1 test(s)
Name: TestAproposWithProcess
Failed: 0 test(s), Passed: 3 test(s), Total: 3 test(s)
Name: TestArrayTypes
Failed: 0 test(s), Passed: 6 test(s), Total: 6 test(s)
Name: TestAsanSwift
Failed: 0 test(s), Passed: 0 test(s), Total: 3 test(s)
Name: TestAttachDenied
Failed: 0 test(s), Passed: 3 test(s), Total: 3 test(s)
Name: TestAttachResume
Failed: 0 test(s), Passed: 3 test(s), Total: 3 test(s)
Name: TestAvoidBreakpointInDelaySlot
Failed: 0 test(s), Passed: 0 test(s), Total: 3 test(s)
Name: TestBSDArchives
Failed: 0 test(s), Passed: 3 test(s), Total: 3 test(s)
Name: TestBackticksWithoutATarget
Failed: 0 test(s), Passed: 1 test(s), Total: 1 test(s)
Name: TestBacktraceAll
Failed: 0 test(s), Passed: 3 test(s), Total: 3 test(s)
Name: TestBadAddressBreakpoints
Failed: 0 test(s), Passed: 3 test(s), Total: 3 test(s)
Name: TestBatchMode
Failed: 0 test(s), Passed: 9 test(s), Total: 9 test(s)
Name: TestBitfields
Failed: 0 test(s), Passed: 6 test(s), Total: 6 test(s)
Name: TestBreakAfterJoin
Failed: 0 test(s), Passed: 3 test(s), Total: 3 test(s)
Name: TestBreakpointAPI
Failed: 0 test(s), Passed: 3 test(s), Total: 3 test(s)
Name: TestBreakpointCaseSensitivity
Failed: 0 test(s), Passed: 3 test(s), Total: 6 test(s)
Name: TestBreakpointCommand
Failed: 0 test(s), Passed: 3 test(s), Total: 3 test(s)
Name: TestBreakpointCommandsFromPython
Failed: 0 test(s), Passed: 3 test(s), Total: 3 test(s)
Name: TestBreakpointConditions
Failed: 0 test(s), Passed: 12 test(s), Total: 12 test(s)
Name: TestBreakpointIDs
Failed: 0 test(s), Passed: 3 test(s), Total: 3 test(s)
Name: TestBreakpointIgnoreCount
Failed: 0 test(s), Passed: 6 test(s), Total: 6 test(s)
Name: TestBreakpointLanguage
Failed: 0 test(s), Passed: 6 test(s), Total: 6 test(s)
Name: TestBreakpointLocations
Failed: 0 test(s), Passed: 3 test(s), Total: 3 test(s)
Name: TestBreakpointOptions
Failed: 0 test(s), Passed: 3 test(s), Total: 3 test(s)
Name: TestBreakpointSetRestart
Failed: 0 test(s), Passed: 3 test(s), Total: 3 test(s)
Name: TestBreakpointsWithNoTargets
Failed: 0 test(s), Passed: 3 test(s), Total: 3 test(s)
Name: TestBuiltinTrap
Failed: 0 test(s), Passed: 3 test(s), Total: 3 test(s)
Name: TestBulkyEnumsVariables
Failed: 0 test(s), Passed: 3 test(s), Total: 3 test(s)
Name: TestCInlines
Failed: 0 test(s), Passed: 3 test(s), Total: 3 test(s)
Name: TestCModules
Failed: 0 test(s), Passed: 3 test(s), Total: 3 test(s)
Name: TestCPP11EnumTypes
Failed: 0 test(s), Passed: 24 test(s), Total: 24 test(s)
Name: TestCPPAuto
Failed: 0 test(s), Passed: 3 test(s), Total: 3 test(s)
Name: TestCPPBool
Failed: 0 test(s), Passed: 3 test(s), Total: 3 test(s)
Name: TestCPPBreakpointCommands
Failed: 0 test(s), Passed: 3 test(s), Total: 3 test(s)
Name: TestCPPBreakpointLocations
Failed: 0 test(s), Passed: 6 test(s), Total: 6 test(s)
Name: TestCPPExceptionBreakpoint
Failed: 0 test(s), Passed: 3 test(s), Total: 3 test(s)
Name: TestCPPExceptionBreakpoints
Failed: 0 test(s), Passed: 3 test(s), Total: 3 test(s)
Name: TestCPPStaticMembers
Failed: 0 test(s), Passed: 3 test(s), Total: 3 test(s)
Name: TestCPPStaticMethods
Failed: 0 test(s), Passed: 3 test(s), Total: 3 test(s)
Name: TestCPPThis
Failed: 0 test(s), Passed: 3 test(s), Total: 3 test(s)
Name: TestCStrings
Failed: 0 test(s), Passed: 3 test(s), Total: 3 test(s)
Name: TestCallCPPFunction
Failed: 0 test(s), Passed: 3 test(s), Total: 3 test(s)
Name: TestCallStdStringFunction
Failed: 0 test(s), Passed: 3 test(s), Total: 3 test(s)
Name: TestCallStopAndContinue
Failed: 0 test(s), Passed: 3 test(s), Total: 3 test(s)
Name: TestCallThatRestarts
Failed: 0 test(s), Passed: 3 test(s), Total: 3 test(s)
Name: TestCallUserAnonTypedef
Failed: 0 test(s), Passed: 3 test(s), Total: 3 test(s)
Name: TestCallUserDefinedFunction
Failed: 0 test(s), Passed: 3 test(s), Total: 3 test(s)
Name: TestCallWithTimeout
Failed: 0 test(s), Passed: 3 test(s), Total: 3 test(s)
Name: TestChangeProcessGroup
Failed: 0 test(s), Passed: 3 test(s), Total: 3 test(s)
Name: TestChangeValueAPI
Failed: 0 test(s), Passed: 3 test(s), Total: 3 test(s)
Name: TestChar1632T
Failed: 0 test(s), Passed: 3 test(s), Total: 3 test(s)
Name: TestClassTypes
Failed: 0 test(s), Passed: 12 test(s), Total: 12 test(s)
Name: TestClassTypesDisassembly
Failed: 0 test(s), Passed: 6 test(s), Total: 6 test(s)
Name: TestCommandHistory
Failed: 0 test(s), Passed: 1 test(s), Total: 1 test(s)
Name: TestCommandInterpreterAPI
Failed: 0 test(s), Passed: 3 test(s), Total: 3 test(s)
Name: TestCommandRegex
Failed: 0 test(s), Passed: 1 test(s), Total: 1 test(s)
Name: TestCommandScript
Failed: 0 test(s), Passed: 3 test(s), Total: 3 test(s)
Name: TestCommandScriptAlias
Failed: 0 test(s), Passed: 3 test(s), Total: 3 test(s)
Name: TestCommandScriptImmediateOutput
Failed: 0 test(s), Passed: 2 test(s), Total: 2 test(s)
Name: TestCommandSource
Failed: 0 test(s), Passed: 1 test(s), Total: 1 test(s)
Name: TestCommonShortSpellings
Failed: 0 test(s), Passed: 1 test(s), Total: 1 test(s)
Name: TestCompDirSymLink
Failed: 0 test(s), Passed: 9 test(s), Total: 9 test(s)
Name: TestCompletion
Failed: 0 test(s), Passed: 34 test(s), Total: 34 test(s)
Name: TestConcurrentBreakpointDelayBreakpointOneSignal
Failed: 0 test(s), Passed: 1 test(s), Total: 1 test(s)
Name: TestConcurrentBreakpointOneDelayBreakpointThreads
Failed: 0 test(s), Passed: 1 test(s), Total: 1 test(s)
Name: TestConcurrentBreakpointsDelayedBreakpointOneWatchpoint
Failed: 0 test(s), Passed: 1 test(s), Total: 1 test(s)
Name: TestConcurrentCrashWithBreak
Failed: 0 test(s), Passed: 1 test(s), Total: 1 test(s)
Name: TestConcurrentCrashWithSignal
Failed: 0 test(s), Passed: 1 test(s), Total: 1 test(s)
Name: TestConcurrentCrashWithWatchpoint
Failed: 0 test(s), Passed: 1 test(s), Total: 1 test(s)
Name: TestConcurrentCrashWithWatchpointBreakpointSignal
Failed: 0 test(s), Passed: 1 test(s), Total: 1 test(s)
Name: TestConcurrentDelaySignalBreak
Failed: 0 test(s), Passed: 1 test(s), Total: 1 test(s)
Name: TestConcurrentDelaySignalWatch
Failed: 0 test(s), Passed: 1 test(s), Total: 1 test(s)
Name: TestConcurrentDelayWatchBreak
Failed: 0 test(s), Passed: 1 test(s), Total: 1 test(s)
Name: TestConcurrentDelayedCrashWithBreakpointSignal
Failed: 0 test(s), Passed: 1 test(s), Total: 1 test(s)
Name: TestConcurrentDelayedCrashWithBreakpointWatchpoint
Failed: 0 test(s), Passed: 1 test(s), Total: 1 test(s)
Name: TestConcurrentNWatchNBreak
Failed: 0 test(s), Passed: 1 test(s), Total: 1 test(s)
Name: TestConcurrentSignalBreak
Failed: 0 test(s), Passed: 1 test(s), Total: 1 test(s)
Name: TestConcurrentSignalDelayBreak
Failed: 0 test(s), Passed: 1 test(s), Total: 1 test(s)
Name: TestConcurrentSignalDelayWatch
Failed: 0 test(s), Passed: 1 test(s), Total: 1 test(s)
Name: TestConcurrentSignalNWatchNBreak
Failed: 0 test(s), Passed: 1 test(s), Total: 1 test(s)
Name: TestConcurrentSignalWatch
Failed: 0 test(s), Passed: 1 test(s), Total: 1 test(s)
Name: TestConcurrentSignalWatchBreak
Failed: 0 test(s), Passed: 1 test(s), Total: 1 test(s)
Name: TestConcurrentTwoBreakpointThreads
Failed: 0 test(s), Passed: 1 test(s), Total: 1 test(s)
Name: TestConcurrentTwoBreakpointsOneDelaySignal
Failed: 0 test(s), Passed: 1 test(s), Total: 1 test(s)
Name: TestConcurrentTwoBreakpointsOneSignal
Failed: 0 test(s), Passed: 1 test(s), Total: 1 test(s)
Name: TestConcurrentTwoBreakpointsOneWatchpoint
Failed: 0 test(s), Passed: 1 test(s), Total: 1 test(s)
Name: TestConcurrentTwoWatchpointThreads
Failed: 0 test(s), Passed: 1 test(s), Total: 1 test(s)
Name: TestConcurrentTwoWatchpointsOneBreakpoint
Failed: 0 test(s), Passed: 1 test(s), Total: 1 test(s)
Name: TestConcurrentTwoWatchpointsOneDelayBreakpoint
Failed: 0 test(s), Passed: 1 test(s), Total: 1 test(s)
Name: TestConcurrentTwoWatchpointsOneSignal
Failed: 0 test(s), Passed: 1 test(s), Total: 1 test(s)
Name: TestConcurrentWatchBreak
Failed: 0 test(s), Passed: 1 test(s), Total: 1 test(s)
Name: TestConcurrentWatchBreakDelay
Failed: 0 test(s), Passed: 1 test(s), Total: 1 test(s)
Name: TestConcurrentWatchpointDelayWatchpointOneBreakpoint
Failed: 0 test(s), Passed: 1 test(s), Total: 1 test(s)
Name: TestConcurrentWatchpointWithDelayWatchpointThreads
Failed: 0 test(s), Passed: 1 test(s), Total: 1 test(s)
Name: TestConditionalBreak
Failed: 0 test(s), Passed: 6 test(s), Total: 6 test(s)
Name: TestConsecutiveBreakpoints
Failed: 0 test(s), Passed: 3 test(s), Total: 3 test(s)
Name: TestConstVariables
Failed: 0 test(s), Passed: 3 test(s), Total: 3 test(s)
Name: TestConvenienceVariables
Failed: 0 test(s), Passed: 3 test(s), Total: 3 test(s)
Name: TestCppChainedCalls
Failed: 0 test(s), Passed: 3 test(s), Total: 3 test(s)
Name: TestCppGlobalOperators
Failed: 0 test(s), Passed: 6 test(s), Total: 6 test(s)
Name: TestCppIncompleteTypes
Failed: 0 test(s), Passed: 6 test(s), Total: 6 test(s)
Name: TestCppNsImport
Failed: 0 test(s), Passed: 3 test(s), Total: 3 test(s)
Name: TestCppScope
Failed: 0 test(s), Passed: 3 test(s), Total: 3 test(s)
Name: TestCppValueCast
Failed: 0 test(s), Passed: 6 test(s), Total: 6 test(s)
Name: TestCrashDuringStep
Failed: 0 test(s), Passed: 3 test(s), Total: 3 test(s)
Name: TestCreateAfterAttach
Failed: 0 test(s), Passed: 6 test(s), Total: 6 test(s)
Name: TestCreateDuringInstructionStep
Failed: 0 test(s), Passed: 3 test(s), Total: 3 test(s)
Name: TestCreateDuringStep
Failed: 0 test(s), Passed: 9 test(s), Total: 9 test(s)
Name: TestCxxWCharT
Failed: 0 test(s), Passed: 3 test(s), Total: 3 test(s)
Name: TestDataFormatterAdv
Failed: 0 test(s), Passed: 3 test(s), Total: 3 test(s)
Name: TestDataFormatterCategories
Failed: 0 test(s), Passed: 3 test(s), Total: 3 test(s)
Name: TestDataFormatterCpp
Failed: 0 test(s), Passed: 3 test(s), Total: 3 test(s)
Name: TestDataFormatterDisabling
Failed: 0 test(s), Passed: 3 test(s), Total: 3 test(s)
Name: TestDataFormatterEnumFormat
Failed: 0 test(s), Passed: 3 test(s), Total: 3 test(s)
Name: TestDataFormatterGlobals
Failed: 0 test(s), Passed: 3 test(s), Total: 3 test(s)
Name: TestDataFormatterHexCaps
Failed: 0 test(s), Passed: 3 test(s), Total: 3 test(s)
Name: TestDataFormatterLanguageCategoryUpdates
Failed: 0 test(s), Passed: 3 test(s), Total: 3 test(s)
Name: TestDataFormatterLibccIterator
Failed: 0 test(s), Passed: 0 test(s), Total: 3 test(s)
Name: TestDataFormatterLibccMap
Failed: 0 test(s), Passed: 0 test(s), Total: 3 test(s)
Name: TestDataFormatterLibccMultiMap
Failed: 0 test(s), Passed: 0 test(s), Total: 3 test(s)
Name: TestDataFormatterLibcxxList
Failed: 0 test(s), Passed: 0 test(s), Total: 3 test(s)
Name: TestDataFormatterLibcxxListLoop
Failed: 0 test(s), Passed: 0 test(s), Total: 3 test(s)
Name: TestDataFormatterLibcxxMultiSet
Failed: 0 test(s), Passed: 0 test(s), Total: 3 test(s)
Name: TestDataFormatterLibcxxSet
Failed: 0 test(s), Passed: 3 test(s), Total: 3 test(s)
Name: TestDataFormatterLibcxxString
Failed: 0 test(s), Passed: 0 test(s), Total: 3 test(s)
Name: TestDataFormatterLibcxxVBool
Failed: 0 test(s), Passed: 0 test(s), Total: 3 test(s)
Name: TestDataFormatterLibcxxVector
Failed: 0 test(s), Passed: 0 test(s), Total: 3 test(s)
Name: TestDataFormatterNamedSummaries
Failed: 0 test(s), Passed: 3 test(s), Total: 3 test(s)
Name: TestDataFormatterPythonSynth
Failed: 0 test(s), Passed: 6 test(s), Total: 6 test(s)
Name: TestDataFormatterRefPtrRecursion
Failed: 0 test(s), Passed: 3 test(s), Total: 3 test(s)
Name: TestDataFormatterScript
Failed: 0 test(s), Passed: 3 test(s), Total: 3 test(s)
Name: TestDataFormatterSkipSummary
Failed: 0 test(s), Passed: 3 test(s), Total: 3 test(s)
Name: TestDataFormatterSmartArray
Failed: 0 test(s), Passed: 3 test(s), Total: 3 test(s)
Name: TestDataFormatterStdIterator
Failed: 0 test(s), Passed: 3 test(s), Total: 3 test(s)
Name: TestDataFormatterStdList
Failed: 0 test(s), Passed: 3 test(s), Total: 3 test(s)
Name: TestDataFormatterStdMap
Failed: 0 test(s), Passed: 3 test(s), Total: 3 test(s)
Name: TestDataFormatterStdSmartPtr
Failed: 0 test(s), Passed: 3 test(s), Total: 3 test(s)
Name: TestDataFormatterStdString
Failed: 0 test(s), Passed: 3 test(s), Total: 3 test(s)
Name: TestDataFormatterStdVBool
Failed: 0 test(s), Passed: 3 test(s), Total: 3 test(s)
Name: TestDataFormatterStdVector
Failed: 0 test(s), Passed: 3 test(s), Total: 3 test(s)
Name: TestDataFormatterSynth
Failed: 0 test(s), Passed: 3 test(s), Total: 3 test(s)
Name: TestDataFormatterSynthType
Failed: 0 test(s), Passed: 3 test(s), Total: 3 test(s)
Name: TestDataFormatterSynthVal
Failed: 0 test(s), Passed: 3 test(s), Total: 3 test(s)
Name: TestDataFormatterUnordered
Failed: 0 test(s), Passed: 0 test(s), Total: 3 test(s)
Name: TestDataFormatterVarScriptFormatting
Failed: 0 test(s), Passed: 3 test(s), Total: 3 test(s)
Name: TestDeadStrip
Failed: 0 test(s), Passed: 3 test(s), Total: 3 test(s)
Name: TestDebugBreak
Failed: 0 test(s), Passed: 1 test(s), Total: 1 test(s)
Name: TestDebuggerAPI
Failed: 0 test(s), Passed: 4 test(s), Total: 4 test(s)
Name: TestDefaultCacheLineSize
Failed: 0 test(s), Passed: 0 test(s), Total: 3 test(s)
Name: TestDefaultConstructorForAPIObjects
Failed: 0 test(s), Passed: 35 test(s), Total: 35 test(s)
Name: TestDefiningOverloadedFunctions
Failed: 0 test(s), Passed: 3 test(s), Total: 3 test(s)
Name: TestDiamond
Failed: 0 test(s), Passed: 3 test(s), Total: 3 test(s)
Name: TestDisasmAPI
Failed: 0 test(s), Passed: 3 test(s), Total: 3 test(s)
Name: TestDisassembleBreakpoint
Failed: 0 test(s), Passed: 3 test(s), Total: 3 test(s)
Name: TestDisassembleRawData
Failed: 0 test(s), Passed: 1 test(s), Total: 1 test(s)
Name: TestDisassemble_VST1_64
Failed: 0 test(s), Passed: 0 test(s), Total: 1 test(s)
Name: TestDynamicValue
Failed: 0 test(s), Passed: 3 test(s), Total: 3 test(s)
Name: TestDynamicValueChildCount
Failed: 0 test(s), Passed: 3 test(s), Total: 3 test(s)
Name: TestEhFrameUnwind
Failed: 0 test(s), Passed: 3 test(s), Total: 3 test(s)
Name: TestEmulations
Failed: 0 test(s), Passed: 2 test(s), Total: 2 test(s)
Name: TestEnumTypes
Failed: 0 test(s), Passed: 3 test(s), Total: 3 test(s)
Name: TestEnumVariables
Failed: 0 test(s), Passed: 3 test(s), Total: 3 test(s)
Name: TestEqualityOperators
Failed: 0 test(s), Passed: 9 test(s), Total: 9 test(s)
Name: TestEvents
Failed: 0 test(s), Passed: 0 test(s), Total: 9 test(s)
Name: TestExitDuringBreak
Failed: 0 test(s), Passed: 3 test(s), Total: 3 test(s)
Name: TestExitDuringStep
Failed: 0 test(s), Passed: 9 test(s), Total: 9 test(s)
Name: TestExprDoesntBlock
Failed: 0 test(s), Passed: 3 test(s), Total: 3 test(s)
Name: TestExprHelpExamples
Failed: 0 test(s), Passed: 3 test(s), Total: 3 test(s)
Name: TestExprInProtocolExtension
Failed: 0 test(s), Passed: 3 test(s), Total: 3 test(s)
Name: TestExprOptions
Failed: 0 test(s), Passed: 3 test(s), Total: 3 test(s)
Name: TestExpressionAccessControl
Failed: 0 test(s), Passed: 3 test(s), Total: 3 test(s)
Name: TestExpressionErrorBreakpoint
Failed: 0 test(s), Passed: 12 test(s), Total: 12 test(s)
Name: TestExpressionErrors
Failed: 0 test(s), Passed: 3 test(s), Total: 3 test(s)
Name: TestExpressionInSyscall
Failed: 0 test(s), Passed: 3 test(s), Total: 3 test(s)
Name: TestExpressionScopes
Failed: 0 test(s), Passed: 3 test(s), Total: 3 test(s)
Name: TestExprs
Failed: 0 test(s), Passed: 12 test(s), Total: 12 test(s)
Name: TestExprs2
Failed: 0 test(s), Passed: 3 test(s), Total: 3 test(s)
Name: TestExprsChar
Failed: 0 test(s), Passed: 9 test(s), Total: 9 test(s)
Name: TestFdLeak
Failed: 0 test(s), Passed: 3 test(s), Total: 3 test(s)
Name: TestFilePrivate
Failed: 0 test(s), Passed: 3 test(s), Total: 3 test(s)
Name: TestFloatTypes
Failed: 0 test(s), Passed: 6 test(s), Total: 6 test(s)
Name: TestFloatTypesExpr
Failed: 0 test(s), Passed: 6 test(s), Total: 6 test(s)
Name: TestFormatPropagation
Failed: 0 test(s), Passed: 3 test(s), Total: 3 test(s)
Name: TestFormats
Failed: 0 test(s), Passed: 3 test(s), Total: 3 test(s)
Name: TestFormatters
Failed: 0 test(s), Passed: 3 test(s), Total: 3 test(s)
Name: TestFormattersSBAPI
Failed: 0 test(s), Passed: 6 test(s), Total: 6 test(s)
Name: TestForwardDeclaration
Failed: 0 test(s), Passed: 3 test(s), Total: 3 test(s)
Name: TestFrameFormatSmallStruct
Failed: 0 test(s), Passed: 3 test(s), Total: 3 test(s)
Name: TestFrameUtils
Failed: 0 test(s), Passed: 3 test(s), Total: 3 test(s)
Name: TestFrameVariableAnonymousUnions
Failed: 0 test(s), Passed: 3 test(s), Total: 3 test(s)
Name: TestFrames
Failed: 0 test(s), Passed: 9 test(s), Total: 9 test(s)
Name: TestFunctionTypes
Failed: 0 test(s), Passed: 6 test(s), Total: 6 test(s)
Name: TestFunctionVariables
Failed: 0 test(s), Passed: 3 test(s), Total: 3 test(s)
Name: TestGdbRemoteAbort
Failed: 0 test(s), Passed: 1 test(s), Total: 1 test(s)
Name: TestGdbRemoteAttach
Failed: 0 test(s), Passed: 1 test(s), Total: 1 test(s)
Name: TestGdbRemoteAuxvSupport
Failed: 0 test(s), Passed: 4 test(s), Total: 4 test(s)
Name: TestGdbRemoteExitCode
Failed: 0 test(s), Passed: 3 test(s), Total: 3 test(s)
Name: TestGdbRemoteExpeditedRegisters
Failed: 0 test(s), Passed: 5 test(s), Total: 5 test(s)
Name: TestGdbRemoteHostInfo
Failed: 0 test(s), Passed: 1 test(s), Total: 1 test(s)
Name: TestGdbRemoteKill
Failed: 0 test(s), Passed: 1 test(s), Total: 1 test(s)
Name: TestGdbRemoteModuleInfo
Failed: 0 test(s), Passed: 1 test(s), Total: 1 test(s)
Name: TestGdbRemoteProcessInfo
Failed: 0 test(s), Passed: 5 test(s), Total: 5 test(s)
Name: TestGdbRemoteRegisterState
Failed: 0 test(s), Passed: 2 test(s), Total: 2 test(s)
Name: TestGdbRemoteSegFault
Failed: 0 test(s), Passed: 1 test(s), Total: 1 test(s)
Name: TestGdbRemoteSingleStep
Failed: 0 test(s), Passed: 1 test(s), Total: 1 test(s)
Name: TestGdbRemoteThreadsInStopReply
Failed: 0 test(s), Passed: 4 test(s), Total: 4 test(s)
Name: TestGdbRemote_qThreadStopInfo
Failed: 0 test(s), Passed: 3 test(s), Total: 4 test(s)
Name: TestGdbRemote_vCont
Failed: 0 test(s), Passed: 6 test(s), Total: 6 test(s)
Name: TestGlobalVariables
Failed: 0 test(s), Passed: 3 test(s), Total: 3 test(s)
Name: TestGoFormatters
Failed: 0 test(s), Passed: 0 test(s), Total: 1 test(s)
Name: TestGoroutines
Failed: 0 test(s), Passed: 0 test(s), Total: 1 test(s)
Name: TestHandleSegv
Failed: 0 test(s), Passed: 3 test(s), Total: 3 test(s)
Name: TestHelloWorld
Failed: 0 test(s), Passed: 9 test(s), Total: 9 test(s)
Name: TestHelp
Failed: 0 test(s), Passed: 18 test(s), Total: 18 test(s)
Name: TestIRInterpreter
Failed: 0 test(s), Passed: 3 test(s), Total: 3 test(s)
Name: TestIRInterpreterPHINodes
Failed: 0 test(s), Passed: 3 test(s), Total: 3 test(s)
Name: TestImageListMultiArchitecture
Failed: 0 test(s), Passed: 1 test(s), Total: 1 test(s)
Name: TestImport
Failed: 0 test(s), Passed: 1 test(s), Total: 1 test(s)
Name: TestInOutVariables
Failed: 0 test(s), Passed: 3 test(s), Total: 3 test(s)
Name: TestIndexVariable
Failed: 0 test(s), Passed: 3 test(s), Total: 3 test(s)
Name: TestIndirectEnumVariables
Failed: 0 test(s), Passed: 0 test(s), Total: 3 test(s)
Name: TestInferiorAssert
Failed: 0 test(s), Passed: 18 test(s), Total: 18 test(s)
Name: TestInferiorChanged
Failed: 0 test(s), Passed: 1 test(s), Total: 1 test(s)
Name: TestInferiorCrashing
Failed: 0 test(s), Passed: 18 test(s), Total: 21 test(s)
Name: TestInitializerList
Failed: 0 test(s), Passed: 3 test(s), Total: 3 test(s)
Name: TestInlineStepping
Failed: 0 test(s), Passed: 0 test(s), Total: 9 test(s)
Name: TestInlinedBreakpoints
Failed: 0 test(s), Passed: 3 test(s), Total: 3 test(s)
Name: TestInlinedFrame
Failed: 0 test(s), Passed: 3 test(s), Total: 3 test(s)
Name: TestInlines
Failed: 0 test(s), Passed: 3 test(s), Total: 3 test(s)
Name: TestIntegerTypes
Failed: 0 test(s), Passed: 30 test(s), Total: 30 test(s)
Name: TestIntegerTypesExpr
Failed: 0 test(s), Passed: 30 test(s), Total: 30 test(s)
Name: TestJITLoaderGDB
Failed: 0 test(s), Passed: 0 test(s), Total: 3 test(s)
Name: TestLLDBIterator
Failed: 0 test(s), Passed: 9 test(s), Total: 9 test(s)
Name: TestLLVM
Failed: 0 test(s), Passed: 1 test(s), Total: 1 test(s)
Name: TestLaunchWithShellExpand
Failed: 0 test(s), Passed: 3 test(s), Total: 3 test(s)
Name: TestLazyReverse
Failed: 0 test(s), Passed: 1 test(s), Total: 1 test(s)
Name: TestLibCxxAtomic
Failed: 0 test(s), Passed: 0 test(s), Total: 3 test(s)
Name: TestLibCxxFunction
Failed: 0 test(s), Passed: 0 test(s), Total: 3 test(s)
Name: TestLinuxCore
Failed: 0 test(s), Passed: 4 test(s), Total: 5 test(s)
Name: TestListener
Failed: 0 test(s), Passed: 3 test(s), Total: 3 test(s)
Name: TestLldbGdbServer
Failed: 0 test(s), Passed: 33 test(s), Total: 33 test(s)
Name: TestLoadUnload
Failed: 0 test(s), Passed: 18 test(s), Total: 18 test(s)
Name: TestLogging
Failed: 0 test(s), Passed: 5 test(s), Total: 5 test(s)
Name: TestLongjmp
Failed: 0 test(s), Passed: 9 test(s), Total: 9 test(s)
Name: TestMPXRegisters
Failed: 0 test(s), Passed: 0 test(s), Total: 3 test(s)
Name: TestMacros
Failed: 0 test(s), Passed: 3 test(s), Total: 3 test(s)
Name: TestMembersAndLocalsWithSameName
Failed: 0 test(s), Passed: 6 test(s), Total: 6 test(s)
Name: TestMemoryCache
Failed: 0 test(s), Passed: 3 test(s), Total: 3 test(s)
Name: TestMemoryFind
Failed: 0 test(s), Passed: 3 test(s), Total: 3 test(s)
Name: TestMemoryHistory
Failed: 0 test(s), Passed: 3 test(s), Total: 3 test(s)
Name: TestMemoryRead
Failed: 0 test(s), Passed: 3 test(s), Total: 3 test(s)
Name: TestMiBreak
Failed: 0 test(s), Passed: 0 test(s), Total: 7 test(s)
Name: TestMiCliSupport
Failed: 0 test(s), Passed: 0 test(s), Total: 8 test(s)
Name: TestMiData
Failed: 0 test(s), Passed: 0 test(s), Total: 7 test(s)
Name: TestMiExec
Failed: 0 test(s), Passed: 0 test(s), Total: 9 test(s)
Name: TestMiExit
Failed: 0 test(s), Passed: 0 test(s), Total: 3 test(s)
Name: TestMiFile
Failed: 0 test(s), Passed: 0 test(s), Total: 4 test(s)
Name: TestMiGdbSetShow
Failed: 0 test(s), Passed: 0 test(s), Total: 8 test(s)
Name: TestMiGdbSetShowPrint
Failed: 0 test(s), Passed: 0 test(s), Total: 3 test(s)
Name: TestMiInterpreterExec
Failed: 0 test(s), Passed: 0 test(s), Total: 8 test(s)
Name: TestMiLibraryLoaded
Failed: 0 test(s), Passed: 0 test(s), Total: 1 test(s)
Name: TestMiPrompt
Failed: 0 test(s), Passed: 0 test(s), Total: 1 test(s)
Name: TestMiSignal
Failed: 0 test(s), Passed: 0 test(s), Total: 5 test(s)
Name: TestMiStack
Failed: 0 test(s), Passed: 0 test(s), Total: 7 test(s)
Name: TestMiStartupOptions
Failed: 0 test(s), Passed: 0 test(s), Total: 10 test(s)
Name: TestMiSymbol
Failed: 0 test(s), Passed: 0 test(s), Total: 1 test(s)
Name: TestMiSyntax
Failed: 0 test(s), Passed: 0 test(s), Total: 3 test(s)
Name: TestMiTarget
Failed: 0 test(s), Passed: 0 test(s), Total: 3 test(s)
Name: TestMiThreadInfo
Failed: 0 test(s), Passed: 0 test(s), Total: 1 test(s)
Name: TestMiVar
Failed: 0 test(s), Passed: 0 test(s), Total: 6 test(s)
Name: TestMiniDump
Failed: 0 test(s), Passed: 0 test(s), Total: 9 test(s)
Name: TestMixedLanguages
Failed: 0 test(s), Passed: 3 test(s), Total: 3 test(s)
Name: TestModuleAndSection
Failed: 0 test(s), Passed: 9 test(s), Total: 9 test(s)
Name: TestMultilineExpressions
Failed: 0 test(s), Passed: 3 test(s), Total: 3 test(s)
Name: TestMultipleBreakpoints
Failed: 0 test(s), Passed: 3 test(s), Total: 3 test(s)
Name: TestMultipleDebuggers
Failed: 0 test(s), Passed: 3 test(s), Total: 3 test(s)
Name: TestMultipleDebuggersCommands
Failed: 0 test(s), Passed: 1 test(s), Total: 1 test(s)
Name: TestMultithreaded
Failed: 0 test(s), Passed: 0 test(s), Total: 12 test(s)
Name: TestMyFirstWatchpoint
Failed: 0 test(s), Passed: 3 test(s), Total: 3 test(s)
Name: TestNamespace
Failed: 0 test(s), Passed: 12 test(s), Total: 12 test(s)
Name: TestNamespaceDefinitions
Failed: 0 test(s), Passed: 3 test(s), Total: 3 test(s)
Name: TestNamespaceLookup
Failed: 0 test(s), Passed: 24 test(s), Total: 24 test(s)
Name: TestNestedAlias
Failed: 0 test(s), Passed: 3 test(s), Total: 3 test(s)
Name: TestNestedPersistentTypes
Failed: 0 test(s), Passed: 3 test(s), Total: 3 test(s)
Name: TestNoSuchArch
Failed: 0 test(s), Passed: 3 test(s), Total: 3 test(s)
Name: TestNoreturnUnwind
Failed: 0 test(s), Passed: 3 test(s), Total: 3 test(s)
Name: TestNumThreads
Failed: 0 test(s), Passed: 3 test(s), Total: 3 test(s)
Name: TestOverloadedFunctions
Failed: 0 test(s), Passed: 3 test(s), Total: 3 test(s)
Name: TestPOUnwrapping
Failed: 0 test(s), Passed: 1 test(s), Total: 1 test(s)
Name: TestPaths
Failed: 0 test(s), Passed: 2 test(s), Total: 3 test(s)
Name: TestPersistentPtrUpdate
Failed: 0 test(s), Passed: 3 test(s), Total: 3 test(s)
Name: TestPersistentTypes
Failed: 0 test(s), Passed: 3 test(s), Total: 3 test(s)
Name: TestPersistentVariables
Failed: 0 test(s), Passed: 3 test(s), Total: 3 test(s)
Name: TestPlatformCommand
Failed: 0 test(s), Passed: 7 test(s), Total: 8 test(s)
Name: TestPlatformProcessConnect
Failed: 0 test(s), Passed: 0 test(s), Total: 1 test(s)
Name: TestPluginCommands
Failed: 0 test(s), Passed: 1 test(s), Total: 1 test(s)
Name: TestPrintArray
Failed: 0 test(s), Passed: 3 test(s), Total: 3 test(s)
Name: TestPrintStackTraces
Failed: 0 test(s), Passed: 3 test(s), Total: 3 test(s)
Name: TestPrintfAfterUp
Failed: 0 test(s), Passed: 3 test(s), Total: 3 test(s)
Name: TestProcessAPI
Failed: 0 test(s), Passed: 15 test(s), Total: 15 test(s)
Name: TestProcessAttach
Failed: 0 test(s), Passed: 6 test(s), Total: 6 test(s)
Name: TestProcessIO
Failed: 0 test(s), Passed: 15 test(s), Total: 15 test(s)
Name: TestProcessLaunch
Failed: 0 test(s), Passed: 9 test(s), Total: 9 test(s)
Name: TestProcessSaveCore
Failed: 0 test(s), Passed: 0 test(s), Total: 6 test(s)
Name: TestPtrRef2Typedef
Failed: 0 test(s), Passed: 3 test(s), Total: 3 test(s)
Name: TestPtrToArrayFormatting
Failed: 0 test(s), Passed: 3 test(s), Total: 3 test(s)
Name: TestPublicAPIHeaders
Failed: 0 test(s), Passed: 0 test(s), Total: 3 test(s)
Name: TestPyObjSynthProvider
Failed: 0 test(s), Passed: 1 test(s), Total: 1 test(s)
Name: TestPythonOSPlugin
Failed: 0 test(s), Passed: 3 test(s), Total: 3 test(s)
Name: TestQuoting
Failed: 0 test(s), Passed: 11 test(s), Total: 11 test(s)
Name: TestREPLClasses
Failed: 0 test(s), Passed: 1 test(s), Total: 1 test(s)
Name: TestREPLRecursiveClass
Failed: 0 test(s), Passed: 1 test(s), Total: 1 test(s)
Name: TestREPLStructs
Failed: 0 test(s), Passed: 1 test(s), Total: 1 test(s)
Name: TestRaise
Failed: 0 test(s), Passed: 9 test(s), Total: 9 test(s)
Name: TestRdar12586188
Failed: 0 test(s), Passed: 1 test(s), Total: 1 test(s)
Name: TestRecursiveInferior
Failed: 0 test(s), Passed: 18 test(s), Total: 21 test(s)
Name: TestRecursiveTypes
Failed: 0 test(s), Passed: 6 test(s), Total: 6 test(s)
Name: TestRegexpBreakCommand
Failed: 0 test(s), Passed: 3 test(s), Total: 3 test(s)
Name: TestRegisterVariables
Failed: 0 test(s), Passed: 3 test(s), Total: 3 test(s)
Name: TestRegisters
Failed: 0 test(s), Passed: 21 test(s), Total: 21 test(s)
Name: TestRegistersIterator
Failed: 0 test(s), Passed: 3 test(s), Total: 3 test(s)
Name: TestReportData
Failed: 0 test(s), Passed: 3 test(s), Total: 3 test(s)
Name: TestRerun
Failed: 0 test(s), Passed: 3 test(s), Total: 3 test(s)
Name: TestReturnValue
Failed: 0 test(s), Passed: 3 test(s), Total: 3 test(s)
Name: TestRvalueReferences
Failed: 0 test(s), Passed: 3 test(s), Total: 3 test(s)
Name: TestSBData
Failed: 0 test(s), Passed: 3 test(s), Total: 3 test(s)
Name: TestSBFrameFindValue
Failed: 0 test(s), Passed: 3 test(s), Total: 3 test(s)
Name: TestSBValuePersist
Failed: 0 test(s), Passed: 3 test(s), Total: 3 test(s)
Name: TestSBValueUpdates
Failed: 0 test(s), Passed: 3 test(s), Total: 3 test(s)
Name: TestSTL
Failed: 0 test(s), Passed: 6 test(s), Total: 6 test(s)
Name: TestSTTYBeforeAndAfter
Failed: 0 test(s), Passed: 0 test(s), Total: 1 test(s)
Name: TestSaveJITObjects
Failed: 0 test(s), Passed: 3 test(s), Total: 3 test(s)
Name: TestSectionAPI
Failed: 0 test(s), Passed: 3 test(s), Total: 3 test(s)
Name: TestSendSignal
Failed: 0 test(s), Passed: 3 test(s), Total: 3 test(s)
Name: TestSequenceFunctions
Failed: 0 test(s), Passed: 3 test(s), Total: 3 test(s)
Name: TestSetValues
Failed: 0 test(s), Passed: 3 test(s), Total: 3 test(s)
Name: TestSetWatchlocation
Failed: 0 test(s), Passed: 3 test(s), Total: 3 test(s)
Name: TestSetWatchpoint
Failed: 0 test(s), Passed: 3 test(s), Total: 3 test(s)
Name: TestSettings
Failed: 0 test(s), Passed: 29 test(s), Total: 29 test(s)
Name: TestSharedLib
Failed: 0 test(s), Passed: 6 test(s), Total: 6 test(s)
Name: TestSharedLibStrippedSymbols
Failed: 0 test(s), Passed: 6 test(s), Total: 6 test(s)
Name: TestSignalsAPI
Failed: 0 test(s), Passed: 3 test(s), Total: 3 test(s)
Name: TestSignedTypes
Failed: 0 test(s), Passed: 3 test(s), Total: 3 test(s)
Name: TestSimpleExpressions
Failed: 0 test(s), Passed: 3 test(s), Total: 3 test(s)
Name: TestSingleQuoteInFilename
Failed: 0 test(s), Passed: 1 test(s), Total: 1 test(s)
Name: TestSourceManager
Failed: 0 test(s), Passed: 12 test(s), Total: 12 test(s)
Name: TestSourceRegexBreakpoints
Failed: 0 test(s), Passed: 6 test(s), Total: 6 test(s)
Name: TestStaticVariables
Failed: 0 test(s), Passed: 6 test(s), Total: 6 test(s)
Name: TestStepAndBreakpoints
Failed: 0 test(s), Passed: 3 test(s), Total: 3 test(s)
Name: TestStepNoDebug
Failed: 0 test(s), Passed: 9 test(s), Total: 9 test(s)
Name: TestStepOverWatchpoint
Failed: 0 test(s), Passed: 3 test(s), Total: 3 test(s)
Name: TestStepTarget
Failed: 0 test(s), Passed: 15 test(s), Total: 15 test(s)
Name: TestStopHookCmd
Failed: 0 test(s), Passed: 4 test(s), Total: 4 test(s)
Name: TestStopHookMechanism
Failed: 0 test(s), Passed: 3 test(s), Total: 3 test(s)
Name: TestStopHookMultipleThreads
Failed: 0 test(s), Passed: 3 test(s), Total: 3 test(s)
Name: TestStubReverseConnect
Failed: 0 test(s), Passed: 1 test(s), Total: 1 test(s)
Name: TestStubSetSID
Failed: 0 test(s), Passed: 3 test(s), Total: 3 test(s)
Name: TestSwiftAnyObjectType
Failed: 0 test(s), Passed: 3 test(s), Total: 3 test(s)
Name: TestSwiftAnyType
Failed: 0 test(s), Passed: 3 test(s), Total: 3 test(s)
Name: TestSwiftArchetypeResolution
Failed: 0 test(s), Passed: 3 test(s), Total: 3 test(s)
Name: TestSwiftArrayType
Failed: 0 test(s), Passed: 3 test(s), Total: 3 test(s)
Name: TestSwiftBacktracePrinting
Failed: 0 test(s), Passed: 3 test(s), Total: 3 test(s)
Name: TestSwiftBreakByPartialName
Failed: 0 test(s), Passed: 3 test(s), Total: 3 test(s)
Name: TestSwiftClassTypes
Failed: 0 test(s), Passed: 3 test(s), Total: 3 test(s)
Name: TestSwiftConditionalBreakpoint
Failed: 0 test(s), Passed: 3 test(s), Total: 3 test(s)
Name: TestSwiftDynamicValue
Failed: 0 test(s), Passed: 3 test(s), Total: 3 test(s)
Name: TestSwiftExpressionsInClassFunctions
Failed: 0 test(s), Passed: 3 test(s), Total: 3 test(s)
Name: TestSwiftExpressionsInMethodsPureSwift
Failed: 0 test(s), Passed: 3 test(s), Total: 3 test(s)
Name: TestSwiftFixIts
Failed: 0 test(s), Passed: 3 test(s), Total: 3 test(s)
Name: TestSwiftGenericEnums
Failed: 0 test(s), Passed: 3 test(s), Total: 3 test(s)
Name: TestSwiftGenericExpressions
Failed: 0 test(s), Passed: 6 test(s), Total: 6 test(s)
Name: TestSwiftGenericTupleLabels
Failed: 0 test(s), Passed: 3 test(s), Total: 3 test(s)
Name: TestSwiftGenericTypes
Failed: 0 test(s), Passed: 3 test(s), Total: 3 test(s)
Name: TestSwiftGenericsResolution
Failed: 0 test(s), Passed: 3 test(s), Total: 3 test(s)
Name: TestSwiftGetValueAsUnsigned
Failed: 0 test(s), Passed: 3 test(s), Total: 3 test(s)
Name: TestSwiftGlobals
Failed: 0 test(s), Passed: 3 test(s), Total: 3 test(s)
Name: TestSwiftHideRuntimeSupport
Failed: 0 test(s), Passed: 3 test(s), Total: 3 test(s)
Name: TestSwiftInstancePointerSetSP
Failed: 0 test(s), Passed: 3 test(s), Total: 3 test(s)
Name: TestSwiftLetInt
Failed: 0 test(s), Passed: 3 test(s), Total: 3 test(s)
Name: TestSwiftMetadataSymbols
Failed: 0 test(s), Passed: 3 test(s), Total: 3 test(s)
Name: TestSwiftMetadataSymbolsType
Failed: 0 test(s), Passed: 3 test(s), Total: 3 test(s)
Name: TestSwiftMetatype
Failed: 0 test(s), Passed: 3 test(s), Total: 3 test(s)
Name: TestSwiftMultipayloadEnum
Failed: 0 test(s), Passed: 3 test(s), Total: 3 test(s)
Name: TestSwiftNestedArray
Failed: 0 test(s), Passed: 3 test(s), Total: 3 test(s)
Name: TestSwiftOneCaseEnum
Failed: 0 test(s), Passed: 3 test(s), Total: 3 test(s)
Name: TestSwiftOptionals
Failed: 0 test(s), Passed: 3 test(s), Total: 3 test(s)
Name: TestSwiftPrivateDeclName
Failed: 0 test(s), Passed: 3 test(s), Total: 3 test(s)
Name: TestSwiftPrivateTypeAlias
Failed: 0 test(s), Passed: 3 test(s), Total: 3 test(s)
Name: TestSwiftProtocolTypes
Failed: 0 test(s), Passed: 3 test(s), Total: 3 test(s)
Name: TestSwiftRangeTypes
Failed: 0 test(s), Passed: 3 test(s), Total: 3 test(s)
Name: TestSwiftReferenceStorageTypes
Failed: 0 test(s), Passed: 3 test(s), Total: 3 test(s)
Name: TestSwiftReturns
Failed: 0 test(s), Passed: 0 test(s), Total: 3 test(s)
Name: TestSwiftStaticStringVariables
Failed: 0 test(s), Passed: 3 test(s), Total: 3 test(s)
Name: TestSwiftStdlibDictionary
Failed: 0 test(s), Passed: 0 test(s), Total: 3 test(s)
Name: TestSwiftStdlibSet
Failed: 0 test(s), Passed: 3 test(s), Total: 3 test(s)
Name: TestSwiftStepping
Failed: 0 test(s), Passed: 3 test(s), Total: 3 test(s)
Name: TestSwiftStringVariables
Failed: 0 test(s), Passed: 3 test(s), Total: 3 test(s)
Name: TestSwiftStructChangeRerun
Failed: 0 test(s), Passed: 0 test(s), Total: 3 test(s)
Name: TestSwiftStructInit
Failed: 0 test(s), Passed: 3 test(s), Total: 3 test(s)
Name: TestSwiftTupleTypes
Failed: 0 test(s), Passed: 3 test(s), Total: 3 test(s)
Name: TestSwiftTypeAliasFormatters
Failed: 0 test(s), Passed: 3 test(s), Total: 3 test(s)
Name: TestSwiftTypeLookup
Failed: 0 test(s), Passed: 3 test(s), Total: 3 test(s)
Name: TestSwiftTypeMetadata
Failed: 0 test(s), Passed: 3 test(s), Total: 3 test(s)
Name: TestSwiftTypes
Failed: 0 test(s), Passed: 3 test(s), Total: 3 test(s)
Name: TestSwiftValueOfOptionals
Failed: 0 test(s), Passed: 3 test(s), Total: 3 test(s)
Name: TestSymbolAPI
Failed: 0 test(s), Passed: 3 test(s), Total: 3 test(s)
Name: TestSymbolContext
Failed: 0 test(s), Passed: 3 test(s), Total: 3 test(s)
Name: TestSymbolContextTwoFiles
Failed: 0 test(s), Passed: 3 test(s), Total: 3 test(s)
Name: TestSyntheticCapping
Failed: 0 test(s), Passed: 3 test(s), Total: 3 test(s)
Name: TestTargetAPI
Failed: 0 test(s), Passed: 30 test(s), Total: 30 test(s)
Name: TestTargetCommand
Failed: 0 test(s), Passed: 9 test(s), Total: 9 test(s)
Name: TestTargetWatchAddress
Failed: 0 test(s), Passed: 6 test(s), Total: 6 test(s)
Name: TestTemplateArgs
Failed: 0 test(s), Passed: 6 test(s), Total: 6 test(s)
Name: TestThreadAPI
Failed: 0 test(s), Passed: 15 test(s), Total: 15 test(s)
Name: TestThreadExit
Failed: 0 test(s), Passed: 3 test(s), Total: 3 test(s)
Name: TestThreadJump
Failed: 0 test(s), Passed: 3 test(s), Total: 3 test(s)
Name: TestThreadSpecificBpPlusCondition
Failed: 0 test(s), Passed: 3 test(s), Total: 3 test(s)
Name: TestThreadSpecificBreakpoint
Failed: 0 test(s), Passed: 3 test(s), Total: 3 test(s)
Name: TestThreadStates
Failed: 0 test(s), Passed: 15 test(s), Total: 15 test(s)
Name: TestThreadStepOut
Failed: 0 test(s), Passed: 0 test(s), Total: 9 test(s)
Name: TestThreadStepping
Failed: 0 test(s), Passed: 3 test(s), Total: 3 test(s)
Name: TestTlsGlobals
Failed: 0 test(s), Passed: 3 test(s), Total: 3 test(s)
Name: TestTopLevelExprs
Failed: 0 test(s), Passed: 2 test(s), Total: 3 test(s)
Name: TestTsanBasic
Failed: 0 test(s), Passed: 3 test(s), Total: 3 test(s)
Name: TestTsanCPPGlobalLocation
Failed: 0 test(s), Passed: 3 test(s), Total: 3 test(s)
Name: TestTsanGlobalLocation
Failed: 0 test(s), Passed: 3 test(s), Total: 3 test(s)
Name: TestTsanMultiple
Failed: 0 test(s), Passed: 3 test(s), Total: 3 test(s)
Name: TestTsanSwift
Failed: 0 test(s), Passed: 0 test(s), Total: 3 test(s)
Name: TestTsanThreadLeak
Failed: 0 test(s), Passed: 3 test(s), Total: 3 test(s)
Name: TestTsanThreadNumbers
Failed: 0 test(s), Passed: 3 test(s), Total: 3 test(s)
Name: TestTypeCompletion
Failed: 0 test(s), Passed: 3 test(s), Total: 3 test(s)
Name: TestTypeList
Failed: 0 test(s), Passed: 3 test(s), Total: 3 test(s)
Name: TestTypeSummaryListArg
Failed: 0 test(s), Passed: 1 test(s), Total: 1 test(s)
Name: TestTypeSummaryListScript
Failed: 0 test(s), Passed: 3 test(s), Total: 3 test(s)
Name: TestUnicodeLiterals
Failed: 0 test(s), Passed: 9 test(s), Total: 9 test(s)
Name: TestUnionMembers
Failed: 0 test(s), Passed: 3 test(s), Total: 3 test(s)
Name: TestUniqueTypes
Failed: 0 test(s), Passed: 3 test(s), Total: 3 test(s)
Name: TestUnsignedTypes
Failed: 0 test(s), Passed: 3 test(s), Total: 3 test(s)
Name: TestUnwindExpression
Failed: 0 test(s), Passed: 3 test(s), Total: 3 test(s)
Name: TestUserFormatVsSummary
Failed: 0 test(s), Passed: 3 test(s), Total: 3 test(s)
Name: TestValueAPI
Failed: 0 test(s), Passed: 3 test(s), Total: 3 test(s)
Name: TestValueAPILinkedList
Failed: 0 test(s), Passed: 3 test(s), Total: 3 test(s)
Name: TestValueMD5Crash
Failed: 0 test(s), Passed: 3 test(s), Total: 3 test(s)
Name: TestValueObjectRecursion
Failed: 0 test(s), Passed: 3 test(s), Total: 3 test(s)
Name: TestValueOfVectorVariable
Failed: 0 test(s), Passed: 3 test(s), Total: 3 test(s)
Name: TestValueVarUpdate
Failed: 0 test(s), Passed: 3 test(s), Total: 3 test(s)
Name: TestVarInAggregateMisuse
Failed: 0 test(s), Passed: 3 test(s), Total: 3 test(s)
Name: TestVectorTypesFormatting
Failed: 0 test(s), Passed: 3 test(s), Total: 3 test(s)
Name: TestVirtual
Failed: 0 test(s), Passed: 3 test(s), Total: 3 test(s)
Name: TestWatchLocation
Failed: 0 test(s), Passed: 3 test(s), Total: 3 test(s)
Name: TestWatchLocationWithWatchSet
Failed: 0 test(s), Passed: 3 test(s), Total: 3 test(s)
Name: TestWatchedVarHitWhenInScope
Failed: 0 test(s), Passed: 3 test(s), Total: 3 test(s)
Name: TestWatchpointCommandLLDB
Failed: 0 test(s), Passed: 6 test(s), Total: 6 test(s)
Name: TestWatchpointCommandPython
Failed: 0 test(s), Passed: 6 test(s), Total: 6 test(s)
Name: TestWatchpointCommands
Failed: 0 test(s), Passed: 15 test(s), Total: 15 test(s)
Name: TestWatchpointConditionAPI
Failed: 0 test(s), Passed: 3 test(s), Total: 3 test(s)
Name: TestWatchpointConditionCmd
Failed: 0 test(s), Passed: 3 test(s), Total: 3 test(s)
Name: TestWatchpointEvents
Failed: 0 test(s), Passed: 3 test(s), Total: 3 test(s)
Name: TestWatchpointIgnoreCount
Failed: 0 test(s), Passed: 3 test(s), Total: 3 test(s)
Name: TestWatchpointIter
Failed: 0 test(s), Passed: 3 test(s), Total: 3 test(s)
Name: TestWatchpointMultipleThreads
Failed: 0 test(s), Passed: 6 test(s), Total: 6 test(s)
Name: TestWatchpointSetErrorCases
Failed: 0 test(s), Passed: 3 test(s), Total: 3 test(s)
Name: TestWatchpointSizes
Failed: 0 test(s), Passed: 3 test(s), Total: 3 test(s)
Name: TestWithLimitDebugInfo
Failed: 0 test(s), Passed: 1 test(s), Total: 3 test(s)
Name: TestWithModuleDebugging
Failed: 0 test(s), Passed: 1 test(s), Total: 1 test(s)
Name: TestWow64MiniDump
Failed: 0 test(s), Passed: 0 test(s), Total: 3 test(s)
Name: Testtypedef
Failed: 0 test(s), Passed: 3 test(s), Total: 3 test(s)
Name: lldbsuite.test.lldbtest
Failed: 3 test(s), Passed: 124 test(s), Total: 151 test(s)
Failed: lldbsuite.test.lldbtest.TestSwiftAssociatedSelfType.test_with_dwarf <https://ci.swift.org/job/oss-lldb-incremental-linux-ubuntu-15_10/6231/testReport/junit/lldbsuite.test.lldbtest/TestSwiftAssociatedSelfType/test_with_dwarf>
Failed: lldbsuite.test.lldbtest.TestSwiftAssociatedSelfType.test_with_dwo <https://ci.swift.org/job/oss-lldb-incremental-linux-ubuntu-15_10/6231/testReport/junit/lldbsuite.test.lldbtest/TestSwiftAssociatedSelfType/test_with_dwo>
Failed: lldbsuite.test.lldbtest.TestSwiftAssociatedSelfType.test_with_gmodules <https://ci.swift.org/job/oss-lldb-incremental-linux-ubuntu-15_10/6231/testReport/junit/lldbsuite.test.lldbtest/TestSwiftAssociatedSelfType/test_with_gmodules>

Changes

Commit 58ca217e8d19e44c3598b0acff33c7bac11c3cf3 by beanz:
[CMake] Fix bad dependency in symlink_clang_headers

edit: stdlib/public/SwiftShims/CMakeLists.txt
edit: cmake/modules/SwiftComponents.cmake

Commit 6a1d11bba2058924f03f8b131b176ac10e9f361c by egranata:
Teach TypeReconstruction how to look through associated types of the

edit: lib/IDE/TypeReconstruction.cpp

Commit fa01a4fa0273ca648b6a652d2550b1fc8fa710d0 by egranata:
Add a test case for LLDB to be able to resolve associated types in

add: packages/Python/lldbsuite/test/lang/swift/associated_self_type/TestSwiftAssociatedSelfType.py
add: packages/Python/lldbsuite/test/lang/swift/associated_self_type/main.swift
add: packages/Python/lldbsuite/test/lang/swift/associated_self_type/Makefile

Thanks,
- Enrico
:envelope_with_arrow: egranata@.com :phone:️ 27683

_______________________________________________
swift-lldb-dev mailing list
swift-lldb-dev@swift.org
https://lists.swift.org/mailman/listinfo/swift-lldb-dev


(Enrico Granata) #3

I am wondering if my LLDB change went in before the corresponding Swift change.. I'll keep an eye out...

Does it require an SBAPI change? If so, we may just need to put up new static bindings.

Nope - not the case; I just need to investigate why Linux is sad about this change. With that said, Slava promised to overhaul this code fairly soon..

-Todd

[FAILURE] oss-lldb-incremental-linux-ubuntu-15_10 [#6231]

Build URL: https://ci.swift.org/job/oss-lldb-incremental-linux-ubuntu-15_10/6231/
Project: oss-lldb-incremental-linux-ubuntu-15_10
Date of build: Wed, 28 Sep 2016 13:37:19 -0700
Build duration: 14 min
Identified problems:

Regression test failed: This build failed because a regression test in the test suite FAILed. Below is a list of all errors:
Indication 1 <https://ci.swift.org//job/oss-lldb-incremental-linux-ubuntu-15_10/6231/consoleFull#1565365029fca400bf-2f4a-462e-b517-e058d770b2d7>
Tests:

Name: Test-rdar-12481949
Failed: 0 test(s), Passed: 3 test(s), Total: 3 test(s)
Name: Test-rdar-9974002
Failed: 0 test(s), Passed: 3 test(s), Total: 3 test(s)
Name: Test11588
Failed: 0 test(s), Passed: 3 test(s), Total: 3 test(s)
Name: Test8638051
Failed: 0 test(s), Passed: 3 test(s), Total: 3 test(s)
Name: TestAbbreviations
Failed: 0 test(s), Passed: 1 test(s), Total: 1 test(s)
Name: TestAddressBreakpoints
Failed: 0 test(s), Passed: 3 test(s), Total: 3 test(s)
Name: TestAnonymous
Failed: 0 test(s), Passed: 21 test(s), Total: 21 test(s)
Name: TestApropos
Failed: 0 test(s), Passed: 1 test(s), Total: 1 test(s)
Name: TestAproposWithProcess
Failed: 0 test(s), Passed: 3 test(s), Total: 3 test(s)
Name: TestArrayTypes
Failed: 0 test(s), Passed: 6 test(s), Total: 6 test(s)
Name: TestAsanSwift
Failed: 0 test(s), Passed: 0 test(s), Total: 3 test(s)
Name: TestAttachDenied
Failed: 0 test(s), Passed: 3 test(s), Total: 3 test(s)
Name: TestAttachResume
Failed: 0 test(s), Passed: 3 test(s), Total: 3 test(s)
Name: TestAvoidBreakpointInDelaySlot
Failed: 0 test(s), Passed: 0 test(s), Total: 3 test(s)
Name: TestBSDArchives
Failed: 0 test(s), Passed: 3 test(s), Total: 3 test(s)
Name: TestBackticksWithoutATarget
Failed: 0 test(s), Passed: 1 test(s), Total: 1 test(s)
Name: TestBacktraceAll
Failed: 0 test(s), Passed: 3 test(s), Total: 3 test(s)
Name: TestBadAddressBreakpoints
Failed: 0 test(s), Passed: 3 test(s), Total: 3 test(s)
Name: TestBatchMode
Failed: 0 test(s), Passed: 9 test(s), Total: 9 test(s)
Name: TestBitfields
Failed: 0 test(s), Passed: 6 test(s), Total: 6 test(s)
Name: TestBreakAfterJoin
Failed: 0 test(s), Passed: 3 test(s), Total: 3 test(s)
Name: TestBreakpointAPI
Failed: 0 test(s), Passed: 3 test(s), Total: 3 test(s)
Name: TestBreakpointCaseSensitivity
Failed: 0 test(s), Passed: 3 test(s), Total: 6 test(s)
Name: TestBreakpointCommand
Failed: 0 test(s), Passed: 3 test(s), Total: 3 test(s)
Name: TestBreakpointCommandsFromPython
Failed: 0 test(s), Passed: 3 test(s), Total: 3 test(s)
Name: TestBreakpointConditions
Failed: 0 test(s), Passed: 12 test(s), Total: 12 test(s)
Name: TestBreakpointIDs
Failed: 0 test(s), Passed: 3 test(s), Total: 3 test(s)
Name: TestBreakpointIgnoreCount
Failed: 0 test(s), Passed: 6 test(s), Total: 6 test(s)
Name: TestBreakpointLanguage
Failed: 0 test(s), Passed: 6 test(s), Total: 6 test(s)
Name: TestBreakpointLocations
Failed: 0 test(s), Passed: 3 test(s), Total: 3 test(s)
Name: TestBreakpointOptions
Failed: 0 test(s), Passed: 3 test(s), Total: 3 test(s)
Name: TestBreakpointSetRestart
Failed: 0 test(s), Passed: 3 test(s), Total: 3 test(s)
Name: TestBreakpointsWithNoTargets
Failed: 0 test(s), Passed: 3 test(s), Total: 3 test(s)
Name: TestBuiltinTrap
Failed: 0 test(s), Passed: 3 test(s), Total: 3 test(s)
Name: TestBulkyEnumsVariables
Failed: 0 test(s), Passed: 3 test(s), Total: 3 test(s)
Name: TestCInlines
Failed: 0 test(s), Passed: 3 test(s), Total: 3 test(s)
Name: TestCModules
Failed: 0 test(s), Passed: 3 test(s), Total: 3 test(s)
Name: TestCPP11EnumTypes
Failed: 0 test(s), Passed: 24 test(s), Total: 24 test(s)
Name: TestCPPAuto
Failed: 0 test(s), Passed: 3 test(s), Total: 3 test(s)
Name: TestCPPBool
Failed: 0 test(s), Passed: 3 test(s), Total: 3 test(s)
Name: TestCPPBreakpointCommands
Failed: 0 test(s), Passed: 3 test(s), Total: 3 test(s)
Name: TestCPPBreakpointLocations
Failed: 0 test(s), Passed: 6 test(s), Total: 6 test(s)
Name: TestCPPExceptionBreakpoint
Failed: 0 test(s), Passed: 3 test(s), Total: 3 test(s)
Name: TestCPPExceptionBreakpoints
Failed: 0 test(s), Passed: 3 test(s), Total: 3 test(s)
Name: TestCPPStaticMembers
Failed: 0 test(s), Passed: 3 test(s), Total: 3 test(s)
Name: TestCPPStaticMethods
Failed: 0 test(s), Passed: 3 test(s), Total: 3 test(s)
Name: TestCPPThis
Failed: 0 test(s), Passed: 3 test(s), Total: 3 test(s)
Name: TestCStrings
Failed: 0 test(s), Passed: 3 test(s), Total: 3 test(s)
Name: TestCallCPPFunction
Failed: 0 test(s), Passed: 3 test(s), Total: 3 test(s)
Name: TestCallStdStringFunction
Failed: 0 test(s), Passed: 3 test(s), Total: 3 test(s)
Name: TestCallStopAndContinue
Failed: 0 test(s), Passed: 3 test(s), Total: 3 test(s)
Name: TestCallThatRestarts
Failed: 0 test(s), Passed: 3 test(s), Total: 3 test(s)
Name: TestCallUserAnonTypedef
Failed: 0 test(s), Passed: 3 test(s), Total: 3 test(s)
Name: TestCallUserDefinedFunction
Failed: 0 test(s), Passed: 3 test(s), Total: 3 test(s)
Name: TestCallWithTimeout
Failed: 0 test(s), Passed: 3 test(s), Total: 3 test(s)
Name: TestChangeProcessGroup
Failed: 0 test(s), Passed: 3 test(s), Total: 3 test(s)
Name: TestChangeValueAPI
Failed: 0 test(s), Passed: 3 test(s), Total: 3 test(s)
Name: TestChar1632T
Failed: 0 test(s), Passed: 3 test(s), Total: 3 test(s)
Name: TestClassTypes
Failed: 0 test(s), Passed: 12 test(s), Total: 12 test(s)
Name: TestClassTypesDisassembly
Failed: 0 test(s), Passed: 6 test(s), Total: 6 test(s)
Name: TestCommandHistory
Failed: 0 test(s), Passed: 1 test(s), Total: 1 test(s)
Name: TestCommandInterpreterAPI
Failed: 0 test(s), Passed: 3 test(s), Total: 3 test(s)
Name: TestCommandRegex
Failed: 0 test(s), Passed: 1 test(s), Total: 1 test(s)
Name: TestCommandScript
Failed: 0 test(s), Passed: 3 test(s), Total: 3 test(s)
Name: TestCommandScriptAlias
Failed: 0 test(s), Passed: 3 test(s), Total: 3 test(s)
Name: TestCommandScriptImmediateOutput
Failed: 0 test(s), Passed: 2 test(s), Total: 2 test(s)
Name: TestCommandSource
Failed: 0 test(s), Passed: 1 test(s), Total: 1 test(s)
Name: TestCommonShortSpellings
Failed: 0 test(s), Passed: 1 test(s), Total: 1 test(s)
Name: TestCompDirSymLink
Failed: 0 test(s), Passed: 9 test(s), Total: 9 test(s)
Name: TestCompletion
Failed: 0 test(s), Passed: 34 test(s), Total: 34 test(s)
Name: TestConcurrentBreakpointDelayBreakpointOneSignal
Failed: 0 test(s), Passed: 1 test(s), Total: 1 test(s)
Name: TestConcurrentBreakpointOneDelayBreakpointThreads
Failed: 0 test(s), Passed: 1 test(s), Total: 1 test(s)
Name: TestConcurrentBreakpointsDelayedBreakpointOneWatchpoint
Failed: 0 test(s), Passed: 1 test(s), Total: 1 test(s)
Name: TestConcurrentCrashWithBreak
Failed: 0 test(s), Passed: 1 test(s), Total: 1 test(s)
Name: TestConcurrentCrashWithSignal
Failed: 0 test(s), Passed: 1 test(s), Total: 1 test(s)
Name: TestConcurrentCrashWithWatchpoint
Failed: 0 test(s), Passed: 1 test(s), Total: 1 test(s)
Name: TestConcurrentCrashWithWatchpointBreakpointSignal
Failed: 0 test(s), Passed: 1 test(s), Total: 1 test(s)
Name: TestConcurrentDelaySignalBreak
Failed: 0 test(s), Passed: 1 test(s), Total: 1 test(s)
Name: TestConcurrentDelaySignalWatch
Failed: 0 test(s), Passed: 1 test(s), Total: 1 test(s)
Name: TestConcurrentDelayWatchBreak
Failed: 0 test(s), Passed: 1 test(s), Total: 1 test(s)
Name: TestConcurrentDelayedCrashWithBreakpointSignal
Failed: 0 test(s), Passed: 1 test(s), Total: 1 test(s)
Name: TestConcurrentDelayedCrashWithBreakpointWatchpoint
Failed: 0 test(s), Passed: 1 test(s), Total: 1 test(s)
Name: TestConcurrentNWatchNBreak
Failed: 0 test(s), Passed: 1 test(s), Total: 1 test(s)
Name: TestConcurrentSignalBreak
Failed: 0 test(s), Passed: 1 test(s), Total: 1 test(s)
Name: TestConcurrentSignalDelayBreak
Failed: 0 test(s), Passed: 1 test(s), Total: 1 test(s)
Name: TestConcurrentSignalDelayWatch
Failed: 0 test(s), Passed: 1 test(s), Total: 1 test(s)
Name: TestConcurrentSignalNWatchNBreak
Failed: 0 test(s), Passed: 1 test(s), Total: 1 test(s)
Name: TestConcurrentSignalWatch
Failed: 0 test(s), Passed: 1 test(s), Total: 1 test(s)
Name: TestConcurrentSignalWatchBreak
Failed: 0 test(s), Passed: 1 test(s), Total: 1 test(s)
Name: TestConcurrentTwoBreakpointThreads
Failed: 0 test(s), Passed: 1 test(s), Total: 1 test(s)
Name: TestConcurrentTwoBreakpointsOneDelaySignal
Failed: 0 test(s), Passed: 1 test(s), Total: 1 test(s)
Name: TestConcurrentTwoBreakpointsOneSignal
Failed: 0 test(s), Passed: 1 test(s), Total: 1 test(s)
Name: TestConcurrentTwoBreakpointsOneWatchpoint
Failed: 0 test(s), Passed: 1 test(s), Total: 1 test(s)
Name: TestConcurrentTwoWatchpointThreads
Failed: 0 test(s), Passed: 1 test(s), Total: 1 test(s)
Name: TestConcurrentTwoWatchpointsOneBreakpoint
Failed: 0 test(s), Passed: 1 test(s), Total: 1 test(s)
Name: TestConcurrentTwoWatchpointsOneDelayBreakpoint
Failed: 0 test(s), Passed: 1 test(s), Total: 1 test(s)
Name: TestConcurrentTwoWatchpointsOneSignal
Failed: 0 test(s), Passed: 1 test(s), Total: 1 test(s)
Name: TestConcurrentWatchBreak
Failed: 0 test(s), Passed: 1 test(s), Total: 1 test(s)
Name: TestConcurrentWatchBreakDelay
Failed: 0 test(s), Passed: 1 test(s), Total: 1 test(s)
Name: TestConcurrentWatchpointDelayWatchpointOneBreakpoint
Failed: 0 test(s), Passed: 1 test(s), Total: 1 test(s)
Name: TestConcurrentWatchpointWithDelayWatchpointThreads
Failed: 0 test(s), Passed: 1 test(s), Total: 1 test(s)
Name: TestConditionalBreak
Failed: 0 test(s), Passed: 6 test(s), Total: 6 test(s)
Name: TestConsecutiveBreakpoints
Failed: 0 test(s), Passed: 3 test(s), Total: 3 test(s)
Name: TestConstVariables
Failed: 0 test(s), Passed: 3 test(s), Total: 3 test(s)
Name: TestConvenienceVariables
Failed: 0 test(s), Passed: 3 test(s), Total: 3 test(s)
Name: TestCppChainedCalls
Failed: 0 test(s), Passed: 3 test(s), Total: 3 test(s)
Name: TestCppGlobalOperators
Failed: 0 test(s), Passed: 6 test(s), Total: 6 test(s)
Name: TestCppIncompleteTypes
Failed: 0 test(s), Passed: 6 test(s), Total: 6 test(s)
Name: TestCppNsImport
Failed: 0 test(s), Passed: 3 test(s), Total: 3 test(s)
Name: TestCppScope
Failed: 0 test(s), Passed: 3 test(s), Total: 3 test(s)
Name: TestCppValueCast
Failed: 0 test(s), Passed: 6 test(s), Total: 6 test(s)
Name: TestCrashDuringStep
Failed: 0 test(s), Passed: 3 test(s), Total: 3 test(s)
Name: TestCreateAfterAttach
Failed: 0 test(s), Passed: 6 test(s), Total: 6 test(s)
Name: TestCreateDuringInstructionStep
Failed: 0 test(s), Passed: 3 test(s), Total: 3 test(s)
Name: TestCreateDuringStep
Failed: 0 test(s), Passed: 9 test(s), Total: 9 test(s)
Name: TestCxxWCharT
Failed: 0 test(s), Passed: 3 test(s), Total: 3 test(s)
Name: TestDataFormatterAdv
Failed: 0 test(s), Passed: 3 test(s), Total: 3 test(s)
Name: TestDataFormatterCategories
Failed: 0 test(s), Passed: 3 test(s), Total: 3 test(s)
Name: TestDataFormatterCpp
Failed: 0 test(s), Passed: 3 test(s), Total: 3 test(s)
Name: TestDataFormatterDisabling
Failed: 0 test(s), Passed: 3 test(s), Total: 3 test(s)
Name: TestDataFormatterEnumFormat
Failed: 0 test(s), Passed: 3 test(s), Total: 3 test(s)
Name: TestDataFormatterGlobals
Failed: 0 test(s), Passed: 3 test(s), Total: 3 test(s)
Name: TestDataFormatterHexCaps
Failed: 0 test(s), Passed: 3 test(s), Total: 3 test(s)
Name: TestDataFormatterLanguageCategoryUpdates
Failed: 0 test(s), Passed: 3 test(s), Total: 3 test(s)
Name: TestDataFormatterLibccIterator
Failed: 0 test(s), Passed: 0 test(s), Total: 3 test(s)
Name: TestDataFormatterLibccMap
Failed: 0 test(s), Passed: 0 test(s), Total: 3 test(s)
Name: TestDataFormatterLibccMultiMap
Failed: 0 test(s), Passed: 0 test(s), Total: 3 test(s)
Name: TestDataFormatterLibcxxList
Failed: 0 test(s), Passed: 0 test(s), Total: 3 test(s)
Name: TestDataFormatterLibcxxListLoop
Failed: 0 test(s), Passed: 0 test(s), Total: 3 test(s)
Name: TestDataFormatterLibcxxMultiSet
Failed: 0 test(s), Passed: 0 test(s), Total: 3 test(s)
Name: TestDataFormatterLibcxxSet
Failed: 0 test(s), Passed: 3 test(s), Total: 3 test(s)
Name: TestDataFormatterLibcxxString
Failed: 0 test(s), Passed: 0 test(s), Total: 3 test(s)
Name: TestDataFormatterLibcxxVBool
Failed: 0 test(s), Passed: 0 test(s), Total: 3 test(s)
Name: TestDataFormatterLibcxxVector
Failed: 0 test(s), Passed: 0 test(s), Total: 3 test(s)
Name: TestDataFormatterNamedSummaries
Failed: 0 test(s), Passed: 3 test(s), Total: 3 test(s)
Name: TestDataFormatterPythonSynth
Failed: 0 test(s), Passed: 6 test(s), Total: 6 test(s)
Name: TestDataFormatterRefPtrRecursion
Failed: 0 test(s), Passed: 3 test(s), Total: 3 test(s)
Name: TestDataFormatterScript
Failed: 0 test(s), Passed: 3 test(s), Total: 3 test(s)
Name: TestDataFormatterSkipSummary
Failed: 0 test(s), Passed: 3 test(s), Total: 3 test(s)
Name: TestDataFormatterSmartArray
Failed: 0 test(s), Passed: 3 test(s), Total: 3 test(s)
Name: TestDataFormatterStdIterator
Failed: 0 test(s), Passed: 3 test(s), Total: 3 test(s)
Name: TestDataFormatterStdList
Failed: 0 test(s), Passed: 3 test(s), Total: 3 test(s)
Name: TestDataFormatterStdMap
Failed: 0 test(s), Passed: 3 test(s), Total: 3 test(s)
Name: TestDataFormatterStdSmartPtr
Failed: 0 test(s), Passed: 3 test(s), Total: 3 test(s)
Name: TestDataFormatterStdString
Failed: 0 test(s), Passed: 3 test(s), Total: 3 test(s)
Name: TestDataFormatterStdVBool
Failed: 0 test(s), Passed: 3 test(s), Total: 3 test(s)
Name: TestDataFormatterStdVector
Failed: 0 test(s), Passed: 3 test(s), Total: 3 test(s)
Name: TestDataFormatterSynth
Failed: 0 test(s), Passed: 3 test(s), Total: 3 test(s)
Name: TestDataFormatterSynthType
Failed: 0 test(s), Passed: 3 test(s), Total: 3 test(s)
Name: TestDataFormatterSynthVal
Failed: 0 test(s), Passed: 3 test(s), Total: 3 test(s)
Name: TestDataFormatterUnordered
Failed: 0 test(s), Passed: 0 test(s), Total: 3 test(s)
Name: TestDataFormatterVarScriptFormatting
Failed: 0 test(s), Passed: 3 test(s), Total: 3 test(s)
Name: TestDeadStrip
Failed: 0 test(s), Passed: 3 test(s), Total: 3 test(s)
Name: TestDebugBreak
Failed: 0 test(s), Passed: 1 test(s), Total: 1 test(s)
Name: TestDebuggerAPI
Failed: 0 test(s), Passed: 4 test(s), Total: 4 test(s)
Name: TestDefaultCacheLineSize
Failed: 0 test(s), Passed: 0 test(s), Total: 3 test(s)
Name: TestDefaultConstructorForAPIObjects
Failed: 0 test(s), Passed: 35 test(s), Total: 35 test(s)
Name: TestDefiningOverloadedFunctions
Failed: 0 test(s), Passed: 3 test(s), Total: 3 test(s)
Name: TestDiamond
Failed: 0 test(s), Passed: 3 test(s), Total: 3 test(s)
Name: TestDisasmAPI
Failed: 0 test(s), Passed: 3 test(s), Total: 3 test(s)
Name: TestDisassembleBreakpoint
Failed: 0 test(s), Passed: 3 test(s), Total: 3 test(s)
Name: TestDisassembleRawData
Failed: 0 test(s), Passed: 1 test(s), Total: 1 test(s)
Name: TestDisassemble_VST1_64
Failed: 0 test(s), Passed: 0 test(s), Total: 1 test(s)
Name: TestDynamicValue
Failed: 0 test(s), Passed: 3 test(s), Total: 3 test(s)
Name: TestDynamicValueChildCount
Failed: 0 test(s), Passed: 3 test(s), Total: 3 test(s)
Name: TestEhFrameUnwind
Failed: 0 test(s), Passed: 3 test(s), Total: 3 test(s)
Name: TestEmulations
Failed: 0 test(s), Passed: 2 test(s), Total: 2 test(s)
Name: TestEnumTypes
Failed: 0 test(s), Passed: 3 test(s), Total: 3 test(s)
Name: TestEnumVariables
Failed: 0 test(s), Passed: 3 test(s), Total: 3 test(s)
Name: TestEqualityOperators
Failed: 0 test(s), Passed: 9 test(s), Total: 9 test(s)
Name: TestEvents
Failed: 0 test(s), Passed: 0 test(s), Total: 9 test(s)
Name: TestExitDuringBreak
Failed: 0 test(s), Passed: 3 test(s), Total: 3 test(s)
Name: TestExitDuringStep
Failed: 0 test(s), Passed: 9 test(s), Total: 9 test(s)
Name: TestExprDoesntBlock
Failed: 0 test(s), Passed: 3 test(s), Total: 3 test(s)
Name: TestExprHelpExamples
Failed: 0 test(s), Passed: 3 test(s), Total: 3 test(s)
Name: TestExprInProtocolExtension
Failed: 0 test(s), Passed: 3 test(s), Total: 3 test(s)
Name: TestExprOptions
Failed: 0 test(s), Passed: 3 test(s), Total: 3 test(s)
Name: TestExpressionAccessControl
Failed: 0 test(s), Passed: 3 test(s), Total: 3 test(s)
Name: TestExpressionErrorBreakpoint
Failed: 0 test(s), Passed: 12 test(s), Total: 12 test(s)
Name: TestExpressionErrors
Failed: 0 test(s), Passed: 3 test(s), Total: 3 test(s)
Name: TestExpressionInSyscall
Failed: 0 test(s), Passed: 3 test(s), Total: 3 test(s)
Name: TestExpressionScopes
Failed: 0 test(s), Passed: 3 test(s), Total: 3 test(s)
Name: TestExprs
Failed: 0 test(s), Passed: 12 test(s), Total: 12 test(s)
Name: TestExprs2
Failed: 0 test(s), Passed: 3 test(s), Total: 3 test(s)
Name: TestExprsChar
Failed: 0 test(s), Passed: 9 test(s), Total: 9 test(s)
Name: TestFdLeak
Failed: 0 test(s), Passed: 3 test(s), Total: 3 test(s)
Name: TestFilePrivate
Failed: 0 test(s), Passed: 3 test(s), Total: 3 test(s)
Name: TestFloatTypes
Failed: 0 test(s), Passed: 6 test(s), Total: 6 test(s)
Name: TestFloatTypesExpr
Failed: 0 test(s), Passed: 6 test(s), Total: 6 test(s)
Name: TestFormatPropagation
Failed: 0 test(s), Passed: 3 test(s), Total: 3 test(s)
Name: TestFormats
Failed: 0 test(s), Passed: 3 test(s), Total: 3 test(s)
Name: TestFormatters
Failed: 0 test(s), Passed: 3 test(s), Total: 3 test(s)
Name: TestFormattersSBAPI
Failed: 0 test(s), Passed: 6 test(s), Total: 6 test(s)
Name: TestForwardDeclaration
Failed: 0 test(s), Passed: 3 test(s), Total: 3 test(s)
Name: TestFrameFormatSmallStruct
Failed: 0 test(s), Passed: 3 test(s), Total: 3 test(s)
Name: TestFrameUtils
Failed: 0 test(s), Passed: 3 test(s), Total: 3 test(s)
Name: TestFrameVariableAnonymousUnions
Failed: 0 test(s), Passed: 3 test(s), Total: 3 test(s)
Name: TestFrames
Failed: 0 test(s), Passed: 9 test(s), Total: 9 test(s)
Name: TestFunctionTypes
Failed: 0 test(s), Passed: 6 test(s), Total: 6 test(s)
Name: TestFunctionVariables
Failed: 0 test(s), Passed: 3 test(s), Total: 3 test(s)
Name: TestGdbRemoteAbort
Failed: 0 test(s), Passed: 1 test(s), Total: 1 test(s)
Name: TestGdbRemoteAttach
Failed: 0 test(s), Passed: 1 test(s), Total: 1 test(s)
Name: TestGdbRemoteAuxvSupport
Failed: 0 test(s), Passed: 4 test(s), Total: 4 test(s)
Name: TestGdbRemoteExitCode
Failed: 0 test(s), Passed: 3 test(s), Total: 3 test(s)
Name: TestGdbRemoteExpeditedRegisters
Failed: 0 test(s), Passed: 5 test(s), Total: 5 test(s)
Name: TestGdbRemoteHostInfo
Failed: 0 test(s), Passed: 1 test(s), Total: 1 test(s)
Name: TestGdbRemoteKill
Failed: 0 test(s), Passed: 1 test(s), Total: 1 test(s)
Name: TestGdbRemoteModuleInfo
Failed: 0 test(s), Passed: 1 test(s), Total: 1 test(s)
Name: TestGdbRemoteProcessInfo
Failed: 0 test(s), Passed: 5 test(s), Total: 5 test(s)
Name: TestGdbRemoteRegisterState
Failed: 0 test(s), Passed: 2 test(s), Total: 2 test(s)
Name: TestGdbRemoteSegFault
Failed: 0 test(s), Passed: 1 test(s), Total: 1 test(s)
Name: TestGdbRemoteSingleStep
Failed: 0 test(s), Passed: 1 test(s), Total: 1 test(s)
Name: TestGdbRemoteThreadsInStopReply
Failed: 0 test(s), Passed: 4 test(s), Total: 4 test(s)
Name: TestGdbRemote_qThreadStopInfo
Failed: 0 test(s), Passed: 3 test(s), Total: 4 test(s)
Name: TestGdbRemote_vCont
Failed: 0 test(s), Passed: 6 test(s), Total: 6 test(s)
Name: TestGlobalVariables
Failed: 0 test(s), Passed: 3 test(s), Total: 3 test(s)
Name: TestGoFormatters
Failed: 0 test(s), Passed: 0 test(s), Total: 1 test(s)
Name: TestGoroutines
Failed: 0 test(s), Passed: 0 test(s), Total: 1 test(s)
Name: TestHandleSegv
Failed: 0 test(s), Passed: 3 test(s), Total: 3 test(s)
Name: TestHelloWorld
Failed: 0 test(s), Passed: 9 test(s), Total: 9 test(s)
Name: TestHelp
Failed: 0 test(s), Passed: 18 test(s), Total: 18 test(s)
Name: TestIRInterpreter
Failed: 0 test(s), Passed: 3 test(s), Total: 3 test(s)
Name: TestIRInterpreterPHINodes
Failed: 0 test(s), Passed: 3 test(s), Total: 3 test(s)
Name: TestImageListMultiArchitecture
Failed: 0 test(s), Passed: 1 test(s), Total: 1 test(s)
Name: TestImport
Failed: 0 test(s), Passed: 1 test(s), Total: 1 test(s)
Name: TestInOutVariables
Failed: 0 test(s), Passed: 3 test(s), Total: 3 test(s)
Name: TestIndexVariable
Failed: 0 test(s), Passed: 3 test(s), Total: 3 test(s)
Name: TestIndirectEnumVariables
Failed: 0 test(s), Passed: 0 test(s), Total: 3 test(s)
Name: TestInferiorAssert
Failed: 0 test(s), Passed: 18 test(s), Total: 18 test(s)
Name: TestInferiorChanged
Failed: 0 test(s), Passed: 1 test(s), Total: 1 test(s)
Name: TestInferiorCrashing
Failed: 0 test(s), Passed: 18 test(s), Total: 21 test(s)
Name: TestInitializerList
Failed: 0 test(s), Passed: 3 test(s), Total: 3 test(s)
Name: TestInlineStepping
Failed: 0 test(s), Passed: 0 test(s), Total: 9 test(s)
Name: TestInlinedBreakpoints
Failed: 0 test(s), Passed: 3 test(s), Total: 3 test(s)
Name: TestInlinedFrame
Failed: 0 test(s), Passed: 3 test(s), Total: 3 test(s)
Name: TestInlines
Failed: 0 test(s), Passed: 3 test(s), Total: 3 test(s)
Name: TestIntegerTypes
Failed: 0 test(s), Passed: 30 test(s), Total: 30 test(s)
Name: TestIntegerTypesExpr
Failed: 0 test(s), Passed: 30 test(s), Total: 30 test(s)
Name: TestJITLoaderGDB
Failed: 0 test(s), Passed: 0 test(s), Total: 3 test(s)
Name: TestLLDBIterator
Failed: 0 test(s), Passed: 9 test(s), Total: 9 test(s)
Name: TestLLVM
Failed: 0 test(s), Passed: 1 test(s), Total: 1 test(s)
Name: TestLaunchWithShellExpand
Failed: 0 test(s), Passed: 3 test(s), Total: 3 test(s)
Name: TestLazyReverse
Failed: 0 test(s), Passed: 1 test(s), Total: 1 test(s)
Name: TestLibCxxAtomic
Failed: 0 test(s), Passed: 0 test(s), Total: 3 test(s)
Name: TestLibCxxFunction
Failed: 0 test(s), Passed: 0 test(s), Total: 3 test(s)
Name: TestLinuxCore
Failed: 0 test(s), Passed: 4 test(s), Total: 5 test(s)
Name: TestListener
Failed: 0 test(s), Passed: 3 test(s), Total: 3 test(s)
Name: TestLldbGdbServer
Failed: 0 test(s), Passed: 33 test(s), Total: 33 test(s)
Name: TestLoadUnload
Failed: 0 test(s), Passed: 18 test(s), Total: 18 test(s)
Name: TestLogging
Failed: 0 test(s), Passed: 5 test(s), Total: 5 test(s)
Name: TestLongjmp
Failed: 0 test(s), Passed: 9 test(s), Total: 9 test(s)
Name: TestMPXRegisters
Failed: 0 test(s), Passed: 0 test(s), Total: 3 test(s)
Name: TestMacros
Failed: 0 test(s), Passed: 3 test(s), Total: 3 test(s)
Name: TestMembersAndLocalsWithSameName
Failed: 0 test(s), Passed: 6 test(s), Total: 6 test(s)
Name: TestMemoryCache
Failed: 0 test(s), Passed: 3 test(s), Total: 3 test(s)
Name: TestMemoryFind
Failed: 0 test(s), Passed: 3 test(s), Total: 3 test(s)
Name: TestMemoryHistory
Failed: 0 test(s), Passed: 3 test(s), Total: 3 test(s)
Name: TestMemoryRead
Failed: 0 test(s), Passed: 3 test(s), Total: 3 test(s)
Name: TestMiBreak
Failed: 0 test(s), Passed: 0 test(s), Total: 7 test(s)
Name: TestMiCliSupport
Failed: 0 test(s), Passed: 0 test(s), Total: 8 test(s)
Name: TestMiData
Failed: 0 test(s), Passed: 0 test(s), Total: 7 test(s)
Name: TestMiExec
Failed: 0 test(s), Passed: 0 test(s), Total: 9 test(s)
Name: TestMiExit
Failed: 0 test(s), Passed: 0 test(s), Total: 3 test(s)
Name: TestMiFile
Failed: 0 test(s), Passed: 0 test(s), Total: 4 test(s)
Name: TestMiGdbSetShow
Failed: 0 test(s), Passed: 0 test(s), Total: 8 test(s)
Name: TestMiGdbSetShowPrint
Failed: 0 test(s), Passed: 0 test(s), Total: 3 test(s)
Name: TestMiInterpreterExec
Failed: 0 test(s), Passed: 0 test(s), Total: 8 test(s)
Name: TestMiLibraryLoaded
Failed: 0 test(s), Passed: 0 test(s), Total: 1 test(s)
Name: TestMiPrompt
Failed: 0 test(s), Passed: 0 test(s), Total: 1 test(s)
Name: TestMiSignal
Failed: 0 test(s), Passed: 0 test(s), Total: 5 test(s)
Name: TestMiStack
Failed: 0 test(s), Passed: 0 test(s), Total: 7 test(s)
Name: TestMiStartupOptions
Failed: 0 test(s), Passed: 0 test(s), Total: 10 test(s)
Name: TestMiSymbol
Failed: 0 test(s), Passed: 0 test(s), Total: 1 test(s)
Name: TestMiSyntax
Failed: 0 test(s), Passed: 0 test(s), Total: 3 test(s)
Name: TestMiTarget
Failed: 0 test(s), Passed: 0 test(s), Total: 3 test(s)
Name: TestMiThreadInfo
Failed: 0 test(s), Passed: 0 test(s), Total: 1 test(s)
Name: TestMiVar
Failed: 0 test(s), Passed: 0 test(s), Total: 6 test(s)
Name: TestMiniDump
Failed: 0 test(s), Passed: 0 test(s), Total: 9 test(s)
Name: TestMixedLanguages
Failed: 0 test(s), Passed: 3 test(s), Total: 3 test(s)
Name: TestModuleAndSection
Failed: 0 test(s), Passed: 9 test(s), Total: 9 test(s)
Name: TestMultilineExpressions
Failed: 0 test(s), Passed: 3 test(s), Total: 3 test(s)
Name: TestMultipleBreakpoints
Failed: 0 test(s), Passed: 3 test(s), Total: 3 test(s)
Name: TestMultipleDebuggers
Failed: 0 test(s), Passed: 3 test(s), Total: 3 test(s)
Name: TestMultipleDebuggersCommands
Failed: 0 test(s), Passed: 1 test(s), Total: 1 test(s)
Name: TestMultithreaded
Failed: 0 test(s), Passed: 0 test(s), Total: 12 test(s)
Name: TestMyFirstWatchpoint
Failed: 0 test(s), Passed: 3 test(s), Total: 3 test(s)
Name: TestNamespace
Failed: 0 test(s), Passed: 12 test(s), Total: 12 test(s)
Name: TestNamespaceDefinitions
Failed: 0 test(s), Passed: 3 test(s), Total: 3 test(s)
Name: TestNamespaceLookup
Failed: 0 test(s), Passed: 24 test(s), Total: 24 test(s)
Name: TestNestedAlias
Failed: 0 test(s), Passed: 3 test(s), Total: 3 test(s)
Name: TestNestedPersistentTypes
Failed: 0 test(s), Passed: 3 test(s), Total: 3 test(s)
Name: TestNoSuchArch
Failed: 0 test(s), Passed: 3 test(s), Total: 3 test(s)
Name: TestNoreturnUnwind
Failed: 0 test(s), Passed: 3 test(s), Total: 3 test(s)
Name: TestNumThreads
Failed: 0 test(s), Passed: 3 test(s), Total: 3 test(s)
Name: TestOverloadedFunctions
Failed: 0 test(s), Passed: 3 test(s), Total: 3 test(s)
Name: TestPOUnwrapping
Failed: 0 test(s), Passed: 1 test(s), Total: 1 test(s)
Name: TestPaths
Failed: 0 test(s), Passed: 2 test(s), Total: 3 test(s)
Name: TestPersistentPtrUpdate
Failed: 0 test(s), Passed: 3 test(s), Total: 3 test(s)
Name: TestPersistentTypes
Failed: 0 test(s), Passed: 3 test(s), Total: 3 test(s)
Name: TestPersistentVariables
Failed: 0 test(s), Passed: 3 test(s), Total: 3 test(s)
Name: TestPlatformCommand
Failed: 0 test(s), Passed: 7 test(s), Total: 8 test(s)
Name: TestPlatformProcessConnect
Failed: 0 test(s), Passed: 0 test(s), Total: 1 test(s)
Name: TestPluginCommands
Failed: 0 test(s), Passed: 1 test(s), Total: 1 test(s)
Name: TestPrintArray
Failed: 0 test(s), Passed: 3 test(s), Total: 3 test(s)
Name: TestPrintStackTraces
Failed: 0 test(s), Passed: 3 test(s), Total: 3 test(s)
Name: TestPrintfAfterUp
Failed: 0 test(s), Passed: 3 test(s), Total: 3 test(s)
Name: TestProcessAPI
Failed: 0 test(s), Passed: 15 test(s), Total: 15 test(s)
Name: TestProcessAttach
Failed: 0 test(s), Passed: 6 test(s), Total: 6 test(s)
Name: TestProcessIO
Failed: 0 test(s), Passed: 15 test(s), Total: 15 test(s)
Name: TestProcessLaunch
Failed: 0 test(s), Passed: 9 test(s), Total: 9 test(s)
Name: TestProcessSaveCore
Failed: 0 test(s), Passed: 0 test(s), Total: 6 test(s)
Name: TestPtrRef2Typedef
Failed: 0 test(s), Passed: 3 test(s), Total: 3 test(s)
Name: TestPtrToArrayFormatting
Failed: 0 test(s), Passed: 3 test(s), Total: 3 test(s)
Name: TestPublicAPIHeaders
Failed: 0 test(s), Passed: 0 test(s), Total: 3 test(s)
Name: TestPyObjSynthProvider
Failed: 0 test(s), Passed: 1 test(s), Total: 1 test(s)
Name: TestPythonOSPlugin
Failed: 0 test(s), Passed: 3 test(s), Total: 3 test(s)
Name: TestQuoting
Failed: 0 test(s), Passed: 11 test(s), Total: 11 test(s)
Name: TestREPLClasses
Failed: 0 test(s), Passed: 1 test(s), Total: 1 test(s)
Name: TestREPLRecursiveClass
Failed: 0 test(s), Passed: 1 test(s), Total: 1 test(s)
Name: TestREPLStructs
Failed: 0 test(s), Passed: 1 test(s), Total: 1 test(s)
Name: TestRaise
Failed: 0 test(s), Passed: 9 test(s), Total: 9 test(s)
Name: TestRdar12586188
Failed: 0 test(s), Passed: 1 test(s), Total: 1 test(s)
Name: TestRecursiveInferior
Failed: 0 test(s), Passed: 18 test(s), Total: 21 test(s)
Name: TestRecursiveTypes
Failed: 0 test(s), Passed: 6 test(s), Total: 6 test(s)
Name: TestRegexpBreakCommand
Failed: 0 test(s), Passed: 3 test(s), Total: 3 test(s)
Name: TestRegisterVariables
Failed: 0 test(s), Passed: 3 test(s), Total: 3 test(s)
Name: TestRegisters
Failed: 0 test(s), Passed: 21 test(s), Total: 21 test(s)
Name: TestRegistersIterator
Failed: 0 test(s), Passed: 3 test(s), Total: 3 test(s)
Name: TestReportData
Failed: 0 test(s), Passed: 3 test(s), Total: 3 test(s)
Name: TestRerun
Failed: 0 test(s), Passed: 3 test(s), Total: 3 test(s)
Name: TestReturnValue
Failed: 0 test(s), Passed: 3 test(s), Total: 3 test(s)
Name: TestRvalueReferences
Failed: 0 test(s), Passed: 3 test(s), Total: 3 test(s)
Name: TestSBData
Failed: 0 test(s), Passed: 3 test(s), Total: 3 test(s)
Name: TestSBFrameFindValue
Failed: 0 test(s), Passed: 3 test(s), Total: 3 test(s)
Name: TestSBValuePersist
Failed: 0 test(s), Passed: 3 test(s), Total: 3 test(s)
Name: TestSBValueUpdates
Failed: 0 test(s), Passed: 3 test(s), Total: 3 test(s)
Name: TestSTL
Failed: 0 test(s), Passed: 6 test(s), Total: 6 test(s)
Name: TestSTTYBeforeAndAfter
Failed: 0 test(s), Passed: 0 test(s), Total: 1 test(s)
Name: TestSaveJITObjects
Failed: 0 test(s), Passed: 3 test(s), Total: 3 test(s)
Name: TestSectionAPI
Failed: 0 test(s), Passed: 3 test(s), Total: 3 test(s)
Name: TestSendSignal
Failed: 0 test(s), Passed: 3 test(s), Total: 3 test(s)
Name: TestSequenceFunctions
Failed: 0 test(s), Passed: 3 test(s), Total: 3 test(s)
Name: TestSetValues
Failed: 0 test(s), Passed: 3 test(s), Total: 3 test(s)
Name: TestSetWatchlocation
Failed: 0 test(s), Passed: 3 test(s), Total: 3 test(s)
Name: TestSetWatchpoint
Failed: 0 test(s), Passed: 3 test(s), Total: 3 test(s)
Name: TestSettings
Failed: 0 test(s), Passed: 29 test(s), Total: 29 test(s)
Name: TestSharedLib
Failed: 0 test(s), Passed: 6 test(s), Total: 6 test(s)
Name: TestSharedLibStrippedSymbols
Failed: 0 test(s), Passed: 6 test(s), Total: 6 test(s)
Name: TestSignalsAPI
Failed: 0 test(s), Passed: 3 test(s), Total: 3 test(s)
Name: TestSignedTypes
Failed: 0 test(s), Passed: 3 test(s), Total: 3 test(s)
Name: TestSimpleExpressions
Failed: 0 test(s), Passed: 3 test(s), Total: 3 test(s)
Name: TestSingleQuoteInFilename
Failed: 0 test(s), Passed: 1 test(s), Total: 1 test(s)
Name: TestSourceManager
Failed: 0 test(s), Passed: 12 test(s), Total: 12 test(s)
Name: TestSourceRegexBreakpoints
Failed: 0 test(s), Passed: 6 test(s), Total: 6 test(s)
Name: TestStaticVariables
Failed: 0 test(s), Passed: 6 test(s), Total: 6 test(s)
Name: TestStepAndBreakpoints
Failed: 0 test(s), Passed: 3 test(s), Total: 3 test(s)
Name: TestStepNoDebug
Failed: 0 test(s), Passed: 9 test(s), Total: 9 test(s)
Name: TestStepOverWatchpoint
Failed: 0 test(s), Passed: 3 test(s), Total: 3 test(s)
Name: TestStepTarget
Failed: 0 test(s), Passed: 15 test(s), Total: 15 test(s)
Name: TestStopHookCmd
Failed: 0 test(s), Passed: 4 test(s), Total: 4 test(s)
Name: TestStopHookMechanism
Failed: 0 test(s), Passed: 3 test(s), Total: 3 test(s)
Name: TestStopHookMultipleThreads
Failed: 0 test(s), Passed: 3 test(s), Total: 3 test(s)
Name: TestStubReverseConnect
Failed: 0 test(s), Passed: 1 test(s), Total: 1 test(s)
Name: TestStubSetSID
Failed: 0 test(s), Passed: 3 test(s), Total: 3 test(s)
Name: TestSwiftAnyObjectType
Failed: 0 test(s), Passed: 3 test(s), Total: 3 test(s)
Name: TestSwiftAnyType
Failed: 0 test(s), Passed: 3 test(s), Total: 3 test(s)
Name: TestSwiftArchetypeResolution
Failed: 0 test(s), Passed: 3 test(s), Total: 3 test(s)
Name: TestSwiftArrayType
Failed: 0 test(s), Passed: 3 test(s), Total: 3 test(s)
Name: TestSwiftBacktracePrinting
Failed: 0 test(s), Passed: 3 test(s), Total: 3 test(s)
Name: TestSwiftBreakByPartialName
Failed: 0 test(s), Passed: 3 test(s), Total: 3 test(s)
Name: TestSwiftClassTypes
Failed: 0 test(s), Passed: 3 test(s), Total: 3 test(s)
Name: TestSwiftConditionalBreakpoint
Failed: 0 test(s), Passed: 3 test(s), Total: 3 test(s)
Name: TestSwiftDynamicValue
Failed: 0 test(s), Passed: 3 test(s), Total: 3 test(s)
Name: TestSwiftExpressionsInClassFunctions
Failed: 0 test(s), Passed: 3 test(s), Total: 3 test(s)
Name: TestSwiftExpressionsInMethodsPureSwift
Failed: 0 test(s), Passed: 3 test(s), Total: 3 test(s)
Name: TestSwiftFixIts
Failed: 0 test(s), Passed: 3 test(s), Total: 3 test(s)
Name: TestSwiftGenericEnums
Failed: 0 test(s), Passed: 3 test(s), Total: 3 test(s)
Name: TestSwiftGenericExpressions
Failed: 0 test(s), Passed: 6 test(s), Total: 6 test(s)
Name: TestSwiftGenericTupleLabels
Failed: 0 test(s), Passed: 3 test(s), Total: 3 test(s)
Name: TestSwiftGenericTypes
Failed: 0 test(s), Passed: 3 test(s), Total: 3 test(s)
Name: TestSwiftGenericsResolution
Failed: 0 test(s), Passed: 3 test(s), Total: 3 test(s)
Name: TestSwiftGetValueAsUnsigned
Failed: 0 test(s), Passed: 3 test(s), Total: 3 test(s)
Name: TestSwiftGlobals
Failed: 0 test(s), Passed: 3 test(s), Total: 3 test(s)
Name: TestSwiftHideRuntimeSupport
Failed: 0 test(s), Passed: 3 test(s), Total: 3 test(s)
Name: TestSwiftInstancePointerSetSP
Failed: 0 test(s), Passed: 3 test(s), Total: 3 test(s)
Name: TestSwiftLetInt
Failed: 0 test(s), Passed: 3 test(s), Total: 3 test(s)
Name: TestSwiftMetadataSymbols
Failed: 0 test(s), Passed: 3 test(s), Total: 3 test(s)
Name: TestSwiftMetadataSymbolsType
Failed: 0 test(s), Passed: 3 test(s), Total: 3 test(s)
Name: TestSwiftMetatype
Failed: 0 test(s), Passed: 3 test(s), Total: 3 test(s)
Name: TestSwiftMultipayloadEnum
Failed: 0 test(s), Passed: 3 test(s), Total: 3 test(s)
Name: TestSwiftNestedArray
Failed: 0 test(s), Passed: 3 test(s), Total: 3 test(s)
Name: TestSwiftOneCaseEnum
Failed: 0 test(s), Passed: 3 test(s), Total: 3 test(s)
Name: TestSwiftOptionals
Failed: 0 test(s), Passed: 3 test(s), Total: 3 test(s)
Name: TestSwiftPrivateDeclName
Failed: 0 test(s), Passed: 3 test(s), Total: 3 test(s)
Name: TestSwiftPrivateTypeAlias
Failed: 0 test(s), Passed: 3 test(s), Total: 3 test(s)
Name: TestSwiftProtocolTypes
Failed: 0 test(s), Passed: 3 test(s), Total: 3 test(s)
Name: TestSwiftRangeTypes
Failed: 0 test(s), Passed: 3 test(s), Total: 3 test(s)
Name: TestSwiftReferenceStorageTypes
Failed: 0 test(s), Passed: 3 test(s), Total: 3 test(s)
Name: TestSwiftReturns
Failed: 0 test(s), Passed: 0 test(s), Total: 3 test(s)
Name: TestSwiftStaticStringVariables
Failed: 0 test(s), Passed: 3 test(s), Total: 3 test(s)
Name: TestSwiftStdlibDictionary
Failed: 0 test(s), Passed: 0 test(s), Total: 3 test(s)
Name: TestSwiftStdlibSet
Failed: 0 test(s), Passed: 3 test(s), Total: 3 test(s)
Name: TestSwiftStepping
Failed: 0 test(s), Passed: 3 test(s), Total: 3 test(s)
Name: TestSwiftStringVariables
Failed: 0 test(s), Passed: 3 test(s), Total: 3 test(s)
Name: TestSwiftStructChangeRerun
Failed: 0 test(s), Passed: 0 test(s), Total: 3 test(s)
Name: TestSwiftStructInit
Failed: 0 test(s), Passed: 3 test(s), Total: 3 test(s)
Name: TestSwiftTupleTypes
Failed: 0 test(s), Passed: 3 test(s), Total: 3 test(s)
Name: TestSwiftTypeAliasFormatters
Failed: 0 test(s), Passed: 3 test(s), Total: 3 test(s)
Name: TestSwiftTypeLookup
Failed: 0 test(s), Passed: 3 test(s), Total: 3 test(s)
Name: TestSwiftTypeMetadata
Failed: 0 test(s), Passed: 3 test(s), Total: 3 test(s)
Name: TestSwiftTypes
Failed: 0 test(s), Passed: 3 test(s), Total: 3 test(s)
Name: TestSwiftValueOfOptionals
Failed: 0 test(s), Passed: 3 test(s), Total: 3 test(s)
Name: TestSymbolAPI
Failed: 0 test(s), Passed: 3 test(s), Total: 3 test(s)
Name: TestSymbolContext
Failed: 0 test(s), Passed: 3 test(s), Total: 3 test(s)
Name: TestSymbolContextTwoFiles
Failed: 0 test(s), Passed: 3 test(s), Total: 3 test(s)
Name: TestSyntheticCapping
Failed: 0 test(s), Passed: 3 test(s), Total: 3 test(s)
Name: TestTargetAPI
Failed: 0 test(s), Passed: 30 test(s), Total: 30 test(s)
Name: TestTargetCommand
Failed: 0 test(s), Passed: 9 test(s), Total: 9 test(s)
Name: TestTargetWatchAddress
Failed: 0 test(s), Passed: 6 test(s), Total: 6 test(s)
Name: TestTemplateArgs
Failed: 0 test(s), Passed: 6 test(s), Total: 6 test(s)
Name: TestThreadAPI
Failed: 0 test(s), Passed: 15 test(s), Total: 15 test(s)
Name: TestThreadExit
Failed: 0 test(s), Passed: 3 test(s), Total: 3 test(s)
Name: TestThreadJump
Failed: 0 test(s), Passed: 3 test(s), Total: 3 test(s)
Name: TestThreadSpecificBpPlusCondition
Failed: 0 test(s), Passed: 3 test(s), Total: 3 test(s)
Name: TestThreadSpecificBreakpoint
Failed: 0 test(s), Passed: 3 test(s), Total: 3 test(s)
Name: TestThreadStates
Failed: 0 test(s), Passed: 15 test(s), Total: 15 test(s)
Name: TestThreadStepOut
Failed: 0 test(s), Passed: 0 test(s), Total: 9 test(s)
Name: TestThreadStepping
Failed: 0 test(s), Passed: 3 test(s), Total: 3 test(s)
Name: TestTlsGlobals
Failed: 0 test(s), Passed: 3 test(s), Total: 3 test(s)
Name: TestTopLevelExprs
Failed: 0 test(s), Passed: 2 test(s), Total: 3 test(s)
Name: TestTsanBasic
Failed: 0 test(s), Passed: 3 test(s), Total: 3 test(s)
Name: TestTsanCPPGlobalLocation
Failed: 0 test(s), Passed: 3 test(s), Total: 3 test(s)
Name: TestTsanGlobalLocation
Failed: 0 test(s), Passed: 3 test(s), Total: 3 test(s)
Name: TestTsanMultiple
Failed: 0 test(s), Passed: 3 test(s), Total: 3 test(s)
Name: TestTsanSwift
Failed: 0 test(s), Passed: 0 test(s), Total: 3 test(s)
Name: TestTsanThreadLeak
Failed: 0 test(s), Passed: 3 test(s), Total: 3 test(s)
Name: TestTsanThreadNumbers
Failed: 0 test(s), Passed: 3 test(s), Total: 3 test(s)
Name: TestTypeCompletion
Failed: 0 test(s), Passed: 3 test(s), Total: 3 test(s)
Name: TestTypeList
Failed: 0 test(s), Passed: 3 test(s), Total: 3 test(s)
Name: TestTypeSummaryListArg
Failed: 0 test(s), Passed: 1 test(s), Total: 1 test(s)
Name: TestTypeSummaryListScript
Failed: 0 test(s), Passed: 3 test(s), Total: 3 test(s)
Name: TestUnicodeLiterals
Failed: 0 test(s), Passed: 9 test(s), Total: 9 test(s)
Name: TestUnionMembers
Failed: 0 test(s), Passed: 3 test(s), Total: 3 test(s)
Name: TestUniqueTypes
Failed: 0 test(s), Passed: 3 test(s), Total: 3 test(s)
Name: TestUnsignedTypes
Failed: 0 test(s), Passed: 3 test(s), Total: 3 test(s)
Name: TestUnwindExpression
Failed: 0 test(s), Passed: 3 test(s), Total: 3 test(s)
Name: TestUserFormatVsSummary
Failed: 0 test(s), Passed: 3 test(s), Total: 3 test(s)
Name: TestValueAPI
Failed: 0 test(s), Passed: 3 test(s), Total: 3 test(s)
Name: TestValueAPILinkedList
Failed: 0 test(s), Passed: 3 test(s), Total: 3 test(s)
Name: TestValueMD5Crash
Failed: 0 test(s), Passed: 3 test(s), Total: 3 test(s)
Name: TestValueObjectRecursion
Failed: 0 test(s), Passed: 3 test(s), Total: 3 test(s)
Name: TestValueOfVectorVariable
Failed: 0 test(s), Passed: 3 test(s), Total: 3 test(s)
Name: TestValueVarUpdate
Failed: 0 test(s), Passed: 3 test(s), Total: 3 test(s)
Name: TestVarInAggregateMisuse
Failed: 0 test(s), Passed: 3 test(s), Total: 3 test(s)
Name: TestVectorTypesFormatting
Failed: 0 test(s), Passed: 3 test(s), Total: 3 test(s)
Name: TestVirtual
Failed: 0 test(s), Passed: 3 test(s), Total: 3 test(s)
Name: TestWatchLocation
Failed: 0 test(s), Passed: 3 test(s), Total: 3 test(s)
Name: TestWatchLocationWithWatchSet
Failed: 0 test(s), Passed: 3 test(s), Total: 3 test(s)
Name: TestWatchedVarHitWhenInScope
Failed: 0 test(s), Passed: 3 test(s), Total: 3 test(s)
Name: TestWatchpointCommandLLDB
Failed: 0 test(s), Passed: 6 test(s), Total: 6 test(s)
Name: TestWatchpointCommandPython
Failed: 0 test(s), Passed: 6 test(s), Total: 6 test(s)
Name: TestWatchpointCommands
Failed: 0 test(s), Passed: 15 test(s), Total: 15 test(s)
Name: TestWatchpointConditionAPI
Failed: 0 test(s), Passed: 3 test(s), Total: 3 test(s)
Name: TestWatchpointConditionCmd
Failed: 0 test(s), Passed: 3 test(s), Total: 3 test(s)
Name: TestWatchpointEvents
Failed: 0 test(s), Passed: 3 test(s), Total: 3 test(s)
Name: TestWatchpointIgnoreCount
Failed: 0 test(s), Passed: 3 test(s), Total: 3 test(s)
Name: TestWatchpointIter
Failed: 0 test(s), Passed: 3 test(s), Total: 3 test(s)
Name: TestWatchpointMultipleThreads
Failed: 0 test(s), Passed: 6 test(s), Total: 6 test(s)
Name: TestWatchpointSetErrorCases
Failed: 0 test(s), Passed: 3 test(s), Total: 3 test(s)
Name: TestWatchpointSizes
Failed: 0 test(s), Passed: 3 test(s), Total: 3 test(s)
Name: TestWithLimitDebugInfo
Failed: 0 test(s), Passed: 1 test(s), Total: 3 test(s)
Name: TestWithModuleDebugging
Failed: 0 test(s), Passed: 1 test(s), Total: 1 test(s)
Name: TestWow64MiniDump
Failed: 0 test(s), Passed: 0 test(s), Total: 3 test(s)
Name: Testtypedef
Failed: 0 test(s), Passed: 3 test(s), Total: 3 test(s)
Name: lldbsuite.test.lldbtest
Failed: 3 test(s), Passed: 124 test(s), Total: 151 test(s)
Failed: lldbsuite.test.lldbtest.TestSwiftAssociatedSelfType.test_with_dwarf <https://ci.swift.org/job/oss-lldb-incremental-linux-ubuntu-15_10/6231/testReport/junit/lldbsuite.test.lldbtest/TestSwiftAssociatedSelfType/test_with_dwarf>
Failed: lldbsuite.test.lldbtest.TestSwiftAssociatedSelfType.test_with_dwo <https://ci.swift.org/job/oss-lldb-incremental-linux-ubuntu-15_10/6231/testReport/junit/lldbsuite.test.lldbtest/TestSwiftAssociatedSelfType/test_with_dwo>
Failed: lldbsuite.test.lldbtest.TestSwiftAssociatedSelfType.test_with_gmodules <https://ci.swift.org/job/oss-lldb-incremental-linux-ubuntu-15_10/6231/testReport/junit/lldbsuite.test.lldbtest/TestSwiftAssociatedSelfType/test_with_gmodules>

Changes

Commit 58ca217e8d19e44c3598b0acff33c7bac11c3cf3 by beanz:
[CMake] Fix bad dependency in symlink_clang_headers

edit: stdlib/public/SwiftShims/CMakeLists.txt
edit: cmake/modules/SwiftComponents.cmake

Commit 6a1d11bba2058924f03f8b131b176ac10e9f361c by egranata:
Teach TypeReconstruction how to look through associated types of the

edit: lib/IDE/TypeReconstruction.cpp

Commit fa01a4fa0273ca648b6a652d2550b1fc8fa710d0 by egranata:
Add a test case for LLDB to be able to resolve associated types in

add: packages/Python/lldbsuite/test/lang/swift/associated_self_type/TestSwiftAssociatedSelfType.py
add: packages/Python/lldbsuite/test/lang/swift/associated_self_type/main.swift
add: packages/Python/lldbsuite/test/lang/swift/associated_self_type/Makefile

Thanks,
- Enrico
:envelope_with_arrow: egranata@.com :phone:️ 27683

_______________________________________________
swift-lldb-dev mailing list
swift-lldb-dev@swift.org <mailto:swift-lldb-dev@swift.org>
https://lists.swift.org/mailman/listinfo/swift-lldb-dev

_______________________________________________
swift-lldb-dev mailing list
swift-lldb-dev@swift.org <mailto:swift-lldb-dev@swift.org>
https://lists.swift.org/mailman/listinfo/swift-lldb-dev

Thanks,
- Enrico
:envelope_with_arrow: egranata@.com :phone:️ 27683

···

On Sep 29, 2016, at 10:12 AM, Todd Fiala via swift-lldb-dev <swift-lldb-dev@swift.org> wrote:

On Sep 28, 2016, at 2:29 PM, Enrico Granata via swift-lldb-dev <swift-lldb-dev@swift.org <mailto:swift-lldb-dev@swift.org>> wrote:

On Sep 28, 2016, at 1:52 PM, no-reply@swift.org <mailto:no-reply@swift.org> wrote:


(Todd Fiala) #4

Okay, thanks!

···

On Sep 30, 2016, at 10:35 AM, Enrico Granata via swift-lldb-dev <swift-lldb-dev@swift.org> wrote:

On Sep 29, 2016, at 10:12 AM, Todd Fiala via swift-lldb-dev <swift-lldb-dev@swift.org <mailto:swift-lldb-dev@swift.org>> wrote:

On Sep 28, 2016, at 2:29 PM, Enrico Granata via swift-lldb-dev <swift-lldb-dev@swift.org <mailto:swift-lldb-dev@swift.org>> wrote:

I am wondering if my LLDB change went in before the corresponding Swift change.. I'll keep an eye out...

Does it require an SBAPI change? If so, we may just need to put up new static bindings.

Nope - not the case; I just need to investigate why Linux is sad about this change. With that said, Slava promised to overhaul this code fairly soon..

-Todd

On Sep 28, 2016, at 1:52 PM, no-reply@swift.org <mailto:no-reply@swift.org> wrote:

[FAILURE] oss-lldb-incremental-linux-ubuntu-15_10 [#6231]

Build URL: https://ci.swift.org/job/oss-lldb-incremental-linux-ubuntu-15_10/6231/
Project: oss-lldb-incremental-linux-ubuntu-15_10
Date of build: Wed, 28 Sep 2016 13:37:19 -0700
Build duration: 14 min
Identified problems:

Regression test failed: This build failed because a regression test in the test suite FAILed. Below is a list of all errors:
Indication 1 <https://ci.swift.org//job/oss-lldb-incremental-linux-ubuntu-15_10/6231/consoleFull#1565365029fca400bf-2f4a-462e-b517-e058d770b2d7>
Tests:

Name: Test-rdar-12481949
Failed: 0 test(s), Passed: 3 test(s), Total: 3 test(s)
Name: Test-rdar-9974002
Failed: 0 test(s), Passed: 3 test(s), Total: 3 test(s)
Name: Test11588
Failed: 0 test(s), Passed: 3 test(s), Total: 3 test(s)
Name: Test8638051
Failed: 0 test(s), Passed: 3 test(s), Total: 3 test(s)
Name: TestAbbreviations
Failed: 0 test(s), Passed: 1 test(s), Total: 1 test(s)
Name: TestAddressBreakpoints
Failed: 0 test(s), Passed: 3 test(s), Total: 3 test(s)
Name: TestAnonymous
Failed: 0 test(s), Passed: 21 test(s), Total: 21 test(s)
Name: TestApropos
Failed: 0 test(s), Passed: 1 test(s), Total: 1 test(s)
Name: TestAproposWithProcess
Failed: 0 test(s), Passed: 3 test(s), Total: 3 test(s)
Name: TestArrayTypes
Failed: 0 test(s), Passed: 6 test(s), Total: 6 test(s)
Name: TestAsanSwift
Failed: 0 test(s), Passed: 0 test(s), Total: 3 test(s)
Name: TestAttachDenied
Failed: 0 test(s), Passed: 3 test(s), Total: 3 test(s)
Name: TestAttachResume
Failed: 0 test(s), Passed: 3 test(s), Total: 3 test(s)
Name: TestAvoidBreakpointInDelaySlot
Failed: 0 test(s), Passed: 0 test(s), Total: 3 test(s)
Name: TestBSDArchives
Failed: 0 test(s), Passed: 3 test(s), Total: 3 test(s)
Name: TestBackticksWithoutATarget
Failed: 0 test(s), Passed: 1 test(s), Total: 1 test(s)
Name: TestBacktraceAll
Failed: 0 test(s), Passed: 3 test(s), Total: 3 test(s)
Name: TestBadAddressBreakpoints
Failed: 0 test(s), Passed: 3 test(s), Total: 3 test(s)
Name: TestBatchMode
Failed: 0 test(s), Passed: 9 test(s), Total: 9 test(s)
Name: TestBitfields
Failed: 0 test(s), Passed: 6 test(s), Total: 6 test(s)
Name: TestBreakAfterJoin
Failed: 0 test(s), Passed: 3 test(s), Total: 3 test(s)
Name: TestBreakpointAPI
Failed: 0 test(s), Passed: 3 test(s), Total: 3 test(s)
Name: TestBreakpointCaseSensitivity
Failed: 0 test(s), Passed: 3 test(s), Total: 6 test(s)
Name: TestBreakpointCommand
Failed: 0 test(s), Passed: 3 test(s), Total: 3 test(s)
Name: TestBreakpointCommandsFromPython
Failed: 0 test(s), Passed: 3 test(s), Total: 3 test(s)
Name: TestBreakpointConditions
Failed: 0 test(s), Passed: 12 test(s), Total: 12 test(s)
Name: TestBreakpointIDs
Failed: 0 test(s), Passed: 3 test(s), Total: 3 test(s)
Name: TestBreakpointIgnoreCount
Failed: 0 test(s), Passed: 6 test(s), Total: 6 test(s)
Name: TestBreakpointLanguage
Failed: 0 test(s), Passed: 6 test(s), Total: 6 test(s)
Name: TestBreakpointLocations
Failed: 0 test(s), Passed: 3 test(s), Total: 3 test(s)
Name: TestBreakpointOptions
Failed: 0 test(s), Passed: 3 test(s), Total: 3 test(s)
Name: TestBreakpointSetRestart
Failed: 0 test(s), Passed: 3 test(s), Total: 3 test(s)
Name: TestBreakpointsWithNoTargets
Failed: 0 test(s), Passed: 3 test(s), Total: 3 test(s)
Name: TestBuiltinTrap
Failed: 0 test(s), Passed: 3 test(s), Total: 3 test(s)
Name: TestBulkyEnumsVariables
Failed: 0 test(s), Passed: 3 test(s), Total: 3 test(s)
Name: TestCInlines
Failed: 0 test(s), Passed: 3 test(s), Total: 3 test(s)
Name: TestCModules
Failed: 0 test(s), Passed: 3 test(s), Total: 3 test(s)
Name: TestCPP11EnumTypes
Failed: 0 test(s), Passed: 24 test(s), Total: 24 test(s)
Name: TestCPPAuto
Failed: 0 test(s), Passed: 3 test(s), Total: 3 test(s)
Name: TestCPPBool
Failed: 0 test(s), Passed: 3 test(s), Total: 3 test(s)
Name: TestCPPBreakpointCommands
Failed: 0 test(s), Passed: 3 test(s), Total: 3 test(s)
Name: TestCPPBreakpointLocations
Failed: 0 test(s), Passed: 6 test(s), Total: 6 test(s)
Name: TestCPPExceptionBreakpoint
Failed: 0 test(s), Passed: 3 test(s), Total: 3 test(s)
Name: TestCPPExceptionBreakpoints
Failed: 0 test(s), Passed: 3 test(s), Total: 3 test(s)
Name: TestCPPStaticMembers
Failed: 0 test(s), Passed: 3 test(s), Total: 3 test(s)
Name: TestCPPStaticMethods
Failed: 0 test(s), Passed: 3 test(s), Total: 3 test(s)
Name: TestCPPThis
Failed: 0 test(s), Passed: 3 test(s), Total: 3 test(s)
Name: TestCStrings
Failed: 0 test(s), Passed: 3 test(s), Total: 3 test(s)
Name: TestCallCPPFunction
Failed: 0 test(s), Passed: 3 test(s), Total: 3 test(s)
Name: TestCallStdStringFunction
Failed: 0 test(s), Passed: 3 test(s), Total: 3 test(s)
Name: TestCallStopAndContinue
Failed: 0 test(s), Passed: 3 test(s), Total: 3 test(s)
Name: TestCallThatRestarts
Failed: 0 test(s), Passed: 3 test(s), Total: 3 test(s)
Name: TestCallUserAnonTypedef
Failed: 0 test(s), Passed: 3 test(s), Total: 3 test(s)
Name: TestCallUserDefinedFunction
Failed: 0 test(s), Passed: 3 test(s), Total: 3 test(s)
Name: TestCallWithTimeout
Failed: 0 test(s), Passed: 3 test(s), Total: 3 test(s)
Name: TestChangeProcessGroup
Failed: 0 test(s), Passed: 3 test(s), Total: 3 test(s)
Name: TestChangeValueAPI
Failed: 0 test(s), Passed: 3 test(s), Total: 3 test(s)
Name: TestChar1632T
Failed: 0 test(s), Passed: 3 test(s), Total: 3 test(s)
Name: TestClassTypes
Failed: 0 test(s), Passed: 12 test(s), Total: 12 test(s)
Name: TestClassTypesDisassembly
Failed: 0 test(s), Passed: 6 test(s), Total: 6 test(s)
Name: TestCommandHistory
Failed: 0 test(s), Passed: 1 test(s), Total: 1 test(s)
Name: TestCommandInterpreterAPI
Failed: 0 test(s), Passed: 3 test(s), Total: 3 test(s)
Name: TestCommandRegex
Failed: 0 test(s), Passed: 1 test(s), Total: 1 test(s)
Name: TestCommandScript
Failed: 0 test(s), Passed: 3 test(s), Total: 3 test(s)
Name: TestCommandScriptAlias
Failed: 0 test(s), Passed: 3 test(s), Total: 3 test(s)
Name: TestCommandScriptImmediateOutput
Failed: 0 test(s), Passed: 2 test(s), Total: 2 test(s)
Name: TestCommandSource
Failed: 0 test(s), Passed: 1 test(s), Total: 1 test(s)
Name: TestCommonShortSpellings
Failed: 0 test(s), Passed: 1 test(s), Total: 1 test(s)
Name: TestCompDirSymLink
Failed: 0 test(s), Passed: 9 test(s), Total: 9 test(s)
Name: TestCompletion
Failed: 0 test(s), Passed: 34 test(s), Total: 34 test(s)
Name: TestConcurrentBreakpointDelayBreakpointOneSignal
Failed: 0 test(s), Passed: 1 test(s), Total: 1 test(s)
Name: TestConcurrentBreakpointOneDelayBreakpointThreads
Failed: 0 test(s), Passed: 1 test(s), Total: 1 test(s)
Name: TestConcurrentBreakpointsDelayedBreakpointOneWatchpoint
Failed: 0 test(s), Passed: 1 test(s), Total: 1 test(s)
Name: TestConcurrentCrashWithBreak
Failed: 0 test(s), Passed: 1 test(s), Total: 1 test(s)
Name: TestConcurrentCrashWithSignal
Failed: 0 test(s), Passed: 1 test(s), Total: 1 test(s)
Name: TestConcurrentCrashWithWatchpoint
Failed: 0 test(s), Passed: 1 test(s), Total: 1 test(s)
Name: TestConcurrentCrashWithWatchpointBreakpointSignal
Failed: 0 test(s), Passed: 1 test(s), Total: 1 test(s)
Name: TestConcurrentDelaySignalBreak
Failed: 0 test(s), Passed: 1 test(s), Total: 1 test(s)
Name: TestConcurrentDelaySignalWatch
Failed: 0 test(s), Passed: 1 test(s), Total: 1 test(s)
Name: TestConcurrentDelayWatchBreak
Failed: 0 test(s), Passed: 1 test(s), Total: 1 test(s)
Name: TestConcurrentDelayedCrashWithBreakpointSignal
Failed: 0 test(s), Passed: 1 test(s), Total: 1 test(s)
Name: TestConcurrentDelayedCrashWithBreakpointWatchpoint
Failed: 0 test(s), Passed: 1 test(s), Total: 1 test(s)
Name: TestConcurrentNWatchNBreak
Failed: 0 test(s), Passed: 1 test(s), Total: 1 test(s)
Name: TestConcurrentSignalBreak
Failed: 0 test(s), Passed: 1 test(s), Total: 1 test(s)
Name: TestConcurrentSignalDelayBreak
Failed: 0 test(s), Passed: 1 test(s), Total: 1 test(s)
Name: TestConcurrentSignalDelayWatch
Failed: 0 test(s), Passed: 1 test(s), Total: 1 test(s)
Name: TestConcurrentSignalNWatchNBreak
Failed: 0 test(s), Passed: 1 test(s), Total: 1 test(s)
Name: TestConcurrentSignalWatch
Failed: 0 test(s), Passed: 1 test(s), Total: 1 test(s)
Name: TestConcurrentSignalWatchBreak
Failed: 0 test(s), Passed: 1 test(s), Total: 1 test(s)
Name: TestConcurrentTwoBreakpointThreads
Failed: 0 test(s), Passed: 1 test(s), Total: 1 test(s)
Name: TestConcurrentTwoBreakpointsOneDelaySignal
Failed: 0 test(s), Passed: 1 test(s), Total: 1 test(s)
Name: TestConcurrentTwoBreakpointsOneSignal
Failed: 0 test(s), Passed: 1 test(s), Total: 1 test(s)
Name: TestConcurrentTwoBreakpointsOneWatchpoint
Failed: 0 test(s), Passed: 1 test(s), Total: 1 test(s)
Name: TestConcurrentTwoWatchpointThreads
Failed: 0 test(s), Passed: 1 test(s), Total: 1 test(s)
Name: TestConcurrentTwoWatchpointsOneBreakpoint
Failed: 0 test(s), Passed: 1 test(s), Total: 1 test(s)
Name: TestConcurrentTwoWatchpointsOneDelayBreakpoint
Failed: 0 test(s), Passed: 1 test(s), Total: 1 test(s)
Name: TestConcurrentTwoWatchpointsOneSignal
Failed: 0 test(s), Passed: 1 test(s), Total: 1 test(s)
Name: TestConcurrentWatchBreak
Failed: 0 test(s), Passed: 1 test(s), Total: 1 test(s)
Name: TestConcurrentWatchBreakDelay
Failed: 0 test(s), Passed: 1 test(s), Total: 1 test(s)
Name: TestConcurrentWatchpointDelayWatchpointOneBreakpoint
Failed: 0 test(s), Passed: 1 test(s), Total: 1 test(s)
Name: TestConcurrentWatchpointWithDelayWatchpointThreads
Failed: 0 test(s), Passed: 1 test(s), Total: 1 test(s)
Name: TestConditionalBreak
Failed: 0 test(s), Passed: 6 test(s), Total: 6 test(s)
Name: TestConsecutiveBreakpoints
Failed: 0 test(s), Passed: 3 test(s), Total: 3 test(s)
Name: TestConstVariables
Failed: 0 test(s), Passed: 3 test(s), Total: 3 test(s)
Name: TestConvenienceVariables
Failed: 0 test(s), Passed: 3 test(s), Total: 3 test(s)
Name: TestCppChainedCalls
Failed: 0 test(s), Passed: 3 test(s), Total: 3 test(s)
Name: TestCppGlobalOperators
Failed: 0 test(s), Passed: 6 test(s), Total: 6 test(s)
Name: TestCppIncompleteTypes
Failed: 0 test(s), Passed: 6 test(s), Total: 6 test(s)
Name: TestCppNsImport
Failed: 0 test(s), Passed: 3 test(s), Total: 3 test(s)
Name: TestCppScope
Failed: 0 test(s), Passed: 3 test(s), Total: 3 test(s)
Name: TestCppValueCast
Failed: 0 test(s), Passed: 6 test(s), Total: 6 test(s)
Name: TestCrashDuringStep
Failed: 0 test(s), Passed: 3 test(s), Total: 3 test(s)
Name: TestCreateAfterAttach
Failed: 0 test(s), Passed: 6 test(s), Total: 6 test(s)
Name: TestCreateDuringInstructionStep
Failed: 0 test(s), Passed: 3 test(s), Total: 3 test(s)
Name: TestCreateDuringStep
Failed: 0 test(s), Passed: 9 test(s), Total: 9 test(s)
Name: TestCxxWCharT
Failed: 0 test(s), Passed: 3 test(s), Total: 3 test(s)
Name: TestDataFormatterAdv
Failed: 0 test(s), Passed: 3 test(s), Total: 3 test(s)
Name: TestDataFormatterCategories
Failed: 0 test(s), Passed: 3 test(s), Total: 3 test(s)
Name: TestDataFormatterCpp
Failed: 0 test(s), Passed: 3 test(s), Total: 3 test(s)
Name: TestDataFormatterDisabling
Failed: 0 test(s), Passed: 3 test(s), Total: 3 test(s)
Name: TestDataFormatterEnumFormat
Failed: 0 test(s), Passed: 3 test(s), Total: 3 test(s)
Name: TestDataFormatterGlobals
Failed: 0 test(s), Passed: 3 test(s), Total: 3 test(s)
Name: TestDataFormatterHexCaps
Failed: 0 test(s), Passed: 3 test(s), Total: 3 test(s)
Name: TestDataFormatterLanguageCategoryUpdates
Failed: 0 test(s), Passed: 3 test(s), Total: 3 test(s)
Name: TestDataFormatterLibccIterator
Failed: 0 test(s), Passed: 0 test(s), Total: 3 test(s)
Name: TestDataFormatterLibccMap
Failed: 0 test(s), Passed: 0 test(s), Total: 3 test(s)
Name: TestDataFormatterLibccMultiMap
Failed: 0 test(s), Passed: 0 test(s), Total: 3 test(s)
Name: TestDataFormatterLibcxxList
Failed: 0 test(s), Passed: 0 test(s), Total: 3 test(s)
Name: TestDataFormatterLibcxxListLoop
Failed: 0 test(s), Passed: 0 test(s), Total: 3 test(s)
Name: TestDataFormatterLibcxxMultiSet
Failed: 0 test(s), Passed: 0 test(s), Total: 3 test(s)
Name: TestDataFormatterLibcxxSet
Failed: 0 test(s), Passed: 3 test(s), Total: 3 test(s)
Name: TestDataFormatterLibcxxString
Failed: 0 test(s), Passed: 0 test(s), Total: 3 test(s)
Name: TestDataFormatterLibcxxVBool
Failed: 0 test(s), Passed: 0 test(s), Total: 3 test(s)
Name: TestDataFormatterLibcxxVector
Failed: 0 test(s), Passed: 0 test(s), Total: 3 test(s)
Name: TestDataFormatterNamedSummaries
Failed: 0 test(s), Passed: 3 test(s), Total: 3 test(s)
Name: TestDataFormatterPythonSynth
Failed: 0 test(s), Passed: 6 test(s), Total: 6 test(s)
Name: TestDataFormatterRefPtrRecursion
Failed: 0 test(s), Passed: 3 test(s), Total: 3 test(s)
Name: TestDataFormatterScript
Failed: 0 test(s), Passed: 3 test(s), Total: 3 test(s)
Name: TestDataFormatterSkipSummary
Failed: 0 test(s), Passed: 3 test(s), Total: 3 test(s)
Name: TestDataFormatterSmartArray
Failed: 0 test(s), Passed: 3 test(s), Total: 3 test(s)
Name: TestDataFormatterStdIterator
Failed: 0 test(s), Passed: 3 test(s), Total: 3 test(s)
Name: TestDataFormatterStdList
Failed: 0 test(s), Passed: 3 test(s), Total: 3 test(s)
Name: TestDataFormatterStdMap
Failed: 0 test(s), Passed: 3 test(s), Total: 3 test(s)
Name: TestDataFormatterStdSmartPtr
Failed: 0 test(s), Passed: 3 test(s), Total: 3 test(s)
Name: TestDataFormatterStdString
Failed: 0 test(s), Passed: 3 test(s), Total: 3 test(s)
Name: TestDataFormatterStdVBool
Failed: 0 test(s), Passed: 3 test(s), Total: 3 test(s)
Name: TestDataFormatterStdVector
Failed: 0 test(s), Passed: 3 test(s), Total: 3 test(s)
Name: TestDataFormatterSynth
Failed: 0 test(s), Passed: 3 test(s), Total: 3 test(s)
Name: TestDataFormatterSynthType
Failed: 0 test(s), Passed: 3 test(s), Total: 3 test(s)
Name: TestDataFormatterSynthVal
Failed: 0 test(s), Passed: 3 test(s), Total: 3 test(s)
Name: TestDataFormatterUnordered
Failed: 0 test(s), Passed: 0 test(s), Total: 3 test(s)
Name: TestDataFormatterVarScriptFormatting
Failed: 0 test(s), Passed: 3 test(s), Total: 3 test(s)
Name: TestDeadStrip
Failed: 0 test(s), Passed: 3 test(s), Total: 3 test(s)
Name: TestDebugBreak
Failed: 0 test(s), Passed: 1 test(s), Total: 1 test(s)
Name: TestDebuggerAPI
Failed: 0 test(s), Passed: 4 test(s), Total: 4 test(s)
Name: TestDefaultCacheLineSize
Failed: 0 test(s), Passed: 0 test(s), Total: 3 test(s)
Name: TestDefaultConstructorForAPIObjects
Failed: 0 test(s), Passed: 35 test(s), Total: 35 test(s)
Name: TestDefiningOverloadedFunctions
Failed: 0 test(s), Passed: 3 test(s), Total: 3 test(s)
Name: TestDiamond
Failed: 0 test(s), Passed: 3 test(s), Total: 3 test(s)
Name: TestDisasmAPI
Failed: 0 test(s), Passed: 3 test(s), Total: 3 test(s)
Name: TestDisassembleBreakpoint
Failed: 0 test(s), Passed: 3 test(s), Total: 3 test(s)
Name: TestDisassembleRawData
Failed: 0 test(s), Passed: 1 test(s), Total: 1 test(s)
Name: TestDisassemble_VST1_64
Failed: 0 test(s), Passed: 0 test(s), Total: 1 test(s)
Name: TestDynamicValue
Failed: 0 test(s), Passed: 3 test(s), Total: 3 test(s)
Name: TestDynamicValueChildCount
Failed: 0 test(s), Passed: 3 test(s), Total: 3 test(s)
Name: TestEhFrameUnwind
Failed: 0 test(s), Passed: 3 test(s), Total: 3 test(s)
Name: TestEmulations
Failed: 0 test(s), Passed: 2 test(s), Total: 2 test(s)
Name: TestEnumTypes
Failed: 0 test(s), Passed: 3 test(s), Total: 3 test(s)
Name: TestEnumVariables
Failed: 0 test(s), Passed: 3 test(s), Total: 3 test(s)
Name: TestEqualityOperators
Failed: 0 test(s), Passed: 9 test(s), Total: 9 test(s)
Name: TestEvents
Failed: 0 test(s), Passed: 0 test(s), Total: 9 test(s)
Name: TestExitDuringBreak
Failed: 0 test(s), Passed: 3 test(s), Total: 3 test(s)
Name: TestExitDuringStep
Failed: 0 test(s), Passed: 9 test(s), Total: 9 test(s)
Name: TestExprDoesntBlock
Failed: 0 test(s), Passed: 3 test(s), Total: 3 test(s)
Name: TestExprHelpExamples
Failed: 0 test(s), Passed: 3 test(s), Total: 3 test(s)
Name: TestExprInProtocolExtension
Failed: 0 test(s), Passed: 3 test(s), Total: 3 test(s)
Name: TestExprOptions
Failed: 0 test(s), Passed: 3 test(s), Total: 3 test(s)
Name: TestExpressionAccessControl
Failed: 0 test(s), Passed: 3 test(s), Total: 3 test(s)
Name: TestExpressionErrorBreakpoint
Failed: 0 test(s), Passed: 12 test(s), Total: 12 test(s)
Name: TestExpressionErrors
Failed: 0 test(s), Passed: 3 test(s), Total: 3 test(s)
Name: TestExpressionInSyscall
Failed: 0 test(s), Passed: 3 test(s), Total: 3 test(s)
Name: TestExpressionScopes
Failed: 0 test(s), Passed: 3 test(s), Total: 3 test(s)
Name: TestExprs
Failed: 0 test(s), Passed: 12 test(s), Total: 12 test(s)
Name: TestExprs2
Failed: 0 test(s), Passed: 3 test(s), Total: 3 test(s)
Name: TestExprsChar
Failed: 0 test(s), Passed: 9 test(s), Total: 9 test(s)
Name: TestFdLeak
Failed: 0 test(s), Passed: 3 test(s), Total: 3 test(s)
Name: TestFilePrivate
Failed: 0 test(s), Passed: 3 test(s), Total: 3 test(s)
Name: TestFloatTypes
Failed: 0 test(s), Passed: 6 test(s), Total: 6 test(s)
Name: TestFloatTypesExpr
Failed: 0 test(s), Passed: 6 test(s), Total: 6 test(s)
Name: TestFormatPropagation
Failed: 0 test(s), Passed: 3 test(s), Total: 3 test(s)
Name: TestFormats
Failed: 0 test(s), Passed: 3 test(s), Total: 3 test(s)
Name: TestFormatters
Failed: 0 test(s), Passed: 3 test(s), Total: 3 test(s)
Name: TestFormattersSBAPI
Failed: 0 test(s), Passed: 6 test(s), Total: 6 test(s)
Name: TestForwardDeclaration
Failed: 0 test(s), Passed: 3 test(s), Total: 3 test(s)
Name: TestFrameFormatSmallStruct
Failed: 0 test(s), Passed: 3 test(s), Total: 3 test(s)
Name: TestFrameUtils
Failed: 0 test(s), Passed: 3 test(s), Total: 3 test(s)
Name: TestFrameVariableAnonymousUnions
Failed: 0 test(s), Passed: 3 test(s), Total: 3 test(s)
Name: TestFrames
Failed: 0 test(s), Passed: 9 test(s), Total: 9 test(s)
Name: TestFunctionTypes
Failed: 0 test(s), Passed: 6 test(s), Total: 6 test(s)
Name: TestFunctionVariables
Failed: 0 test(s), Passed: 3 test(s), Total: 3 test(s)
Name: TestGdbRemoteAbort
Failed: 0 test(s), Passed: 1 test(s), Total: 1 test(s)
Name: TestGdbRemoteAttach
Failed: 0 test(s), Passed: 1 test(s), Total: 1 test(s)
Name: TestGdbRemoteAuxvSupport
Failed: 0 test(s), Passed: 4 test(s), Total: 4 test(s)
Name: TestGdbRemoteExitCode
Failed: 0 test(s), Passed: 3 test(s), Total: 3 test(s)
Name: TestGdbRemoteExpeditedRegisters
Failed: 0 test(s), Passed: 5 test(s), Total: 5 test(s)
Name: TestGdbRemoteHostInfo
Failed: 0 test(s), Passed: 1 test(s), Total: 1 test(s)
Name: TestGdbRemoteKill
Failed: 0 test(s), Passed: 1 test(s), Total: 1 test(s)
Name: TestGdbRemoteModuleInfo
Failed: 0 test(s), Passed: 1 test(s), Total: 1 test(s)
Name: TestGdbRemoteProcessInfo
Failed: 0 test(s), Passed: 5 test(s), Total: 5 test(s)
Name: TestGdbRemoteRegisterState
Failed: 0 test(s), Passed: 2 test(s), Total: 2 test(s)
Name: TestGdbRemoteSegFault
Failed: 0 test(s), Passed: 1 test(s), Total: 1 test(s)
Name: TestGdbRemoteSingleStep
Failed: 0 test(s), Passed: 1 test(s), Total: 1 test(s)
Name: TestGdbRemoteThreadsInStopReply
Failed: 0 test(s), Passed: 4 test(s), Total: 4 test(s)
Name: TestGdbRemote_qThreadStopInfo
Failed: 0 test(s), Passed: 3 test(s), Total: 4 test(s)
Name: TestGdbRemote_vCont
Failed: 0 test(s), Passed: 6 test(s), Total: 6 test(s)
Name: TestGlobalVariables
Failed: 0 test(s), Passed: 3 test(s), Total: 3 test(s)
Name: TestGoFormatters
Failed: 0 test(s), Passed: 0 test(s), Total: 1 test(s)
Name: TestGoroutines
Failed: 0 test(s), Passed: 0 test(s), Total: 1 test(s)
Name: TestHandleSegv
Failed: 0 test(s), Passed: 3 test(s), Total: 3 test(s)
Name: TestHelloWorld
Failed: 0 test(s), Passed: 9 test(s), Total: 9 test(s)
Name: TestHelp
Failed: 0 test(s), Passed: 18 test(s), Total: 18 test(s)
Name: TestIRInterpreter
Failed: 0 test(s), Passed: 3 test(s), Total: 3 test(s)
Name: TestIRInterpreterPHINodes
Failed: 0 test(s), Passed: 3 test(s), Total: 3 test(s)
Name: TestImageListMultiArchitecture
Failed: 0 test(s), Passed: 1 test(s), Total: 1 test(s)
Name: TestImport
Failed: 0 test(s), Passed: 1 test(s), Total: 1 test(s)
Name: TestInOutVariables
Failed: 0 test(s), Passed: 3 test(s), Total: 3 test(s)
Name: TestIndexVariable
Failed: 0 test(s), Passed: 3 test(s), Total: 3 test(s)
Name: TestIndirectEnumVariables
Failed: 0 test(s), Passed: 0 test(s), Total: 3 test(s)
Name: TestInferiorAssert
Failed: 0 test(s), Passed: 18 test(s), Total: 18 test(s)
Name: TestInferiorChanged
Failed: 0 test(s), Passed: 1 test(s), Total: 1 test(s)
Name: TestInferiorCrashing
Failed: 0 test(s), Passed: 18 test(s), Total: 21 test(s)
Name: TestInitializerList
Failed: 0 test(s), Passed: 3 test(s), Total: 3 test(s)
Name: TestInlineStepping
Failed: 0 test(s), Passed: 0 test(s), Total: 9 test(s)
Name: TestInlinedBreakpoints
Failed: 0 test(s), Passed: 3 test(s), Total: 3 test(s)
Name: TestInlinedFrame
Failed: 0 test(s), Passed: 3 test(s), Total: 3 test(s)
Name: TestInlines
Failed: 0 test(s), Passed: 3 test(s), Total: 3 test(s)
Name: TestIntegerTypes
Failed: 0 test(s), Passed: 30 test(s), Total: 30 test(s)
Name: TestIntegerTypesExpr
Failed: 0 test(s), Passed: 30 test(s), Total: 30 test(s)
Name: TestJITLoaderGDB
Failed: 0 test(s), Passed: 0 test(s), Total: 3 test(s)
Name: TestLLDBIterator
Failed: 0 test(s), Passed: 9 test(s), Total: 9 test(s)
Name: TestLLVM
Failed: 0 test(s), Passed: 1 test(s), Total: 1 test(s)
Name: TestLaunchWithShellExpand
Failed: 0 test(s), Passed: 3 test(s), Total: 3 test(s)
Name: TestLazyReverse
Failed: 0 test(s), Passed: 1 test(s), Total: 1 test(s)
Name: TestLibCxxAtomic
Failed: 0 test(s), Passed: 0 test(s), Total: 3 test(s)
Name: TestLibCxxFunction
Failed: 0 test(s), Passed: 0 test(s), Total: 3 test(s)
Name: TestLinuxCore
Failed: 0 test(s), Passed: 4 test(s), Total: 5 test(s)
Name: TestListener
Failed: 0 test(s), Passed: 3 test(s), Total: 3 test(s)
Name: TestLldbGdbServer
Failed: 0 test(s), Passed: 33 test(s), Total: 33 test(s)
Name: TestLoadUnload
Failed: 0 test(s), Passed: 18 test(s), Total: 18 test(s)
Name: TestLogging
Failed: 0 test(s), Passed: 5 test(s), Total: 5 test(s)
Name: TestLongjmp
Failed: 0 test(s), Passed: 9 test(s), Total: 9 test(s)
Name: TestMPXRegisters
Failed: 0 test(s), Passed: 0 test(s), Total: 3 test(s)
Name: TestMacros
Failed: 0 test(s), Passed: 3 test(s), Total: 3 test(s)
Name: TestMembersAndLocalsWithSameName
Failed: 0 test(s), Passed: 6 test(s), Total: 6 test(s)
Name: TestMemoryCache
Failed: 0 test(s), Passed: 3 test(s), Total: 3 test(s)
Name: TestMemoryFind
Failed: 0 test(s), Passed: 3 test(s), Total: 3 test(s)
Name: TestMemoryHistory
Failed: 0 test(s), Passed: 3 test(s), Total: 3 test(s)
Name: TestMemoryRead
Failed: 0 test(s), Passed: 3 test(s), Total: 3 test(s)
Name: TestMiBreak
Failed: 0 test(s), Passed: 0 test(s), Total: 7 test(s)
Name: TestMiCliSupport
Failed: 0 test(s), Passed: 0 test(s), Total: 8 test(s)
Name: TestMiData
Failed: 0 test(s), Passed: 0 test(s), Total: 7 test(s)
Name: TestMiExec
Failed: 0 test(s), Passed: 0 test(s), Total: 9 test(s)
Name: TestMiExit
Failed: 0 test(s), Passed: 0 test(s), Total: 3 test(s)
Name: TestMiFile
Failed: 0 test(s), Passed: 0 test(s), Total: 4 test(s)
Name: TestMiGdbSetShow
Failed: 0 test(s), Passed: 0 test(s), Total: 8 test(s)
Name: TestMiGdbSetShowPrint
Failed: 0 test(s), Passed: 0 test(s), Total: 3 test(s)
Name: TestMiInterpreterExec
Failed: 0 test(s), Passed: 0 test(s), Total: 8 test(s)
Name: TestMiLibraryLoaded
Failed: 0 test(s), Passed: 0 test(s), Total: 1 test(s)
Name: TestMiPrompt
Failed: 0 test(s), Passed: 0 test(s), Total: 1 test(s)
Name: TestMiSignal
Failed: 0 test(s), Passed: 0 test(s), Total: 5 test(s)
Name: TestMiStack
Failed: 0 test(s), Passed: 0 test(s), Total: 7 test(s)
Name: TestMiStartupOptions
Failed: 0 test(s), Passed: 0 test(s), Total: 10 test(s)
Name: TestMiSymbol
Failed: 0 test(s), Passed: 0 test(s), Total: 1 test(s)
Name: TestMiSyntax
Failed: 0 test(s), Passed: 0 test(s), Total: 3 test(s)
Name: TestMiTarget
Failed: 0 test(s), Passed: 0 test(s), Total: 3 test(s)
Name: TestMiThreadInfo
Failed: 0 test(s), Passed: 0 test(s), Total: 1 test(s)
Name: TestMiVar
Failed: 0 test(s), Passed: 0 test(s), Total: 6 test(s)
Name: TestMiniDump
Failed: 0 test(s), Passed: 0 test(s), Total: 9 test(s)
Name: TestMixedLanguages
Failed: 0 test(s), Passed: 3 test(s), Total: 3 test(s)
Name: TestModuleAndSection
Failed: 0 test(s), Passed: 9 test(s), Total: 9 test(s)
Name: TestMultilineExpressions
Failed: 0 test(s), Passed: 3 test(s), Total: 3 test(s)
Name: TestMultipleBreakpoints
Failed: 0 test(s), Passed: 3 test(s), Total: 3 test(s)
Name: TestMultipleDebuggers
Failed: 0 test(s), Passed: 3 test(s), Total: 3 test(s)
Name: TestMultipleDebuggersCommands
Failed: 0 test(s), Passed: 1 test(s), Total: 1 test(s)
Name: TestMultithreaded
Failed: 0 test(s), Passed: 0 test(s), Total: 12 test(s)
Name: TestMyFirstWatchpoint
Failed: 0 test(s), Passed: 3 test(s), Total: 3 test(s)
Name: TestNamespace
Failed: 0 test(s), Passed: 12 test(s), Total: 12 test(s)
Name: TestNamespaceDefinitions
Failed: 0 test(s), Passed: 3 test(s), Total: 3 test(s)
Name: TestNamespaceLookup
Failed: 0 test(s), Passed: 24 test(s), Total: 24 test(s)
Name: TestNestedAlias
Failed: 0 test(s), Passed: 3 test(s), Total: 3 test(s)
Name: TestNestedPersistentTypes
Failed: 0 test(s), Passed: 3 test(s), Total: 3 test(s)
Name: TestNoSuchArch
Failed: 0 test(s), Passed: 3 test(s), Total: 3 test(s)
Name: TestNoreturnUnwind
Failed: 0 test(s), Passed: 3 test(s), Total: 3 test(s)
Name: TestNumThreads
Failed: 0 test(s), Passed: 3 test(s), Total: 3 test(s)
Name: TestOverloadedFunctions
Failed: 0 test(s), Passed: 3 test(s), Total: 3 test(s)
Name: TestPOUnwrapping
Failed: 0 test(s), Passed: 1 test(s), Total: 1 test(s)
Name: TestPaths
Failed: 0 test(s), Passed: 2 test(s), Total: 3 test(s)
Name: TestPersistentPtrUpdate
Failed: 0 test(s), Passed: 3 test(s), Total: 3 test(s)
Name: TestPersistentTypes
Failed: 0 test(s), Passed: 3 test(s), Total: 3 test(s)
Name: TestPersistentVariables
Failed: 0 test(s), Passed: 3 test(s), Total: 3 test(s)
Name: TestPlatformCommand
Failed: 0 test(s), Passed: 7 test(s), Total: 8 test(s)
Name: TestPlatformProcessConnect
Failed: 0 test(s), Passed: 0 test(s), Total: 1 test(s)
Name: TestPluginCommands
Failed: 0 test(s), Passed: 1 test(s), Total: 1 test(s)
Name: TestPrintArray
Failed: 0 test(s), Passed: 3 test(s), Total: 3 test(s)
Name: TestPrintStackTraces
Failed: 0 test(s), Passed: 3 test(s), Total: 3 test(s)
Name: TestPrintfAfterUp
Failed: 0 test(s), Passed: 3 test(s), Total: 3 test(s)
Name: TestProcessAPI
Failed: 0 test(s), Passed: 15 test(s), Total: 15 test(s)
Name: TestProcessAttach
Failed: 0 test(s), Passed: 6 test(s), Total: 6 test(s)
Name: TestProcessIO
Failed: 0 test(s), Passed: 15 test(s), Total: 15 test(s)
Name: TestProcessLaunch
Failed: 0 test(s), Passed: 9 test(s), Total: 9 test(s)
Name: TestProcessSaveCore
Failed: 0 test(s), Passed: 0 test(s), Total: 6 test(s)
Name: TestPtrRef2Typedef
Failed: 0 test(s), Passed: 3 test(s), Total: 3 test(s)
Name: TestPtrToArrayFormatting
Failed: 0 test(s), Passed: 3 test(s), Total: 3 test(s)
Name: TestPublicAPIHeaders
Failed: 0 test(s), Passed: 0 test(s), Total: 3 test(s)
Name: TestPyObjSynthProvider
Failed: 0 test(s), Passed: 1 test(s), Total: 1 test(s)
Name: TestPythonOSPlugin
Failed: 0 test(s), Passed: 3 test(s), Total: 3 test(s)
Name: TestQuoting
Failed: 0 test(s), Passed: 11 test(s), Total: 11 test(s)
Name: TestREPLClasses
Failed: 0 test(s), Passed: 1 test(s), Total: 1 test(s)
Name: TestREPLRecursiveClass
Failed: 0 test(s), Passed: 1 test(s), Total: 1 test(s)
Name: TestREPLStructs
Failed: 0 test(s), Passed: 1 test(s), Total: 1 test(s)
Name: TestRaise
Failed: 0 test(s), Passed: 9 test(s), Total: 9 test(s)
Name: TestRdar12586188
Failed: 0 test(s), Passed: 1 test(s), Total: 1 test(s)
Name: TestRecursiveInferior
Failed: 0 test(s), Passed: 18 test(s), Total: 21 test(s)
Name: TestRecursiveTypes
Failed: 0 test(s), Passed: 6 test(s), Total: 6 test(s)
Name: TestRegexpBreakCommand
Failed: 0 test(s), Passed: 3 test(s), Total: 3 test(s)
Name: TestRegisterVariables
Failed: 0 test(s), Passed: 3 test(s), Total: 3 test(s)
Name: TestRegisters
Failed: 0 test(s), Passed: 21 test(s), Total: 21 test(s)
Name: TestRegistersIterator
Failed: 0 test(s), Passed: 3 test(s), Total: 3 test(s)
Name: TestReportData
Failed: 0 test(s), Passed: 3 test(s), Total: 3 test(s)
Name: TestRerun
Failed: 0 test(s), Passed: 3 test(s), Total: 3 test(s)
Name: TestReturnValue
Failed: 0 test(s), Passed: 3 test(s), Total: 3 test(s)
Name: TestRvalueReferences
Failed: 0 test(s), Passed: 3 test(s), Total: 3 test(s)
Name: TestSBData
Failed: 0 test(s), Passed: 3 test(s), Total: 3 test(s)
Name: TestSBFrameFindValue
Failed: 0 test(s), Passed: 3 test(s), Total: 3 test(s)
Name: TestSBValuePersist
Failed: 0 test(s), Passed: 3 test(s), Total: 3 test(s)
Name: TestSBValueUpdates
Failed: 0 test(s), Passed: 3 test(s), Total: 3 test(s)
Name: TestSTL
Failed: 0 test(s), Passed: 6 test(s), Total: 6 test(s)
Name: TestSTTYBeforeAndAfter
Failed: 0 test(s), Passed: 0 test(s), Total: 1 test(s)
Name: TestSaveJITObjects
Failed: 0 test(s), Passed: 3 test(s), Total: 3 test(s)
Name: TestSectionAPI
Failed: 0 test(s), Passed: 3 test(s), Total: 3 test(s)
Name: TestSendSignal
Failed: 0 test(s), Passed: 3 test(s), Total: 3 test(s)
Name: TestSequenceFunctions
Failed: 0 test(s), Passed: 3 test(s), Total: 3 test(s)
Name: TestSetValues
Failed: 0 test(s), Passed: 3 test(s), Total: 3 test(s)
Name: TestSetWatchlocation
Failed: 0 test(s), Passed: 3 test(s), Total: 3 test(s)
Name: TestSetWatchpoint
Failed: 0 test(s), Passed: 3 test(s), Total: 3 test(s)
Name: TestSettings
Failed: 0 test(s), Passed: 29 test(s), Total: 29 test(s)
Name: TestSharedLib
Failed: 0 test(s), Passed: 6 test(s), Total: 6 test(s)
Name: TestSharedLibStrippedSymbols
Failed: 0 test(s), Passed: 6 test(s), Total: 6 test(s)
Name: TestSignalsAPI
Failed: 0 test(s), Passed: 3 test(s), Total: 3 test(s)
Name: TestSignedTypes
Failed: 0 test(s), Passed: 3 test(s), Total: 3 test(s)
Name: TestSimpleExpressions
Failed: 0 test(s), Passed: 3 test(s), Total: 3 test(s)
Name: TestSingleQuoteInFilename
Failed: 0 test(s), Passed: 1 test(s), Total: 1 test(s)
Name: TestSourceManager
Failed: 0 test(s), Passed: 12 test(s), Total: 12 test(s)
Name: TestSourceRegexBreakpoints
Failed: 0 test(s), Passed: 6 test(s), Total: 6 test(s)
Name: TestStaticVariables
Failed: 0 test(s), Passed: 6 test(s), Total: 6 test(s)
Name: TestStepAndBreakpoints
Failed: 0 test(s), Passed: 3 test(s), Total: 3 test(s)
Name: TestStepNoDebug
Failed: 0 test(s), Passed: 9 test(s), Total: 9 test(s)
Name: TestStepOverWatchpoint
Failed: 0 test(s), Passed: 3 test(s), Total: 3 test(s)
Name: TestStepTarget
Failed: 0 test(s), Passed: 15 test(s), Total: 15 test(s)
Name: TestStopHookCmd
Failed: 0 test(s), Passed: 4 test(s), Total: 4 test(s)
Name: TestStopHookMechanism
Failed: 0 test(s), Passed: 3 test(s), Total: 3 test(s)
Name: TestStopHookMultipleThreads
Failed: 0 test(s), Passed: 3 test(s), Total: 3 test(s)
Name: TestStubReverseConnect
Failed: 0 test(s), Passed: 1 test(s), Total: 1 test(s)
Name: TestStubSetSID
Failed: 0 test(s), Passed: 3 test(s), Total: 3 test(s)
Name: TestSwiftAnyObjectType
Failed: 0 test(s), Passed: 3 test(s), Total: 3 test(s)
Name: TestSwiftAnyType
Failed: 0 test(s), Passed: 3 test(s), Total: 3 test(s)
Name: TestSwiftArchetypeResolution
Failed: 0 test(s), Passed: 3 test(s), Total: 3 test(s)
Name: TestSwiftArrayType
Failed: 0 test(s), Passed: 3 test(s), Total: 3 test(s)
Name: TestSwiftBacktracePrinting
Failed: 0 test(s), Passed: 3 test(s), Total: 3 test(s)
Name: TestSwiftBreakByPartialName
Failed: 0 test(s), Passed: 3 test(s), Total: 3 test(s)
Name: TestSwiftClassTypes
Failed: 0 test(s), Passed: 3 test(s), Total: 3 test(s)
Name: TestSwiftConditionalBreakpoint
Failed: 0 test(s), Passed: 3 test(s), Total: 3 test(s)
Name: TestSwiftDynamicValue
Failed: 0 test(s), Passed: 3 test(s), Total: 3 test(s)
Name: TestSwiftExpressionsInClassFunctions
Failed: 0 test(s), Passed: 3 test(s), Total: 3 test(s)
Name: TestSwiftExpressionsInMethodsPureSwift
Failed: 0 test(s), Passed: 3 test(s), Total: 3 test(s)
Name: TestSwiftFixIts
Failed: 0 test(s), Passed: 3 test(s), Total: 3 test(s)
Name: TestSwiftGenericEnums
Failed: 0 test(s), Passed: 3 test(s), Total: 3 test(s)
Name: TestSwiftGenericExpressions
Failed: 0 test(s), Passed: 6 test(s), Total: 6 test(s)
Name: TestSwiftGenericTupleLabels
Failed: 0 test(s), Passed: 3 test(s), Total: 3 test(s)
Name: TestSwiftGenericTypes
Failed: 0 test(s), Passed: 3 test(s), Total: 3 test(s)
Name: TestSwiftGenericsResolution
Failed: 0 test(s), Passed: 3 test(s), Total: 3 test(s)
Name: TestSwiftGetValueAsUnsigned
Failed: 0 test(s), Passed: 3 test(s), Total: 3 test(s)
Name: TestSwiftGlobals
Failed: 0 test(s), Passed: 3 test(s), Total: 3 test(s)
Name: TestSwiftHideRuntimeSupport
Failed: 0 test(s), Passed: 3 test(s), Total: 3 test(s)
Name: TestSwiftInstancePointerSetSP
Failed: 0 test(s), Passed: 3 test(s), Total: 3 test(s)
Name: TestSwiftLetInt
Failed: 0 test(s), Passed: 3 test(s), Total: 3 test(s)
Name: TestSwiftMetadataSymbols
Failed: 0 test(s), Passed: 3 test(s), Total: 3 test(s)
Name: TestSwiftMetadataSymbolsType
Failed: 0 test(s), Passed: 3 test(s), Total: 3 test(s)
Name: TestSwiftMetatype
Failed: 0 test(s), Passed: 3 test(s), Total: 3 test(s)
Name: TestSwiftMultipayloadEnum
Failed: 0 test(s), Passed: 3 test(s), Total: 3 test(s)
Name: TestSwiftNestedArray
Failed: 0 test(s), Passed: 3 test(s), Total: 3 test(s)
Name: TestSwiftOneCaseEnum
Failed: 0 test(s), Passed: 3 test(s), Total: 3 test(s)
Name: TestSwiftOptionals
Failed: 0 test(s), Passed: 3 test(s), Total: 3 test(s)
Name: TestSwiftPrivateDeclName
Failed: 0 test(s), Passed: 3 test(s), Total: 3 test(s)
Name: TestSwiftPrivateTypeAlias
Failed: 0 test(s), Passed: 3 test(s), Total: 3 test(s)
Name: TestSwiftProtocolTypes
Failed: 0 test(s), Passed: 3 test(s), Total: 3 test(s)
Name: TestSwiftRangeTypes
Failed: 0 test(s), Passed: 3 test(s), Total: 3 test(s)
Name: TestSwiftReferenceStorageTypes
Failed: 0 test(s), Passed: 3 test(s), Total: 3 test(s)
Name: TestSwiftReturns
Failed: 0 test(s), Passed: 0 test(s), Total: 3 test(s)
Name: TestSwiftStaticStringVariables
Failed: 0 test(s), Passed: 3 test(s), Total: 3 test(s)
Name: TestSwiftStdlibDictionary
Failed: 0 test(s), Passed: 0 test(s), Total: 3 test(s)
Name: TestSwiftStdlibSet
Failed: 0 test(s), Passed: 3 test(s), Total: 3 test(s)
Name: TestSwiftStepping
Failed: 0 test(s), Passed: 3 test(s), Total: 3 test(s)
Name: TestSwiftStringVariables
Failed: 0 test(s), Passed: 3 test(s), Total: 3 test(s)
Name: TestSwiftStructChangeRerun
Failed: 0 test(s), Passed: 0 test(s), Total: 3 test(s)
Name: TestSwiftStructInit
Failed: 0 test(s), Passed: 3 test(s), Total: 3 test(s)
Name: TestSwiftTupleTypes
Failed: 0 test(s), Passed: 3 test(s), Total: 3 test(s)
Name: TestSwiftTypeAliasFormatters
Failed: 0 test(s), Passed: 3 test(s), Total: 3 test(s)
Name: TestSwiftTypeLookup
Failed: 0 test(s), Passed: 3 test(s), Total: 3 test(s)
Name: TestSwiftTypeMetadata
Failed: 0 test(s), Passed: 3 test(s), Total: 3 test(s)
Name: TestSwiftTypes
Failed: 0 test(s), Passed: 3 test(s), Total: 3 test(s)
Name: TestSwiftValueOfOptionals
Failed: 0 test(s), Passed: 3 test(s), Total: 3 test(s)
Name: TestSymbolAPI
Failed: 0 test(s), Passed: 3 test(s), Total: 3 test(s)
Name: TestSymbolContext
Failed: 0 test(s), Passed: 3 test(s), Total: 3 test(s)
Name: TestSymbolContextTwoFiles
Failed: 0 test(s), Passed: 3 test(s), Total: 3 test(s)
Name: TestSyntheticCapping
Failed: 0 test(s), Passed: 3 test(s), Total: 3 test(s)
Name: TestTargetAPI
Failed: 0 test(s), Passed: 30 test(s), Total: 30 test(s)
Name: TestTargetCommand
Failed: 0 test(s), Passed: 9 test(s), Total: 9 test(s)
Name: TestTargetWatchAddress
Failed: 0 test(s), Passed: 6 test(s), Total: 6 test(s)
Name: TestTemplateArgs
Failed: 0 test(s), Passed: 6 test(s), Total: 6 test(s)
Name: TestThreadAPI
Failed: 0 test(s), Passed: 15 test(s), Total: 15 test(s)
Name: TestThreadExit
Failed: 0 test(s), Passed: 3 test(s), Total: 3 test(s)
Name: TestThreadJump
Failed: 0 test(s), Passed: 3 test(s), Total: 3 test(s)
Name: TestThreadSpecificBpPlusCondition
Failed: 0 test(s), Passed: 3 test(s), Total: 3 test(s)
Name: TestThreadSpecificBreakpoint
Failed: 0 test(s), Passed: 3 test(s), Total: 3 test(s)
Name: TestThreadStates
Failed: 0 test(s), Passed: 15 test(s), Total: 15 test(s)
Name: TestThreadStepOut
Failed: 0 test(s), Passed: 0 test(s), Total: 9 test(s)
Name: TestThreadStepping
Failed: 0 test(s), Passed: 3 test(s), Total: 3 test(s)
Name: TestTlsGlobals
Failed: 0 test(s), Passed: 3 test(s), Total: 3 test(s)
Name: TestTopLevelExprs
Failed: 0 test(s), Passed: 2 test(s), Total: 3 test(s)
Name: TestTsanBasic
Failed: 0 test(s), Passed: 3 test(s), Total: 3 test(s)
Name: TestTsanCPPGlobalLocation
Failed: 0 test(s), Passed: 3 test(s), Total: 3 test(s)
Name: TestTsanGlobalLocation
Failed: 0 test(s), Passed: 3 test(s), Total: 3 test(s)
Name: TestTsanMultiple
Failed: 0 test(s), Passed: 3 test(s), Total: 3 test(s)
Name: TestTsanSwift
Failed: 0 test(s), Passed: 0 test(s), Total: 3 test(s)
Name: TestTsanThreadLeak
Failed: 0 test(s), Passed: 3 test(s), Total: 3 test(s)
Name: TestTsanThreadNumbers
Failed: 0 test(s), Passed: 3 test(s), Total: 3 test(s)
Name: TestTypeCompletion
Failed: 0 test(s), Passed: 3 test(s), Total: 3 test(s)
Name: TestTypeList
Failed: 0 test(s), Passed: 3 test(s), Total: 3 test(s)
Name: TestTypeSummaryListArg
Failed: 0 test(s), Passed: 1 test(s), Total: 1 test(s)
Name: TestTypeSummaryListScript
Failed: 0 test(s), Passed: 3 test(s), Total: 3 test(s)
Name: TestUnicodeLiterals
Failed: 0 test(s), Passed: 9 test(s), Total: 9 test(s)
Name: TestUnionMembers
Failed: 0 test(s), Passed: 3 test(s), Total: 3 test(s)
Name: TestUniqueTypes
Failed: 0 test(s), Passed: 3 test(s), Total: 3 test(s)
Name: TestUnsignedTypes
Failed: 0 test(s), Passed: 3 test(s), Total: 3 test(s)
Name: TestUnwindExpression
Failed: 0 test(s), Passed: 3 test(s), Total: 3 test(s)
Name: TestUserFormatVsSummary
Failed: 0 test(s), Passed: 3 test(s), Total: 3 test(s)
Name: TestValueAPI
Failed: 0 test(s), Passed: 3 test(s), Total: 3 test(s)
Name: TestValueAPILinkedList
Failed: 0 test(s), Passed: 3 test(s), Total: 3 test(s)
Name: TestValueMD5Crash
Failed: 0 test(s), Passed: 3 test(s), Total: 3 test(s)
Name: TestValueObjectRecursion
Failed: 0 test(s), Passed: 3 test(s), Total: 3 test(s)
Name: TestValueOfVectorVariable
Failed: 0 test(s), Passed: 3 test(s), Total: 3 test(s)
Name: TestValueVarUpdate
Failed: 0 test(s), Passed: 3 test(s), Total: 3 test(s)
Name: TestVarInAggregateMisuse
Failed: 0 test(s), Passed: 3 test(s), Total: 3 test(s)
Name: TestVectorTypesFormatting
Failed: 0 test(s), Passed: 3 test(s), Total: 3 test(s)
Name: TestVirtual
Failed: 0 test(s), Passed: 3 test(s), Total: 3 test(s)
Name: TestWatchLocation
Failed: 0 test(s), Passed: 3 test(s), Total: 3 test(s)
Name: TestWatchLocationWithWatchSet
Failed: 0 test(s), Passed: 3 test(s), Total: 3 test(s)
Name: TestWatchedVarHitWhenInScope
Failed: 0 test(s), Passed: 3 test(s), Total: 3 test(s)
Name: TestWatchpointCommandLLDB
Failed: 0 test(s), Passed: 6 test(s), Total: 6 test(s)
Name: TestWatchpointCommandPython
Failed: 0 test(s), Passed: 6 test(s), Total: 6 test(s)
Name: TestWatchpointCommands
Failed: 0 test(s), Passed: 15 test(s), Total: 15 test(s)
Name: TestWatchpointConditionAPI
Failed: 0 test(s), Passed: 3 test(s), Total: 3 test(s)
Name: TestWatchpointConditionCmd
Failed: 0 test(s), Passed: 3 test(s), Total: 3 test(s)
Name: TestWatchpointEvents
Failed: 0 test(s), Passed: 3 test(s), Total: 3 test(s)
Name: TestWatchpointIgnoreCount
Failed: 0 test(s), Passed: 3 test(s), Total: 3 test(s)
Name: TestWatchpointIter
Failed: 0 test(s), Passed: 3 test(s), Total: 3 test(s)
Name: TestWatchpointMultipleThreads
Failed: 0 test(s), Passed: 6 test(s), Total: 6 test(s)
Name: TestWatchpointSetErrorCases
Failed: 0 test(s), Passed: 3 test(s), Total: 3 test(s)
Name: TestWatchpointSizes
Failed: 0 test(s), Passed: 3 test(s), Total: 3 test(s)
Name: TestWithLimitDebugInfo
Failed: 0 test(s), Passed: 1 test(s), Total: 3 test(s)
Name: TestWithModuleDebugging
Failed: 0 test(s), Passed: 1 test(s), Total: 1 test(s)
Name: TestWow64MiniDump
Failed: 0 test(s), Passed: 0 test(s), Total: 3 test(s)
Name: Testtypedef
Failed: 0 test(s), Passed: 3 test(s), Total: 3 test(s)
Name: lldbsuite.test.lldbtest
Failed: 3 test(s), Passed: 124 test(s), Total: 151 test(s)
Failed: lldbsuite.test.lldbtest.TestSwiftAssociatedSelfType.test_with_dwarf <https://ci.swift.org/job/oss-lldb-incremental-linux-ubuntu-15_10/6231/testReport/junit/lldbsuite.test.lldbtest/TestSwiftAssociatedSelfType/test_with_dwarf>
Failed: lldbsuite.test.lldbtest.TestSwiftAssociatedSelfType.test_with_dwo <https://ci.swift.org/job/oss-lldb-incremental-linux-ubuntu-15_10/6231/testReport/junit/lldbsuite.test.lldbtest/TestSwiftAssociatedSelfType/test_with_dwo>
Failed: lldbsuite.test.lldbtest.TestSwiftAssociatedSelfType.test_with_gmodules <https://ci.swift.org/job/oss-lldb-incremental-linux-ubuntu-15_10/6231/testReport/junit/lldbsuite.test.lldbtest/TestSwiftAssociatedSelfType/test_with_gmodules>

Changes

Commit 58ca217e8d19e44c3598b0acff33c7bac11c3cf3 by beanz:
[CMake] Fix bad dependency in symlink_clang_headers

edit: stdlib/public/SwiftShims/CMakeLists.txt
edit: cmake/modules/SwiftComponents.cmake

Commit 6a1d11bba2058924f03f8b131b176ac10e9f361c by egranata:
Teach TypeReconstruction how to look through associated types of the

edit: lib/IDE/TypeReconstruction.cpp

Commit fa01a4fa0273ca648b6a652d2550b1fc8fa710d0 by egranata:
Add a test case for LLDB to be able to resolve associated types in

add: packages/Python/lldbsuite/test/lang/swift/associated_self_type/TestSwiftAssociatedSelfType.py
add: packages/Python/lldbsuite/test/lang/swift/associated_self_type/main.swift
add: packages/Python/lldbsuite/test/lang/swift/associated_self_type/Makefile

Thanks,
- Enrico
:envelope_with_arrow: egranata@.com :phone:️ 27683

_______________________________________________
swift-lldb-dev mailing list
swift-lldb-dev@swift.org <mailto:swift-lldb-dev@swift.org>
https://lists.swift.org/mailman/listinfo/swift-lldb-dev

_______________________________________________
swift-lldb-dev mailing list
swift-lldb-dev@swift.org <mailto:swift-lldb-dev@swift.org>
https://lists.swift.org/mailman/listinfo/swift-lldb-dev

Thanks,
- Enrico
:envelope_with_arrow: egranata@ <about:blank> <about:blank>.com <about:blank> :phone:️ 27683

_______________________________________________
swift-lldb-dev mailing list
swift-lldb-dev@swift.org <mailto:swift-lldb-dev@swift.org>
https://lists.swift.org/mailman/listinfo/swift-lldb-dev