[Swift CI] Build Failure: 0. OSS - LLDB Incremental - Ubuntu 15.10 (master) #3830


(Todd Fiala) #1

I've just wiped all the LLDB builders. I think this might be a stale .pyc
file issue. If it comes back failing on the next build, I'll revert and
figure out what's busted. (This is building cleanly locally).

···

On Fri, May 13, 2016 at 8:05 PM, <no-reply@swift.org> wrote:

[FAILURE] oss-lldb-incremental-linux-ubuntu-15_10 [#3830]
Build URL:
https://ci.swift.org/job/oss-lldb-incremental-linux-ubuntu-15_10/3830/
Project: oss-lldb-incremental-linux-ubuntu-15_10
Date of build: Fri, 13 May 2016 20:05:17 -0700
Build duration: 32 sec
Changes

   - Commit *cda8109c8777b9981dd5a8d4f905486e28263489* by *todd.fiala:*

   fix argument usage for '-#' command line option
   - *edit*: packages/Python/lldbsuite/test/dotest.py

   - Commit *3aa03e0b7abc5af32f22e9fd0dfac5f6f9554576* by *todd.fiala:*

   test infra: move test event-related handling into its own package
   - *edit*: packages/Python/lldbsuite/test/decorators.py
      - *edit*: packages/Python/lldbsuite/test/lldbtest.py
      - *add*:
      packages/Python/lldbsuite/test_event/formatter/dump_formatter.py
      - *add*: packages/Python/lldbsuite/test_event/formatter/pickled.py
      - *delete*: packages/Python/lldbsuite/test/dotest_channels.py
      - *edit*: packages/Python/lldbsuite/test/dotest.py
      - *add*: packages/Python/lldbsuite/test_event/event_builder.py
      - *edit*: packages/Python/lldbsuite/test/test_result.py
      - *delete*: packages/Python/lldbsuite/test/curses_results.py
      - *delete*: packages/Python/lldbsuite/test/result_formatter.py
      - *edit*: packages/Python/lldbsuite/test/dosep.py
      - *add*:
      packages/Python/lldbsuite/test_event/formatter/results_formatter.py
      - *delete*: packages/Python/lldbsuite/test/xunit_formatter.py
      - *add*: packages/Python/lldbsuite/test_event/formatter/__init__.py
      - *add*: packages/Python/lldbsuite/test_event/formatter/curses.py
      - *add*: packages/Python/lldbsuite/test_event/formatter/xunit.py
      - *add*: packages/Python/lldbsuite/test_event/__init__.py
      - *add*: packages/Python/lldbsuite/test_event/dotest_channels.py

   - Commit *957a38bfc2e281ca40c059562e2fa01f4f65d753* by *todd.fiala:*

   test infra: catch bad decorators and import-time errors
   - *edit*: packages/Python/lldbsuite/test_event/formatter/xunit.py
      - *add*:
      packages/Python/lldbsuite/test/issue_verification/TestInvalidDecorator.py.park
      - *edit*: packages/Python/lldbsuite/test/dotest.py
      - *edit*: packages/Python/lldbsuite/test_event/formatter/__init__.py
      - *edit*: packages/Python/lldbsuite/test_event/formatter/curses.py
      - *add*:
      packages/Python/lldbsuite/test_event/test/src/event_collector.py
      - *edit*: packages/Python/lldbsuite/test_event/event_builder.py
      - *edit*: packages/Python/lldbsuite/test_event/formatter/pickled.py
      - *edit*:
      packages/Python/lldbsuite/test_event/formatter/results_formatter.py
      - *add*:
      packages/Python/lldbsuite/test_event/test/resources/invalid_decorator/TestInvalidDecorator.py
      - *add*:
      packages/Python/lldbsuite/test_event/test/src/TestCatchInvalidDecorator.py

   - Commit *dd846fa3cf56e3baf139deae5f5fd9659ee31bff* by *todd.fiala:*

   surface build error content through test event system
   - *edit*: packages/Python/lldbsuite/test/plugins/builder_base.py
      - *add*: packages/Python/lldbsuite/test_event/build_exception.py
      - *edit*: packages/Python/lldbsuite/test_event/formatter/xunit.py
      - *edit*: packages/Python/lldbsuite/test_event/formatter/curses.py
      - *edit*: packages/Python/lldbsuite/test_event/event_builder.py
      - *edit*: packages/Python/lldbsuite/test/plugins/builder_darwin.py
      - *edit*: packages/Python/lldbsuite/test/test_result.py
      - *edit*: packages/Python/lldbsuite/test/lldbtest.py

--
-Todd


(Todd Fiala) #2

That didn't work.

Reverting them now, then will use PR checking to figure out what's busted.

···

On Fri, May 13, 2016 at 8:11 PM, Todd Fiala <todd.fiala@gmail.com> wrote:

I've just wiped all the LLDB builders. I think this might be a stale .pyc
file issue. If it comes back failing on the next build, I'll revert and
figure out what's busted. (This is building cleanly locally).

On Fri, May 13, 2016 at 8:05 PM, <no-reply@swift.org> wrote:

[FAILURE] oss-lldb-incremental-linux-ubuntu-15_10 [#3830]
Build URL:
https://ci.swift.org/job/oss-lldb-incremental-linux-ubuntu-15_10/3830/
Project: oss-lldb-incremental-linux-ubuntu-15_10
Date of build: Fri, 13 May 2016 20:05:17 -0700
Build duration: 32 sec
Changes

   - Commit *cda8109c8777b9981dd5a8d4f905486e28263489* by *todd.fiala:*

   fix argument usage for '-#' command line option
   - *edit*: packages/Python/lldbsuite/test/dotest.py

   - Commit *3aa03e0b7abc5af32f22e9fd0dfac5f6f9554576* by *todd.fiala:*

   test infra: move test event-related handling into its own package
   - *edit*: packages/Python/lldbsuite/test/decorators.py
      - *edit*: packages/Python/lldbsuite/test/lldbtest.py
      - *add*:
      packages/Python/lldbsuite/test_event/formatter/dump_formatter.py
      - *add*: packages/Python/lldbsuite/test_event/formatter/pickled.py
      - *delete*: packages/Python/lldbsuite/test/dotest_channels.py
      - *edit*: packages/Python/lldbsuite/test/dotest.py
      - *add*: packages/Python/lldbsuite/test_event/event_builder.py
      - *edit*: packages/Python/lldbsuite/test/test_result.py
      - *delete*: packages/Python/lldbsuite/test/curses_results.py
      - *delete*: packages/Python/lldbsuite/test/result_formatter.py
      - *edit*: packages/Python/lldbsuite/test/dosep.py
      - *add*:
      packages/Python/lldbsuite/test_event/formatter/results_formatter.py
      - *delete*: packages/Python/lldbsuite/test/xunit_formatter.py
      - *add*: packages/Python/lldbsuite/test_event/formatter/__init__.py
      - *add*: packages/Python/lldbsuite/test_event/formatter/curses.py
      - *add*: packages/Python/lldbsuite/test_event/formatter/xunit.py
      - *add*: packages/Python/lldbsuite/test_event/__init__.py
      - *add*: packages/Python/lldbsuite/test_event/dotest_channels.py

   - Commit *957a38bfc2e281ca40c059562e2fa01f4f65d753* by *todd.fiala:*

   test infra: catch bad decorators and import-time errors
   - *edit*: packages/Python/lldbsuite/test_event/formatter/xunit.py
      - *add*:
      packages/Python/lldbsuite/test/issue_verification/TestInvalidDecorator.py.park
      - *edit*: packages/Python/lldbsuite/test/dotest.py
      - *edit*:
      packages/Python/lldbsuite/test_event/formatter/__init__.py
      - *edit*: packages/Python/lldbsuite/test_event/formatter/curses.py
      - *add*:
      packages/Python/lldbsuite/test_event/test/src/event_collector.py
      - *edit*: packages/Python/lldbsuite/test_event/event_builder.py
      - *edit*: packages/Python/lldbsuite/test_event/formatter/pickled.py
      - *edit*:
      packages/Python/lldbsuite/test_event/formatter/results_formatter.py
      - *add*:
      packages/Python/lldbsuite/test_event/test/resources/invalid_decorator/TestInvalidDecorator.py
      - *add*:
      packages/Python/lldbsuite/test_event/test/src/TestCatchInvalidDecorator.py

   - Commit *dd846fa3cf56e3baf139deae5f5fd9659ee31bff* by *todd.fiala:*

   surface build error content through test event system
   - *edit*: packages/Python/lldbsuite/test/plugins/builder_base.py
      - *add*: packages/Python/lldbsuite/test_event/build_exception.py
      - *edit*: packages/Python/lldbsuite/test_event/formatter/xunit.py
      - *edit*: packages/Python/lldbsuite/test_event/formatter/curses.py
      - *edit*: packages/Python/lldbsuite/test_event/event_builder.py
      - *edit*: packages/Python/lldbsuite/test/plugins/builder_darwin.py
      - *edit*: packages/Python/lldbsuite/test/test_result.py
      - *edit*: packages/Python/lldbsuite/test/lldbtest.py

--
-Todd

--
-Todd


(Todd Fiala) #3

Ah, I was misreading the error. There's a change in the swift build-script
that needs to come over for this to work.

Apologies in advance - I need to do a rev-locked change in the swift repo.
Doing that now. That will clear up the current error (even after two of
the four changes are reverted). Then I'll be able to reapply the other two
cherry picks.

I didn't see these locally since I run the test suite by hand.

···

On Fri, May 13, 2016 at 8:36 PM, Todd Fiala <todd.fiala@gmail.com> wrote:

That didn't work.

Reverting them now, then will use PR checking to figure out what's busted.

On Fri, May 13, 2016 at 8:11 PM, Todd Fiala <todd.fiala@gmail.com> wrote:

I've just wiped all the LLDB builders. I think this might be a stale
.pyc file issue. If it comes back failing on the next build, I'll revert
and figure out what's busted. (This is building cleanly locally).

On Fri, May 13, 2016 at 8:05 PM, <no-reply@swift.org> wrote:

[FAILURE] oss-lldb-incremental-linux-ubuntu-15_10 [#3830]
Build URL:
https://ci.swift.org/job/oss-lldb-incremental-linux-ubuntu-15_10/3830/
Project: oss-lldb-incremental-linux-ubuntu-15_10
Date of build: Fri, 13 May 2016 20:05:17 -0700
Build duration: 32 sec
Changes

   - Commit *cda8109c8777b9981dd5a8d4f905486e28263489* by *todd.fiala:*

   fix argument usage for '-#' command line option
   - *edit*: packages/Python/lldbsuite/test/dotest.py

   - Commit *3aa03e0b7abc5af32f22e9fd0dfac5f6f9554576* by *todd.fiala:*

   test infra: move test event-related handling into its own package
   - *edit*: packages/Python/lldbsuite/test/decorators.py
      - *edit*: packages/Python/lldbsuite/test/lldbtest.py
      - *add*:
      packages/Python/lldbsuite/test_event/formatter/dump_formatter.py
      - *add*: packages/Python/lldbsuite/test_event/formatter/pickled.py
      - *delete*: packages/Python/lldbsuite/test/dotest_channels.py
      - *edit*: packages/Python/lldbsuite/test/dotest.py
      - *add*: packages/Python/lldbsuite/test_event/event_builder.py
      - *edit*: packages/Python/lldbsuite/test/test_result.py
      - *delete*: packages/Python/lldbsuite/test/curses_results.py
      - *delete*: packages/Python/lldbsuite/test/result_formatter.py
      - *edit*: packages/Python/lldbsuite/test/dosep.py
      - *add*:
      packages/Python/lldbsuite/test_event/formatter/results_formatter.py
      - *delete*: packages/Python/lldbsuite/test/xunit_formatter.py
      - *add*:
      packages/Python/lldbsuite/test_event/formatter/__init__.py
      - *add*: packages/Python/lldbsuite/test_event/formatter/curses.py
      - *add*: packages/Python/lldbsuite/test_event/formatter/xunit.py
      - *add*: packages/Python/lldbsuite/test_event/__init__.py
      - *add*: packages/Python/lldbsuite/test_event/dotest_channels.py

   - Commit *957a38bfc2e281ca40c059562e2fa01f4f65d753* by *todd.fiala:*

   test infra: catch bad decorators and import-time errors
   - *edit*: packages/Python/lldbsuite/test_event/formatter/xunit.py
      - *add*:
      packages/Python/lldbsuite/test/issue_verification/TestInvalidDecorator.py.park
      - *edit*: packages/Python/lldbsuite/test/dotest.py
      - *edit*:
      packages/Python/lldbsuite/test_event/formatter/__init__.py
      - *edit*: packages/Python/lldbsuite/test_event/formatter/curses.py
      - *add*:
      packages/Python/lldbsuite/test_event/test/src/event_collector.py
      - *edit*: packages/Python/lldbsuite/test_event/event_builder.py
      - *edit*:
      packages/Python/lldbsuite/test_event/formatter/pickled.py
      - *edit*:
      packages/Python/lldbsuite/test_event/formatter/results_formatter.py
      - *add*:
      packages/Python/lldbsuite/test_event/test/resources/invalid_decorator/TestInvalidDecorator.py
      - *add*:
      packages/Python/lldbsuite/test_event/test/src/TestCatchInvalidDecorator.py

   - Commit *dd846fa3cf56e3baf139deae5f5fd9659ee31bff* by *todd.fiala:*

   surface build error content through test event system
   - *edit*: packages/Python/lldbsuite/test/plugins/builder_base.py
      - *add*: packages/Python/lldbsuite/test_event/build_exception.py
      - *edit*: packages/Python/lldbsuite/test_event/formatter/xunit.py
      - *edit*: packages/Python/lldbsuite/test_event/formatter/curses.py
      - *edit*: packages/Python/lldbsuite/test_event/event_builder.py
      - *edit*: packages/Python/lldbsuite/test/plugins/builder_darwin.py
      - *edit*: packages/Python/lldbsuite/test/test_result.py
      - *edit*: packages/Python/lldbsuite/test/lldbtest.py

--
-Todd

--
-Todd

--
-Todd