[Swift CI] Build Failure: 0. OSS - LLDB Incremental - Ubuntu 14.04 (master) #4850


(Enrico Granata) #1

[388/581] Building CXX object lib/SILOptimizer/CMakeFiles/swiftSILOptimizer.dir/LoopTransforms/LoopRotate.cpp.o
FAILED: /usr/bin/clang++ -DGTEST_HAS_RTTI=0 -D_DEBUG -D__STDC_CONSTANT_MACROS -D__STDC_FORMAT_MACROS -D__STDC_LIMIT_MACROS -Ilib/SILOptimizer -I/home/buildnode/jenkins/workspace/oss-lldb-incremental-linux-ubuntu-14_04/swift/lib/SILOptimizer -I/home/buildnode/jenkins/workspace/oss-lldb-incremental-linux-ubuntu-14_04/swift/include -Iinclude -I/home/buildnode/jenkins/workspace/oss-lldb-incremental-linux-ubuntu-14_04/llvm/include -I/home/buildnode/jenkins/workspace/oss-lldb-incremental-linux-ubuntu-14_04/Ninja-DebugAssert/llvm-linux-x86_64/include -I/home/buildnode/jenkins/workspace/oss-lldb-incremental-linux-ubuntu-14_04/Ninja-DebugAssert/llvm-linux-x86_64/tools/clang/include -I/home/buildnode/jenkins/workspace/oss-lldb-incremental-linux-ubuntu-14_04/llvm/tools/clang/include -I/home/buildnode/jenkins/workspace/oss-lldb-incremental-linux-ubuntu-14_04/cmark/src -I/home/buildnode/jenkins/workspace/oss-lldb-incremental-linux-ubuntu-14_04/Ninja-DebugAssert/cmark-linux-x86_64/src -fPIC -fvisibility-inlines-hidden -Wall -W -Wno-unused-parameter -Wwrite-strings -Wcast-qual -Wmissing-field-initializers -Wcovered-switch-default -Wnon-virtual-dtor -Wdelete-non-virtual-dtor -Werror=date-time -std=c++11 -fcolor-diagnostics -Wdocumentation -Wimplicit-fallthrough -Wunreachable-code -Woverloaded-virtual -g -fno-exceptions -fno-rtti -target x86_64-unknown-linux-gnu -O0 -g -UNDEBUG -MMD -MT lib/SILOptimizer/CMakeFiles/swiftSILOptimizer.dir/Utils/FunctionSignatureOptUtils.cpp.o -MF lib/SILOptimizer/CMakeFiles/swiftSILOptimizer.dir/Utils/FunctionSignatureOptUtils.cpp.o.d -o lib/SILOptimizer/CMakeFiles/swiftSILOptimizer.dir/Utils/FunctionSignatureOptUtils.cpp.o -c /home/buildnode/jenkins/workspace/oss-lldb-incremental-linux-ubuntu-14_04/swift/lib/SILOptimizer/Utils/FunctionSignatureOptUtils.cpp
fatal error: error in backend: IO failure on output stream.

Unlikely to be caused by an LLDB commit

···

On Aug 5, 2016, at 2:25 PM, no-reply@swift.org wrote:

[FAILURE] oss-lldb-incremental-linux-ubuntu-14_04 [#4850]

Build URL: https://ci.swift.org/job/oss-lldb-incremental-linux-ubuntu-14_04/4850/
Project: oss-lldb-incremental-linux-ubuntu-14_04
Date of build: Fri, 05 Aug 2016 13:55:37 -0700
Build duration: 30 min

Changes

Commit 97257082c3732e7284bd6bb8aaebcb2b15db49b3 by fs.output:
[README] Add package build status in README

edit: README.md

Commit 9e9a1b96c92cd7d2d1078fff1dc085b463545640 by milseman:
[noescape by default] Add @autoclosure @escaping syntax

edit: lib/Sema/TypeCheckType.cpp
edit: test/attr/attr_escaping.swift
edit: lib/AST/TypeRepr.cpp
edit: lib/Sema/TypeCheckAttr.cpp
edit: lib/Parse/ParseDecl.cpp
edit: test/SourceKit/CursorInfo/cursor_info.swift
edit: test/IDE/print_ast_tc_decls.swift
edit: include/swift/AST/DiagnosticsParse.def
edit: lib/AST/ASTPrinter.cpp
edit: test/attr/attr_autoclosure.swift
edit: include/swift/AST/Attr.h

Commit b7c9eddd11a1871a6f2e43ed43bfc3d7766c0cb8 by milseman:
[noescape by default] drop @noescape from stdlib

edit: stdlib/public/SDK/Foundation/IndexSet.swift
edit: stdlib/public/core/StringBridge.swift
edit: stdlib/public/core/SwiftNativeNSArray.swift
edit: stdlib/public/SDK/Foundation/Data.swift
edit: stdlib/public/core/MutableCollection.swift
edit: stdlib/private/StdlibUnittestFoundationExtras/StdlibUnittestFoundationExtras.swift
edit: stdlib/public/core/StaticString.swift
edit: stdlib/public/core/Flatten.swift.gyb
edit: stdlib/public/SDK/Foundation/URLRequest.swift
edit: stdlib/public/core/UnsafePointer.swift.gyb
edit: stdlib/public/core/LifetimeManager.swift
edit: stdlib/public/core/SliceBuffer.swift
edit: stdlib/public/core/SequenceAlgorithms.swift.gyb
edit: stdlib/public/SDK/XCTest/XCTest.swift
edit: stdlib/public/core/Runtime.swift.gyb
edit: stdlib/public/SDK/ObjectiveC/ObjectiveC.swift
edit: stdlib/public/SDK/Foundation/Boxing.swift
edit: stdlib/public/SDK/Foundation/Calendar.swift
edit: stdlib/public/core/String.swift
edit: stdlib/public/core/StringCore.swift
edit: stdlib/public/core/ArrayBufferProtocol.swift
edit: stdlib/public/core/CollectionAlgorithms.swift.gyb
edit: stdlib/public/core/SequenceWrapper.swift
edit: stdlib/public/core/ExistentialCollection.swift.gyb
edit: stdlib/public/core/Arrays.swift.gyb
edit: stdlib/private/StdlibCollectionUnittest/LoggingWrappers.swift.gyb
edit: stdlib/private/StdlibUnittest/RaceTest.swift
edit: stdlib/public/SDK/Dispatch/Private.swift
edit: stdlib/private/StdlibCollectionUnittest/CheckMutableCollectionType.swift.gyb
edit: stdlib/public/core/ArrayBuffer.swift
edit: stdlib/public/core/Unicode.swift
edit: stdlib/public/core/ContiguousArrayBuffer.swift
edit: stdlib/public/core/Optional.swift
edit: stdlib/public/SDK/Dispatch/Data.swift
edit: stdlib/public/SDK/Dispatch/Block.swift
edit: stdlib/public/core/Collection.swift
edit: stdlib/public/core/ImplicitlyUnwrappedOptional.swift
edit: stdlib/public/core/VarArgs.swift
edit: stdlib/public/core/Unmanaged.swift
edit: stdlib/public/SDK/Foundation/URL.swift
edit: stdlib/public/core/Sequence.swift
edit: stdlib/public/core/StringUTF8.swift
edit: stdlib/public/SDK/Dispatch/Queue.swift
edit: stdlib/public/SDK/Foundation/NSStringAPI.swift
edit: stdlib/public/core/StringLegacy.swift
edit: stdlib/public/core/ManagedBuffer.swift

Commit f48471ebd48ce39e5f3b575a81ddda7cd5929901 by milseman:
[noescape by default] purge tests of needless @noescape

edit: test/decl/func/rethrows.swift
edit: test/ClangModules/blocks_parse.swift
edit: test/SILOptimizer/inout_deshadow_integration.swift
edit: test/SILGen/functions.swift
edit: test/Constraints/closures.swift
edit: test/Constraints/diagnostics.swift
edit: test/IDE/complete_trailing_closure.swift
edit: test/IDE/print_module_without_deinit.swift
edit: test/SILGen/noescape_reabstraction.swift
edit: test/FixCode/fixits-apply.swift
edit: test/Prototypes/Algorithms.swift.gyb
edit: test/SILGen/closures.swift
edit: test/SILOptimizer/performance_inliner.sil
edit: test/decl/overload.swift
edit: test/FixCode/fixits-apply.swift.result
edit: test/Interpreter/protocol_extensions.swift
edit: test/Prototypes/Result.swift
edit: test/TypeCoercion/subtyping.swift
edit: test/SourceKit/CursorInfo/cursor_info.swift
edit: test/Prototypes/CollectionTransformers.swift
edit: test/DebugInfo/inout.swift
edit: test/Sema/diag_invalid_inout_captures.swift

Commit 49e0685151b0ae4b8babd9de240f6842ba886541 by milseman:
[noescape by default] drop superfluous @noescape from validation suite

edit: validation-test/compiler_crashers_2_fixed/0022-rdar21625478.swift
edit: validation-test/compiler_crashers_2_fixed/0027-rdar21514140.swift
edit: validation-test/stdlib/CollectionType.swift.gyb
edit: validation-test/compiler_crashers_2_fixed/0019-rdar21511651.swift
edit: validation-test/stdlib/SequenceType.swift.gyb
edit: validation-test/compiler_crashers_2_fixed/0020-rdar21598514.swift
edit: validation-test/compiler_crashers_2_fixed/0035-rdar22003613.swift

Commit caa9d67469702cdc8df37e2cfe8969e0c61846d0 by milseman:
[noescape by default] Emit deprecation warning/fixit for @noescape

edit: test/attr/attr_escaping.swift
edit: include/swift/AST/DiagnosticsParse.def
edit: CHANGELOG.md
edit: test/attr/attr_availability.swift
edit: lib/AST/ASTDumper.cpp
edit: lib/Parse/ParseDecl.cpp
edit: test/attr/attr_noescape.swift

Commit a29700ee7446f94dae6ff63817233bcfec82212b by milseman:
[noescape by default] Migration should apply @noescape deprecation

edit: lib/FrontendTool/FrontendTool.cpp

Commit 1d305f8ac84a5886470ba89bf13445efc039c67a by milseman:
Adjust diagnostic: s/@noescape/non-escaping/

edit: include/swift/AST/DiagnosticsSema.def
edit: test/Sema/diag_invalid_inout_captures.swift

Commit 8c3b582793f10598b452c8667ecdcc7b21171620 by milseman:
[noescape by default] Incorporate Slav's feedback

edit: test/decl/overload.swift
edit: lib/Parse/ParseDecl.cpp
edit: include/swift/AST/Attr.h
edit: lib/AST/ASTPrinter.cpp
edit: lib/Sema/TypeCheckType.cpp
edit: CHANGELOG.md
edit: test/attr/attr_autoclosure.swift
edit: lib/AST/TypeRepr.cpp

Commit 7ad3e838ba9c243a1d2c5fd5ab47eff56d891b6c by rjmccall:
Fix the source ranges of ill-formed precedence groups.

edit: lib/Parse/ParseDecl.cpp
add: test/decl/precedencegroup/parsing.swift

Commit 8d9535203b9ea6b50286eb3eadf296462dfc5387 by github:
Give a proper error when a member type is inaccessible. (#4033)

edit: test/Sema/accessibility_private.swift
edit: lib/Sema/CSDiag.cpp
edit: lib/Sema/TypeCheckType.cpp

Commit 92455aa3c5c9c76c89f4dd86325c40fb54c5dd1a by t.p.northover:
AArch64: don't assume all i128s are BUILD_PAIRs

edit: lib/Target/AArch64/AArch64ISelLowering.cpp
edit: test/CodeGen/AArch64/cmpxchg-O0.ll

Commit 194dab05a93b3cb511213d1f105a3428c28a6aab by egranata:
Add an helper function to SwiftASTContext to help detect optional

edit: source/Symbol/SwiftASTContext.cpp
edit: include/lldb/Symbol/SwiftASTContext.h

Thanks,
- Enrico
:envelope_with_arrow: egranata@.com :phone:️ 27683