[Swift CI] Build Failure: 0. OSS - LLDB Incremental - Ubuntu 14.04 (master) #2982


(Enrico Granata) #1

John,
is RemoteAST not on Linux?

lib/liblldbTarget.a(SwiftLanguageRuntime.cpp.o): In function `MetadataPromise':
/home/buildnode/jenkins/workspace/oss-lldb-incremental-linux-ubuntu-14_04/lldb/source/Target/SwiftLanguageRuntime.cpp:1211: undefined reference to `swift::remoteAST::RemoteASTContext::RemoteASTContext(swift::ASTContext&, std::shared_ptr<swift::remote::MemoryReader>)'
lib/liblldbTarget.a(SwiftLanguageRuntime.cpp.o): In function `lldb_private::SwiftLanguageRuntime::MetadataPromise::FulfillPromise()':
/home/buildnode/jenkins/workspace/oss-lldb-incremental-linux-ubuntu-14_04/lldb/source/Target/SwiftLanguageRuntime.cpp:1221: undefined reference to `swift::remoteAST::RemoteASTContext::getTypeForRemoteTypeMetadata(swift::remote::RemoteAddress)'
lib/liblldbTarget.a(SwiftLanguageRuntime.cpp.o): In function `std::default_delete<swift::remoteAST::RemoteASTContext>::operator()(swift::remoteAST::RemoteASTContext*) const':
/usr/bin/../lib/gcc/x86_64-linux-gnu/4.8/../../../../include/c++/4.8/bits/unique_ptr.h:67: undefined reference to `swift::remoteAST::RemoteASTContext::~RemoteASTContext()'
<>clang: error: linker command failed with exit code 1 (use -v to see invocation)

···

On Apr 22, 2016, at 3:30 PM, no-reply@swift.org wrote:

[FAILURE] oss-lldb-incremental-linux-ubuntu-14_04 [#2982]

Build URL: https://ci.swift.org/job/oss-lldb-incremental-linux-ubuntu-14_04/2982/
Project: oss-lldb-incremental-linux-ubuntu-14_04
Date of build: Fri, 22 Apr 2016 15:27:18 -0700
Build duration: 2 min 41 sec
Identified problems:

Compile Error: This build failed because of a compile error. Below is a list of all errors in the build log:
Indication 1 <https://ci.swift.org//job/oss-lldb-incremental-linux-ubuntu-14_04/2982/consoleFull#-1586822805ee1a197b-acac-4b17-83cf-a53b95139a76>
Tests:

Name: Test-rdar-12481949
Failed: 0 test(s), Passed: 2 test(s), Total: 2 test(s)
Name: Test-rdar-9974002
Failed: 0 test(s), Passed: 2 test(s), Total: 2 test(s)
Name: Test11588
Failed: 0 test(s), Passed: 2 test(s), Total: 2 test(s)
Name: Test8638051
Failed: 0 test(s), Passed: 2 test(s), Total: 2 test(s)
Name: TestAbbreviations
Failed: 0 test(s), Passed: 1 test(s), Total: 1 test(s)
Name: TestAddressBreakpoints
Failed: 0 test(s), Passed: 2 test(s), Total: 2 test(s)
Name: TestAnonymous
Failed: 0 test(s), Passed: 14 test(s), Total: 14 test(s)
Name: TestAproposWithProcess
Failed: 0 test(s), Passed: 2 test(s), Total: 2 test(s)
Name: TestArrayTypes
Failed: 0 test(s), Passed: 4 test(s), Total: 4 test(s)
Name: TestAttachDenied
Failed: 0 test(s), Passed: 2 test(s), Total: 2 test(s)
Name: TestAttachResume
Failed: 0 test(s), Passed: 2 test(s), Total: 2 test(s)
Name: TestAvoidBreakpointInDelaySlot
Failed: 0 test(s), Passed: 0 test(s), Total: 2 test(s)
Name: TestBSDArchives
Failed: 0 test(s), Passed: 2 test(s), Total: 2 test(s)
Name: TestBackticksWithoutATarget
Failed: 0 test(s), Passed: 1 test(s), Total: 1 test(s)
Name: TestBacktraceAll
Failed: 0 test(s), Passed: 2 test(s), Total: 2 test(s)
Name: TestBatchMode
Failed: 0 test(s), Passed: 6 test(s), Total: 6 test(s)
Name: TestBitfields
Failed: 0 test(s), Passed: 4 test(s), Total: 4 test(s)
Name: TestBreakpointAPI
Failed: 0 test(s), Passed: 2 test(s), Total: 2 test(s)
Name: TestBreakpointCaseSensitivity
Failed: 0 test(s), Passed: 0 test(s), Total: 2 test(s)
Name: TestBreakpointCommand
Failed: 0 test(s), Passed: 2 test(s), Total: 2 test(s)
Name: TestBreakpointCommandsFromPython
Failed: 0 test(s), Passed: 2 test(s), Total: 2 test(s)
Name: TestBreakpointConditions
Failed: 0 test(s), Passed: 6 test(s), Total: 6 test(s)
Name: TestBreakpointIDs
Failed: 0 test(s), Passed: 2 test(s), Total: 2 test(s)
Name: TestBreakpointIgnoreCount
Failed: 0 test(s), Passed: 4 test(s), Total: 4 test(s)
Name: TestBreakpointLanguage
Failed: 0 test(s), Passed: 4 test(s), Total: 4 test(s)
Name: TestBreakpointLocations
Failed: 0 test(s), Passed: 2 test(s), Total: 2 test(s)
Name: TestBreakpointOptions
Failed: 0 test(s), Passed: 2 test(s), Total: 2 test(s)
Name: TestBreakpointSetRestart
Failed: 0 test(s), Passed: 2 test(s), Total: 2 test(s)
Name: TestBreakpointsWithNoTargets
Failed: 0 test(s), Passed: 2 test(s), Total: 2 test(s)
Name: TestBuiltinTrap
Failed: 0 test(s), Passed: 2 test(s), Total: 2 test(s)
Name: TestBulkyEnumsVariables
Failed: 0 test(s), Passed: 2 test(s), Total: 2 test(s)
Name: TestCInlines
Failed: 0 test(s), Passed: 2 test(s), Total: 2 test(s)
Name: TestCPP11EnumTypes
Failed: 0 test(s), Passed: 16 test(s), Total: 16 test(s)
Name: TestCPPAuto
Failed: 0 test(s), Passed: 2 test(s), Total: 2 test(s)
Name: TestCPPBool
Failed: 0 test(s), Passed: 2 test(s), Total: 2 test(s)
Name: TestCPPBreakpointCommands
Failed: 0 test(s), Passed: 2 test(s), Total: 2 test(s)
Name: TestCPPBreakpointLocations
Failed: 0 test(s), Passed: 2 test(s), Total: 2 test(s)
Name: TestCPPExceptionBreakpoint
Failed: 0 test(s), Passed: 2 test(s), Total: 2 test(s)
Name: TestCPPExceptionBreakpoints
Failed: 0 test(s), Passed: 2 test(s), Total: 2 test(s)
Name: TestCPPStaticMethods
Failed: 0 test(s), Passed: 2 test(s), Total: 2 test(s)
Name: TestCPPThis
Failed: 0 test(s), Passed: 2 test(s), Total: 2 test(s)
Name: TestCStrings
Failed: 0 test(s), Passed: 2 test(s), Total: 2 test(s)
Name: TestCallCPPFunction
Failed: 0 test(s), Passed: 2 test(s), Total: 2 test(s)
Name: TestCallStdStringFunction
Failed: 0 test(s), Passed: 2 test(s), Total: 2 test(s)
Name: TestCallStopAndContinue
Failed: 0 test(s), Passed: 2 test(s), Total: 2 test(s)
Name: TestCallThatRestarts
Failed: 0 test(s), Passed: 2 test(s), Total: 2 test(s)
Name: TestCallUserAnonTypedef
Failed: 0 test(s), Passed: 2 test(s), Total: 2 test(s)
Name: TestCallUserDefinedFunction
Failed: 0 test(s), Passed: 2 test(s), Total: 2 test(s)
Name: TestCallWithTimeout
Failed: 0 test(s), Passed: 2 test(s), Total: 2 test(s)
Name: TestChangeProcessGroup
Failed: 0 test(s), Passed: 2 test(s), Total: 2 test(s)
Name: TestChangeValueAPI
Failed: 0 test(s), Passed: 2 test(s), Total: 2 test(s)
Name: TestChar1632T
Failed: 0 test(s), Passed: 2 test(s), Total: 2 test(s)
Name: TestClassTypes
Failed: 0 test(s), Passed: 8 test(s), Total: 8 test(s)
Name: TestClassTypesDisassembly
Failed: 0 test(s), Passed: 4 test(s), Total: 4 test(s)
Name: TestCommandHistory
Failed: 0 test(s), Passed: 1 test(s), Total: 1 test(s)
Name: TestCommandInterpreterAPI
Failed: 0 test(s), Passed: 2 test(s), Total: 2 test(s)
Name: TestCommandRegex
Failed: 0 test(s), Passed: 1 test(s), Total: 1 test(s)
Name: TestCommandScript
Failed: 0 test(s), Passed: 2 test(s), Total: 2 test(s)
Name: TestCommandSource
Failed: 0 test(s), Passed: 1 test(s), Total: 1 test(s)
Name: TestCommonShortSpellings
Failed: 0 test(s), Passed: 1 test(s), Total: 1 test(s)
Name: TestCompDirSymLink
Failed: 0 test(s), Passed: 6 test(s), Total: 6 test(s)
Name: TestCompletion
Failed: 0 test(s), Passed: 33 test(s), Total: 33 test(s)
Name: TestConcurrentEvents
Failed: 0 test(s), Passed: 58 test(s), Total: 58 test(s)
Name: TestConditionalBreak
Failed: 0 test(s), Passed: 4 test(s), Total: 4 test(s)
Name: TestConsecutiveBreakpoints
Failed: 0 test(s), Passed: 3 test(s), Total: 3 test(s)
Name: TestConvenienceVariables
Failed: 0 test(s), Passed: 2 test(s), Total: 2 test(s)
Name: TestCppChainedCalls
Failed: 0 test(s), Passed: 2 test(s), Total: 2 test(s)
Name: TestCppGlobalOperators
Failed: 0 test(s), Passed: 2 test(s), Total: 2 test(s)
Name: TestCppIncompleteTypes
Failed: 0 test(s), Passed: 4 test(s), Total: 4 test(s)
Name: TestCppNsImport
Failed: 0 test(s), Passed: 2 test(s), Total: 2 test(s)
Name: TestCppScope
Failed: 0 test(s), Passed: 2 test(s), Total: 2 test(s)
Name: TestCppValueCast
Failed: 0 test(s), Passed: 2 test(s), Total: 2 test(s)
Name: TestCrashDuringStep
Failed: 0 test(s), Passed: 2 test(s), Total: 2 test(s)
Name: TestCreateAfterAttach
Failed: 0 test(s), Passed: 4 test(s), Total: 4 test(s)
Name: TestCreateDuringInstructionStep
Failed: 0 test(s), Passed: 2 test(s), Total: 2 test(s)
Name: TestCxxWCharT
Failed: 0 test(s), Passed: 2 test(s), Total: 2 test(s)
Name: TestDataFormatterAdv
Failed: 0 test(s), Passed: 2 test(s), Total: 2 test(s)
Name: TestDataFormatterCategories
Failed: 0 test(s), Passed: 2 test(s), Total: 2 test(s)
Name: TestDataFormatterCpp
Failed: 0 test(s), Passed: 2 test(s), Total: 2 test(s)
Name: TestDataFormatterDisabling
Failed: 0 test(s), Passed: 2 test(s), Total: 2 test(s)
Name: TestDataFormatterEnumFormat
Failed: 0 test(s), Passed: 2 test(s), Total: 2 test(s)
Name: TestDataFormatterGlobals
Failed: 0 test(s), Passed: 2 test(s), Total: 2 test(s)
Name: TestDataFormatterHexCaps
Failed: 0 test(s), Passed: 2 test(s), Total: 2 test(s)
Name: TestDataFormatterLanguageCategoryUpdates
Failed: 0 test(s), Passed: 2 test(s), Total: 2 test(s)
Name: TestDataFormatterLibccIterator
Failed: 0 test(s), Passed: 0 test(s), Total: 2 test(s)
Name: TestDataFormatterLibccMap
Failed: 0 test(s), Passed: 0 test(s), Total: 2 test(s)
Name: TestDataFormatterLibccMultiMap
Failed: 0 test(s), Passed: 0 test(s), Total: 2 test(s)
Name: TestDataFormatterLibcxxList
Failed: 0 test(s), Passed: 0 test(s), Total: 2 test(s)
Name: TestDataFormatterLibcxxListLoop
Failed: 0 test(s), Passed: 0 test(s), Total: 2 test(s)
Name: TestDataFormatterLibcxxMultiSet
Failed: 0 test(s), Passed: 0 test(s), Total: 2 test(s)
Name: TestDataFormatterLibcxxSet
Failed: 0 test(s), Passed: 2 test(s), Total: 2 test(s)
Name: TestDataFormatterLibcxxString
Failed: 0 test(s), Passed: 0 test(s), Total: 2 test(s)
Name: TestDataFormatterLibcxxVBool
Failed: 0 test(s), Passed: 0 test(s), Total: 2 test(s)
Name: TestDataFormatterLibcxxVector
Failed: 0 test(s), Passed: 0 test(s), Total: 2 test(s)
Name: TestDataFormatterNamedSummaries
Failed: 0 test(s), Passed: 2 test(s), Total: 2 test(s)
Name: TestDataFormatterPythonSynth
Failed: 0 test(s), Passed: 4 test(s), Total: 4 test(s)
Name: TestDataFormatterRefPtrRecursion
Failed: 0 test(s), Passed: 2 test(s), Total: 2 test(s)
Name: TestDataFormatterScript
Failed: 0 test(s), Passed: 2 test(s), Total: 2 test(s)
Name: TestDataFormatterSkipSummary
Failed: 0 test(s), Passed: 2 test(s), Total: 2 test(s)
Name: TestDataFormatterSmartArray
Failed: 0 test(s), Passed: 2 test(s), Total: 2 test(s)
Name: TestDataFormatterStdIterator
Failed: 0 test(s), Passed: 2 test(s), Total: 2 test(s)
Name: TestDataFormatterStdList
Failed: 0 test(s), Passed: 2 test(s), Total: 2 test(s)
Name: TestDataFormatterStdMap
Failed: 0 test(s), Passed: 2 test(s), Total: 2 test(s)
Name: TestDataFormatterStdString
Failed: 0 test(s), Passed: 2 test(s), Total: 2 test(s)
Name: TestDataFormatterStdVBool
Failed: 0 test(s), Passed: 2 test(s), Total: 2 test(s)
Name: TestDataFormatterStdVector
Failed: 0 test(s), Passed: 2 test(s), Total: 2 test(s)
Name: TestDataFormatterSynth
Failed: 0 test(s), Passed: 2 test(s), Total: 2 test(s)
Name: TestDataFormatterSynthVal
Failed: 0 test(s), Passed: 2 test(s), Total: 2 test(s)
Name: TestDataFormatterUnordered
Failed: 0 test(s), Passed: 0 test(s), Total: 2 test(s)
Name: TestDataFormatterVarScriptFormatting
Failed: 0 test(s), Passed: 2 test(s), Total: 2 test(s)
Name: TestDeadStrip
Failed: 0 test(s), Passed: 1 test(s), Total: 1 test(s)
Name: TestDebugBreak
Failed: 0 test(s), Passed: 0 test(s), Total: 1 test(s)
Name: TestDebuggerAPI
Failed: 0 test(s), Passed: 3 test(s), Total: 3 test(s)
Name: TestDefaultCacheLineSize
Failed: 0 test(s), Passed: 0 test(s), Total: 2 test(s)
Name: TestDefaultConstructorForAPIObjects
Failed: 0 test(s), Passed: 34 test(s), Total: 34 test(s)
Name: TestDiamond
Failed: 0 test(s), Passed: 2 test(s), Total: 2 test(s)
Name: TestDisasmAPI
Failed: 0 test(s), Passed: 2 test(s), Total: 2 test(s)
Name: TestDisassembleBreakpoint
Failed: 0 test(s), Passed: 2 test(s), Total: 2 test(s)
Name: TestDisassembleRawData
Failed: 0 test(s), Passed: 1 test(s), Total: 1 test(s)
Name: TestDisassemble_VST1_64
Failed: 0 test(s), Passed: 0 test(s), Total: 1 test(s)
Name: TestDynamicValue
Failed: 0 test(s), Passed: 2 test(s), Total: 2 test(s)
Name: TestDynamicValueChildCount
Failed: 0 test(s), Passed: 2 test(s), Total: 2 test(s)
Name: TestEmulations
Failed: 0 test(s), Passed: 2 test(s), Total: 2 test(s)
Name: TestEnumTypes
Failed: 0 test(s), Passed: 2 test(s), Total: 2 test(s)
Name: TestEnumVariables
Failed: 0 test(s), Passed: 2 test(s), Total: 2 test(s)
Name: TestEvents
Failed: 0 test(s), Passed: 0 test(s), Total: 6 test(s)
Name: TestExitDuringStep
Failed: 0 test(s), Passed: 6 test(s), Total: 6 test(s)
Name: TestExprDoesntBlock
Failed: 0 test(s), Passed: 2 test(s), Total: 2 test(s)
Name: TestExprHelpExamples
Failed: 0 test(s), Passed: 2 test(s), Total: 2 test(s)
Name: TestExprInProtocolExtension
Failed: 0 test(s), Passed: 2 test(s), Total: 2 test(s)
Name: TestExprOptions
Failed: 0 test(s), Passed: 2 test(s), Total: 2 test(s)
Name: TestExpressionAccessControl
Failed: 0 test(s), Passed: 2 test(s), Total: 2 test(s)
Name: TestExpressionErrorBreakpoint
Failed: 0 test(s), Passed: 8 test(s), Total: 8 test(s)
Name: TestExpressionErrors
Failed: 0 test(s), Passed: 2 test(s), Total: 2 test(s)
Name: TestExpressionInSyscall
Failed: 0 test(s), Passed: 2 test(s), Total: 2 test(s)
Name: TestExpressionScopes
Failed: 0 test(s), Passed: 2 test(s), Total: 2 test(s)
Name: TestExprs
Failed: 0 test(s), Passed: 6 test(s), Total: 6 test(s)
Name: TestExprs2
Failed: 0 test(s), Passed: 2 test(s), Total: 2 test(s)
Name: TestExprsChar
Failed: 0 test(s), Passed: 4 test(s), Total: 4 test(s)
Name: TestFloatTypes
Failed: 0 test(s), Passed: 4 test(s), Total: 4 test(s)
Name: TestFloatTypesExpr
Failed: 0 test(s), Passed: 4 test(s), Total: 4 test(s)
Name: TestFormatPropagation
Failed: 0 test(s), Passed: 2 test(s), Total: 2 test(s)
Name: TestFormats
Failed: 0 test(s), Passed: 2 test(s), Total: 2 test(s)
Name: TestFormatters
Failed: 0 test(s), Passed: 2 test(s), Total: 2 test(s)
Name: TestFormattersSBAPI
Failed: 0 test(s), Passed: 4 test(s), Total: 4 test(s)
Name: TestForwardDeclaration
Failed: 0 test(s), Passed: 2 test(s), Total: 2 test(s)
Name: TestFrameFormatSmallStruct
Failed: 0 test(s), Passed: 2 test(s), Total: 2 test(s)
Name: TestFrameUtils
Failed: 0 test(s), Passed: 2 test(s), Total: 2 test(s)
Name: TestFrameVariableAnonymousUnions
Failed: 0 test(s), Passed: 2 test(s), Total: 2 test(s)
Name: TestFrames
Failed: 0 test(s), Passed: 6 test(s), Total: 6 test(s)
Name: TestFunctionTypes
Failed: 0 test(s), Passed: 4 test(s), Total: 4 test(s)
Name: TestFunctionVariables
Failed: 0 test(s), Passed: 2 test(s), Total: 2 test(s)
Name: TestGDBRemoteMemoryRead
Failed: 0 test(s), Passed: 2 test(s), Total: 2 test(s)
Name: TestGdbRemoteAbort
Failed: 0 test(s), Passed: 1 test(s), Total: 1 test(s)
Name: TestGdbRemoteAttach
Failed: 0 test(s), Passed: 1 test(s), Total: 1 test(s)
Name: TestGdbRemoteAuxvSupport
Failed: 0 test(s), Passed: 4 test(s), Total: 4 test(s)
Name: TestGdbRemoteExpeditedRegisters
Failed: 0 test(s), Passed: 5 test(s), Total: 5 test(s)
Name: TestGdbRemoteKill
Failed: 0 test(s), Passed: 1 test(s), Total: 1 test(s)
Name: TestGdbRemoteProcessInfo
Failed: 0 test(s), Passed: 5 test(s), Total: 5 test(s)
Name: TestGdbRemoteRegisterState
Failed: 0 test(s), Passed: 2 test(s), Total: 2 test(s)
Name: TestGdbRemoteSegFault
Failed: 0 test(s), Passed: 1 test(s), Total: 1 test(s)
Name: TestGdbRemoteSingleStep
Failed: 0 test(s), Passed: 1 test(s), Total: 1 test(s)
Name: TestGdbRemoteThreadsInStopReply
Failed: 0 test(s), Passed: 4 test(s), Total: 4 test(s)
Name: TestGdbRemote_qThreadStopInfo
Failed: 0 test(s), Passed: 3 test(s), Total: 4 test(s)
Name: TestGdbRemote_vCont
Failed: 0 test(s), Passed: 6 test(s), Total: 6 test(s)
Name: TestGlobalVariables
Failed: 0 test(s), Passed: 2 test(s), Total: 2 test(s)
Name: TestGoFormatters
Failed: 0 test(s), Passed: 0 test(s), Total: 1 test(s)
Name: TestGoroutines
Failed: 0 test(s), Passed: 0 test(s), Total: 1 test(s)
Name: TestHandleSegv
Failed: 0 test(s), Passed: 2 test(s), Total: 2 test(s)
Name: TestHelloWorld
Failed: 0 test(s), Passed: 6 test(s), Total: 6 test(s)
Name: TestHelp
Failed: 0 test(s), Passed: 18 test(s), Total: 18 test(s)
Name: TestImageListMultiArchitecture
Failed: 0 test(s), Passed: 1 test(s), Total: 1 test(s)
Name: TestImport
Failed: 0 test(s), Passed: 1 test(s), Total: 1 test(s)
Name: TestInOutVariables
Failed: 0 test(s), Passed: 2 test(s), Total: 2 test(s)
Name: TestIndexVariable
Failed: 0 test(s), Passed: 2 test(s), Total: 2 test(s)
Name: TestIndirectEnumVariables
Failed: 0 test(s), Passed: 2 test(s), Total: 2 test(s)
Name: TestInferiorAssert
Failed: 0 test(s), Passed: 12 test(s), Total: 12 test(s)
Name: TestInferiorChanged
Failed: 0 test(s), Passed: 2 test(s), Total: 2 test(s)
Name: TestInferiorCrashing
Failed: 0 test(s), Passed: 12 test(s), Total: 14 test(s)
Name: TestInlineStepping
Failed: 0 test(s), Passed: 0 test(s), Total: 6 test(s)
Name: TestInlinedBreakpoints
Failed: 0 test(s), Passed: 2 test(s), Total: 2 test(s)
Name: TestInlinedFrame
Failed: 0 test(s), Passed: 2 test(s), Total: 2 test(s)
Name: TestInlines
Failed: 0 test(s), Passed: 2 test(s), Total: 2 test(s)
Name: TestIntegerTypes
Failed: 0 test(s), Passed: 20 test(s), Total: 20 test(s)
Name: TestIntegerTypesExpr
Failed: 0 test(s), Passed: 20 test(s), Total: 20 test(s)
Name: TestJITLoaderGDB
Failed: 0 test(s), Passed: 0 test(s), Total: 2 test(s)
Name: TestLLDBIterator
Failed: 0 test(s), Passed: 6 test(s), Total: 6 test(s)
Name: TestLLVM
Failed: 0 test(s), Passed: 1 test(s), Total: 1 test(s)
Name: TestLazyReverse
Failed: 0 test(s), Passed: 1 test(s), Total: 1 test(s)
Name: TestLibCxxAtomic
Failed: 0 test(s), Passed: 0 test(s), Total: 2 test(s)
Name: TestLinuxCore
Failed: 0 test(s), Passed: 3 test(s), Total: 4 test(s)
Name: TestListener
Failed: 0 test(s), Passed: 2 test(s), Total: 2 test(s)
Name: TestLldbGdbServer
Failed: 0 test(s), Passed: 34 test(s), Total: 34 test(s)
Name: TestLoadUnload
Failed: 0 test(s), Passed: 10 test(s), Total: 10 test(s)
Name: TestLogging
Failed: 0 test(s), Passed: 4 test(s), Total: 4 test(s)
Name: TestMembersAndLocalsWithSameName
Failed: 0 test(s), Passed: 4 test(s), Total: 4 test(s)
Name: TestMemoryCache
Failed: 0 test(s), Passed: 2 test(s), Total: 2 test(s)
Name: TestMemoryRead
Failed: 0 test(s), Passed: 2 test(s), Total: 2 test(s)
Name: TestMiBreak
Failed: 0 test(s), Passed: 5 test(s), Total: 5 test(s)
Name: TestMiCliSupport
Failed: 0 test(s), Passed: 1 test(s), Total: 8 test(s)
Name: TestMiData
Failed: 0 test(s), Passed: 6 test(s), Total: 7 test(s)
Name: TestMiExec
Failed: 0 test(s), Passed: 8 test(s), Total: 8 test(s)
Name: TestMiExit
Failed: 0 test(s), Passed: 3 test(s), Total: 3 test(s)
Name: TestMiFile
Failed: 0 test(s), Passed: 4 test(s), Total: 4 test(s)
Name: TestMiGdbSetShow
Failed: 0 test(s), Passed: 4 test(s), Total: 5 test(s)
Name: TestMiGdbSetShowPrint
Failed: 0 test(s), Passed: 2 test(s), Total: 3 test(s)
Name: TestMiInterpreterExec
Failed: 0 test(s), Passed: 7 test(s), Total: 7 test(s)
Name: TestMiLibraryLoaded
Failed: 0 test(s), Passed: 1 test(s), Total: 1 test(s)
Name: TestMiPrompt
Failed: 0 test(s), Passed: 1 test(s), Total: 1 test(s)
Name: TestMiSignal
Failed: 0 test(s), Passed: 1 test(s), Total: 3 test(s)
Name: TestMiStack
Failed: 0 test(s), Passed: 6 test(s), Total: 6 test(s)
Name: TestMiStartupOptions
Failed: 0 test(s), Passed: 8 test(s), Total: 10 test(s)
Name: TestMiSyntax
Failed: 0 test(s), Passed: 2 test(s), Total: 2 test(s)
Name: TestMiTarget
Failed: 0 test(s), Passed: 0 test(s), Total: 3 test(s)
Name: TestMiVar
Failed: 0 test(s), Passed: 2 test(s), Total: 6 test(s)
Name: TestMiniDump
Failed: 0 test(s), Passed: 0 test(s), Total: 7 test(s)
Name: TestMixedLanguages
Failed: 0 test(s), Passed: 2 test(s), Total: 2 test(s)
Name: TestModuleAndSection
Failed: 0 test(s), Passed: 6 test(s), Total: 6 test(s)
Name: TestMultilevelArrays
Failed: 0 test(s), Passed: 1 test(s), Total: 1 test(s)
Name: TestMultipleDebuggersCommands
Failed: 0 test(s), Passed: 1 test(s), Total: 1 test(s)
Name: TestMultithreaded
Failed: 0 test(s), Passed: 0 test(s), Total: 8 test(s)
Name: TestMyFirstWatchpoint
Failed: 0 test(s), Passed: 2 test(s), Total: 2 test(s)
Name: TestNamespace
Failed: 0 test(s), Passed: 2 test(s), Total: 2 test(s)
Name: TestNestedAlias
Failed: 0 test(s), Passed: 2 test(s), Total: 2 test(s)
Name: TestNestedPersistentTypes
Failed: 0 test(s), Passed: 2 test(s), Total: 2 test(s)
Name: TestNoSuchArch
Failed: 0 test(s), Passed: 2 test(s), Total: 2 test(s)
Name: TestNoreturnUnwind
Failed: 0 test(s), Passed: 2 test(s), Total: 2 test(s)
Name: TestNumThreads
Failed: 0 test(s), Passed: 2 test(s), Total: 2 test(s)
Name: TestOverloadedFunctions
Failed: 0 test(s), Passed: 2 test(s), Total: 2 test(s)
Name: TestPaths
Failed: 0 test(s), Passed: 2 test(s), Total: 3 test(s)
Name: TestPersistentPtrUpdate
Failed: 0 test(s), Passed: 2 test(s), Total: 2 test(s)
Name: TestPersistentTypes
Failed: 0 test(s), Passed: 2 test(s), Total: 2 test(s)
Name: TestPersistentVariables
Failed: 0 test(s), Passed: 2 test(s), Total: 2 test(s)
Name: TestPlatformCommand
Failed: 0 test(s), Passed: 7 test(s), Total: 8 test(s)
Name: TestPlatformProcessConnect
Failed: 0 test(s), Passed: 0 test(s), Total: 1 test(s)
Name: TestPluginCommands
Failed: 0 test(s), Passed: 1 test(s), Total: 1 test(s)
Name: TestPrintStackTraces
Failed: 0 test(s), Passed: 2 test(s), Total: 2 test(s)
Name: TestPrintfAfterUp
Failed: 0 test(s), Passed: 2 test(s), Total: 2 test(s)
Name: TestProcessAPI
Failed: 0 test(s), Passed: 10 test(s), Total: 10 test(s)
Name: TestProcessAttach
Failed: 0 test(s), Passed: 4 test(s), Total: 4 test(s)
Name: TestProcessIO
Failed: 0 test(s), Passed: 10 test(s), Total: 10 test(s)
Name: TestProcessLaunch
Failed: 0 test(s), Passed: 4 test(s), Total: 4 test(s)
Name: TestProcessSaveCore
Failed: 0 test(s), Passed: 0 test(s), Total: 4 test(s)
Name: TestPtrRef2Typedef
Failed: 0 test(s), Passed: 2 test(s), Total: 2 test(s)
Name: TestPtrToArrayFormatting
Failed: 0 test(s), Passed: 2 test(s), Total: 2 test(s)
Name: TestPublicAPIHeaders
Failed: 0 test(s), Passed: 0 test(s), Total: 2 test(s)
Name: TestPythonOSPlugin
Failed: 0 test(s), Passed: 2 test(s), Total: 2 test(s)
Name: TestQuoting
Failed: 0 test(s), Passed: 11 test(s), Total: 11 test(s)
Name: TestREPLArray
Failed: 0 test(s), Passed: 1 test(s), Total: 1 test(s)
Name: TestREPLBasic
Failed: 0 test(s), Passed: 1 test(s), Total: 1 test(s)
Name: TestREPLClasses
Failed: 0 test(s), Passed: 1 test(s), Total: 1 test(s)
Name: TestREPLClosure
Failed: 0 test(s), Passed: 1 test(s), Total: 1 test(s)
Name: TestREPLDynamicType
Failed: 0 test(s), Passed: 1 test(s), Total: 1 test(s)
Name: TestREPLFunctionDefinition
Failed: 0 test(s), Passed: 1 test(s), Total: 1 test(s)
Name: TestREPLPOReplType
Failed: 0 test(s), Passed: 1 test(s), Total: 1 test(s)
Name: TestREPLQuickLookObject
Failed: 0 test(s), Passed: 1 test(s), Total: 1 test(s)
Name: TestREPLRecursiveClass
Failed: 0 test(s), Passed: 1 test(s), Total: 1 test(s)
Name: TestREPLSubclassing
Failed: 0 test(s), Passed: 1 test(s), Total: 1 test(s)
Name: TestRaise
Failed: 0 test(s), Passed: 4 test(s), Total: 4 test(s)
Name: TestRdar12586188
Failed: 0 test(s), Passed: 1 test(s), Total: 1 test(s)
Name: TestRecursiveInferior
Failed: 0 test(s), Passed: 12 test(s), Total: 14 test(s)
Name: TestRecursiveTypes
Failed: 0 test(s), Passed: 4 test(s), Total: 4 test(s)
Name: TestRegexpBreakCommand
Failed: 0 test(s), Passed: 2 test(s), Total: 2 test(s)
Name: TestRegisterVariables
Failed: 0 test(s), Passed: 2 test(s), Total: 2 test(s)
Name: TestRegisters
Failed: 0 test(s), Passed: 14 test(s), Total: 14 test(s)
Name: TestRegistersIterator
Failed: 0 test(s), Passed: 2 test(s), Total: 2 test(s)
Name: TestRerun
Failed: 0 test(s), Passed: 2 test(s), Total: 2 test(s)
Name: TestReturnValue
Failed: 0 test(s), Passed: 2 test(s), Total: 2 test(s)
Name: TestRvalueReferences
Failed: 0 test(s), Passed: 2 test(s), Total: 2 test(s)
Name: TestSBData
Failed: 0 test(s), Passed: 2 test(s), Total: 2 test(s)
Name: TestSBFrameFindValue
Failed: 0 test(s), Passed: 2 test(s), Total: 2 test(s)
Name: TestSBValuePersist
Failed: 0 test(s), Passed: 2 test(s), Total: 2 test(s)
Name: TestSBValueUpdates
Failed: 0 test(s), Passed: 2 test(s), Total: 2 test(s)
Name: TestSTL
Failed: 0 test(s), Passed: 2 test(s), Total: 2 test(s)
Name: TestSTTYBeforeAndAfter
Failed: 0 test(s), Passed: 0 test(s), Total: 1 test(s)
Name: TestSectionAPI
Failed: 0 test(s), Passed: 2 test(s), Total: 2 test(s)
Name: TestSendSignal
Failed: 0 test(s), Passed: 2 test(s), Total: 2 test(s)
Name: TestSequenceFunctions
Failed: 0 test(s), Passed: 3 test(s), Total: 3 test(s)
Name: TestSetValues
Failed: 0 test(s), Passed: 2 test(s), Total: 2 test(s)
Name: TestSetWatchlocation
Failed: 0 test(s), Passed: 2 test(s), Total: 2 test(s)
Name: TestSetWatchpoint
Failed: 0 test(s), Passed: 2 test(s), Total: 2 test(s)
Name: TestSettings
Failed: 0 test(s), Passed: 23 test(s), Total: 23 test(s)
Name: TestSharedLib
Failed: 0 test(s), Passed: 2 test(s), Total: 2 test(s)
Name: TestSharedLibStrippedSymbols
Failed: 0 test(s), Passed: 2 test(s), Total: 2 test(s)
Name: TestSignalsAPI
Failed: 0 test(s), Passed: 2 test(s), Total: 2 test(s)
Name: TestSignedTypes
Failed: 0 test(s), Passed: 2 test(s), Total: 2 test(s)
Name: TestSimpleExpressions
Failed: 0 test(s), Passed: 2 test(s), Total: 2 test(s)
Name: TestSingleQuoteInFilename
Failed: 0 test(s), Passed: 1 test(s), Total: 1 test(s)
Name: TestSourceManager
Failed: 0 test(s), Passed: 8 test(s), Total: 8 test(s)
Name: TestStaticVariables
Failed: 0 test(s), Passed: 2 test(s), Total: 2 test(s)
Name: TestStepNoDebug
Failed: 0 test(s), Passed: 6 test(s), Total: 6 test(s)
Name: TestStepTarget
Failed: 0 test(s), Passed: 10 test(s), Total: 10 test(s)
Name: TestStopHookCmd
Failed: 0 test(s), Passed: 3 test(s), Total: 3 test(s)
Name: TestStopHookMechanism
Failed: 0 test(s), Passed: 2 test(s), Total: 2 test(s)
Name: TestStopHookMultipleThreads
Failed: 0 test(s), Passed: 2 test(s), Total: 2 test(s)
Name: TestStubReverseConnect
Failed: 0 test(s), Passed: 1 test(s), Total: 1 test(s)
Name: TestStubSetSID
Failed: 0 test(s), Passed: 3 test(s), Total: 3 test(s)
Name: TestSwiftAnyObjectType
Failed: 0 test(s), Passed: 2 test(s), Total: 2 test(s)
Name: TestSwiftAnyType
Failed: 0 test(s), Passed: 2 test(s), Total: 2 test(s)
Name: TestSwiftArchetypeResolution
Failed: 0 test(s), Passed: 2 test(s), Total: 2 test(s)
Name: TestSwiftArrayType
Failed: 0 test(s), Passed: 2 test(s), Total: 2 test(s)
Name: TestSwiftBacktracePrinting
Failed: 0 test(s), Passed: 2 test(s), Total: 2 test(s)
Name: TestSwiftBreakByPartialName
Failed: 0 test(s), Passed: 2 test(s), Total: 2 test(s)
Name: TestSwiftClassTypes
Failed: 0 test(s), Passed: 2 test(s), Total: 2 test(s)
Name: TestSwiftConditionalBreakpoint
Failed: 0 test(s), Passed: 2 test(s), Total: 2 test(s)
Name: TestSwiftDynamicValue
Failed: 0 test(s), Passed: 2 test(s), Total: 2 test(s)
Name: TestSwiftExpressionsInClassFunctions
Failed: 0 test(s), Passed: 2 test(s), Total: 2 test(s)
Name: TestSwiftExpressionsInMethodsPureSwift
Failed: 0 test(s), Passed: 2 test(s), Total: 2 test(s)
Name: TestSwiftFixIts
Failed: 0 test(s), Passed: 2 test(s), Total: 2 test(s)
Name: TestSwiftGenericTupleLabels
Failed: 0 test(s), Passed: 2 test(s), Total: 2 test(s)
Name: TestSwiftGenericTypes
Failed: 0 test(s), Passed: 2 test(s), Total: 2 test(s)
Name: TestSwiftGlobals
Failed: 0 test(s), Passed: 2 test(s), Total: 2 test(s)
Name: TestSwiftHideRuntimeSupport
Failed: 0 test(s), Passed: 2 test(s), Total: 2 test(s)
Name: TestSwiftInstancePointerSetSP
Failed: 0 test(s), Passed: 2 test(s), Total: 2 test(s)
Name: TestSwiftLetInt
Failed: 0 test(s), Passed: 2 test(s), Total: 2 test(s)
Name: TestSwiftMetadataSymbols
Failed: 0 test(s), Passed: 2 test(s), Total: 2 test(s)
Name: TestSwiftMetadataSymbolsType
Failed: 0 test(s), Passed: 2 test(s), Total: 2 test(s)
Name: TestSwiftMetatype
Failed: 0 test(s), Passed: 2 test(s), Total: 2 test(s)
Name: TestSwiftMultipayloadEnum
Failed: 0 test(s), Passed: 2 test(s), Total: 2 test(s)
Name: TestSwiftNestedArray
Failed: 0 test(s), Passed: 2 test(s), Total: 2 test(s)
Name: TestSwiftOneCaseEnum
Failed: 0 test(s), Passed: 2 test(s), Total: 2 test(s)
Name: TestSwiftOptionals
Failed: 0 test(s), Passed: 2 test(s), Total: 2 test(s)
Name: TestSwiftProtocolTypes
Failed: 0 test(s), Passed: 2 test(s), Total: 2 test(s)
Name: TestSwiftRangeTypes
Failed: 0 test(s), Passed: 2 test(s), Total: 2 test(s)
Name: TestSwiftReferenceStorageTypes
Failed: 0 test(s), Passed: 2 test(s), Total: 2 test(s)
Name: TestSwiftReturns
Failed: 0 test(s), Passed: 0 test(s), Total: 2 test(s)
Name: TestSwiftStaticStringVariables
Failed: 0 test(s), Passed: 2 test(s), Total: 2 test(s)
Name: TestSwiftStdlibDictionary
Failed: 0 test(s), Passed: 0 test(s), Total: 2 test(s)
Name: TestSwiftStdlibSet
Failed: 0 test(s), Passed: 2 test(s), Total: 2 test(s)
Name: TestSwiftStepping
Failed: 0 test(s), Passed: 2 test(s), Total: 2 test(s)
Name: TestSwiftStringVariables
Failed: 0 test(s), Passed: 2 test(s), Total: 2 test(s)
Name: TestSwiftStructChangeRerun
Failed: 0 test(s), Passed: 0 test(s), Total: 2 test(s)
Name: TestSwiftStructInit
Failed: 0 test(s), Passed: 2 test(s), Total: 2 test(s)
Name: TestSwiftTupleTypes
Failed: 0 test(s), Passed: 2 test(s), Total: 2 test(s)
Name: TestSwiftTypeAliasFormatters
Failed: 0 test(s), Passed: 2 test(s), Total: 2 test(s)
Name: TestSwiftTypeLookup
Failed: 0 test(s), Passed: 2 test(s), Total: 2 test(s)
Name: TestSwiftTypeMetadata
Failed: 0 test(s), Passed: 2 test(s), Total: 2 test(s)
Name: TestSwiftTypes
Failed: 0 test(s), Passed: 2 test(s), Total: 2 test(s)
Name: TestSwiftValueOfOptionals
Failed: 0 test(s), Passed: 2 test(s), Total: 2 test(s)
Name: TestSymbolAPI
Failed: 0 test(s), Passed: 2 test(s), Total: 2 test(s)
Name: TestSymbolContext
Failed: 0 test(s), Passed: 2 test(s), Total: 2 test(s)
Name: TestSyntheticCapping
Failed: 0 test(s), Passed: 2 test(s), Total: 2 test(s)
Name: TestTargetAPI
Failed: 0 test(s), Passed: 20 test(s), Total: 20 test(s)
Name: TestTargetCommand
Failed: 0 test(s), Passed: 6 test(s), Total: 6 test(s)
Name: TestTargetWatchAddress
Failed: 0 test(s), Passed: 4 test(s), Total: 4 test(s)
Name: TestThreadAPI
Failed: 0 test(s), Passed: 10 test(s), Total: 10 test(s)
Name: TestThreadExit
Failed: 0 test(s), Passed: 2 test(s), Total: 2 test(s)
Name: TestThreadJump
Failed: 0 test(s), Passed: 2 test(s), Total: 2 test(s)
Name: TestThreadSpecificBpPlusCondition
Failed: 0 test(s), Passed: 2 test(s), Total: 2 test(s)
Name: TestThreadSpecificBreakpoint
Failed: 0 test(s), Passed: 2 test(s), Total: 2 test(s)
Name: TestThreadStates
Failed: 0 test(s), Passed: 2 test(s), Total: 2 test(s)
Name: TestThreadStepOut
Failed: 0 test(s), Passed: 0 test(s), Total: 6 test(s)
Name: TestThreadStepping
Failed: 0 test(s), Passed: 2 test(s), Total: 2 test(s)
Name: TestTopLevelExprs
Failed: 0 test(s), Passed: 2 test(s), Total: 2 test(s)
Name: TestTypeCompletion
Failed: 0 test(s), Passed: 2 test(s), Total: 2 test(s)
Name: TestTypeList
Failed: 0 test(s), Passed: 2 test(s), Total: 2 test(s)
Name: TestTypeSummaryListArg
Failed: 0 test(s), Passed: 1 test(s), Total: 1 test(s)
Name: TestTypeSummaryListScript
Failed: 0 test(s), Passed: 2 test(s), Total: 2 test(s)
Name: TestUnicodeLiterals
Failed: 0 test(s), Passed: 6 test(s), Total: 6 test(s)
Name: TestUnionMembers
Failed: 0 test(s), Passed: 2 test(s), Total: 2 test(s)
Name: TestUniqueTypes
Failed: 0 test(s), Passed: 2 test(s), Total: 2 test(s)
Name: TestUnsignedTypes
Failed: 0 test(s), Passed: 2 test(s), Total: 2 test(s)
Name: TestUserFormatVsSummary
Failed: 0 test(s), Passed: 2 test(s), Total: 2 test(s)
Name: TestValueAPI
Failed: 0 test(s), Passed: 2 test(s), Total: 2 test(s)
Name: TestValueAPILinkedList
Failed: 0 test(s), Passed: 2 test(s), Total: 2 test(s)
Name: TestValueMD5Crash
Failed: 0 test(s), Passed: 2 test(s), Total: 2 test(s)
Name: TestValueObjectRecursion
Failed: 0 test(s), Passed: 2 test(s), Total: 2 test(s)
Name: TestValueOfVectorVariable
Failed: 0 test(s), Passed: 2 test(s), Total: 2 test(s)
Name: TestValueVarUpdate
Failed: 0 test(s), Passed: 2 test(s), Total: 2 test(s)
Name: TestVarInAggregateMisuse
Failed: 0 test(s), Passed: 2 test(s), Total: 2 test(s)
Name: TestVectorTypesFormatting
Failed: 0 test(s), Passed: 2 test(s), Total: 2 test(s)
Name: TestVirtual
Failed: 0 test(s), Passed: 2 test(s), Total: 2 test(s)
Name: TestWatchLocation
Failed: 0 test(s), Passed: 2 test(s), Total: 2 test(s)
Name: TestWatchLocationWithWatchSet
Failed: 0 test(s), Passed: 2 test(s), Total: 2 test(s)
Name: TestWatchpointCommandLLDB
Failed: 0 test(s), Passed: 4 test(s), Total: 4 test(s)
Name: TestWatchpointCommandPython
Failed: 0 test(s), Passed: 2 test(s), Total: 2 test(s)
Name: TestWatchpointCommands
Failed: 0 test(s), Passed: 10 test(s), Total: 10 test(s)
Name: TestWatchpointConditionAPI
Failed: 0 test(s), Passed: 2 test(s), Total: 2 test(s)
Name: TestWatchpointConditionCmd
Failed: 0 test(s), Passed: 2 test(s), Total: 2 test(s)
Name: TestWatchpointEvents
Failed: 0 test(s), Passed: 2 test(s), Total: 2 test(s)
Name: TestWatchpointIgnoreCount
Failed: 0 test(s), Passed: 2 test(s), Total: 2 test(s)
Name: TestWatchpointIter
Failed: 0 test(s), Passed: 2 test(s), Total: 2 test(s)
Name: TestWatchpointMultipleThreads
Failed: 0 test(s), Passed: 4 test(s), Total: 4 test(s)
Name: TestWatchpointSetErrorCases
Failed: 0 test(s), Passed: 2 test(s), Total: 2 test(s)
Name: TestWithLimitDebugInfo
Failed: 0 test(s), Passed: 1 test(s), Total: 2 test(s)
Name: TestWow64MiniDump
Failed: 0 test(s), Passed: 0 test(s), Total: 3 test(s)
Name: lldbsuite.test.lldbtest
Failed: 0 test(s), Passed: 58 test(s), Total: 70 test(s)

Changes

Commit f8c6d46cff8ead22e78bec8a9cc2323688ddaf44 by egranata:
[RemoteAST] Add a MetadataPromise class that will eventually replace

edit: source/Target/SwiftLanguageRuntime.cpp
edit: include/lldb/Target/SwiftLanguageRuntime.h

Thanks,
- Enrico
:envelope_with_arrow: egranata@.com :phone:️ 27683


(John McCall) #2

John,
is RemoteAST not on Linux?

I was actually just fixing Linux test failures with RemoteAST last night, so it should definitely be there.

I don't know how you'd get a failure using ~RemoteASTContext() but not using any of the constructors / methods; they're implemented right next to each other.

It is its own library, maybe there's something mis-configured about it.

John.

···

On Apr 22, 2016, at 3:31 PM, Enrico Granata <egranata@apple.com> wrote:

lib/liblldbTarget.a(SwiftLanguageRuntime.cpp.o): In function `MetadataPromise':
/home/buildnode/jenkins/workspace/oss-lldb-incremental-linux-ubuntu-14_04/lldb/source/Target/SwiftLanguageRuntime.cpp:1211: undefined reference to `swift::remoteAST::RemoteASTContext::RemoteASTContext(swift::ASTContext&, std::shared_ptr<swift::remote::MemoryReader>)'
lib/liblldbTarget.a(SwiftLanguageRuntime.cpp.o): In function `lldb_private::SwiftLanguageRuntime::MetadataPromise::FulfillPromise()':
/home/buildnode/jenkins/workspace/oss-lldb-incremental-linux-ubuntu-14_04/lldb/source/Target/SwiftLanguageRuntime.cpp:1221: undefined reference to `swift::remoteAST::RemoteASTContext::getTypeForRemoteTypeMetadata(swift::remote::RemoteAddress)'
lib/liblldbTarget.a(SwiftLanguageRuntime.cpp.o): In function `std::default_delete<swift::remoteAST::RemoteASTContext>::operator()(swift::remoteAST::RemoteASTContext*) const':
/usr/bin/../lib/gcc/x86_64-linux-gnu/4.8/../../../../include/c++/4.8/bits/unique_ptr.h:67: undefined reference to `swift::remoteAST::RemoteASTContext::~RemoteASTContext()'
<>clang: error: linker command failed with exit code 1 (use -v to see invocation)

On Apr 22, 2016, at 3:30 PM, no-reply@swift.org <mailto:no-reply@swift.org> wrote:

[FAILURE] oss-lldb-incremental-linux-ubuntu-14_04 [#2982]

Build URL: https://ci.swift.org/job/oss-lldb-incremental-linux-ubuntu-14_04/2982/
Project: oss-lldb-incremental-linux-ubuntu-14_04
Date of build: Fri, 22 Apr 2016 15:27:18 -0700
Build duration: 2 min 41 sec
Identified problems:

Compile Error: This build failed because of a compile error. Below is a list of all errors in the build log:
Indication 1 <https://ci.swift.org//job/oss-lldb-incremental-linux-ubuntu-14_04/2982/consoleFull#-1586822805ee1a197b-acac-4b17-83cf-a53b95139a76>
Tests:

Name: Test-rdar-12481949
Failed: 0 test(s), Passed: 2 test(s), Total: 2 test(s)
Name: Test-rdar-9974002
Failed: 0 test(s), Passed: 2 test(s), Total: 2 test(s)
Name: Test11588
Failed: 0 test(s), Passed: 2 test(s), Total: 2 test(s)
Name: Test8638051
Failed: 0 test(s), Passed: 2 test(s), Total: 2 test(s)
Name: TestAbbreviations
Failed: 0 test(s), Passed: 1 test(s), Total: 1 test(s)
Name: TestAddressBreakpoints
Failed: 0 test(s), Passed: 2 test(s), Total: 2 test(s)
Name: TestAnonymous
Failed: 0 test(s), Passed: 14 test(s), Total: 14 test(s)
Name: TestAproposWithProcess
Failed: 0 test(s), Passed: 2 test(s), Total: 2 test(s)
Name: TestArrayTypes
Failed: 0 test(s), Passed: 4 test(s), Total: 4 test(s)
Name: TestAttachDenied
Failed: 0 test(s), Passed: 2 test(s), Total: 2 test(s)
Name: TestAttachResume
Failed: 0 test(s), Passed: 2 test(s), Total: 2 test(s)
Name: TestAvoidBreakpointInDelaySlot
Failed: 0 test(s), Passed: 0 test(s), Total: 2 test(s)
Name: TestBSDArchives
Failed: 0 test(s), Passed: 2 test(s), Total: 2 test(s)
Name: TestBackticksWithoutATarget
Failed: 0 test(s), Passed: 1 test(s), Total: 1 test(s)
Name: TestBacktraceAll
Failed: 0 test(s), Passed: 2 test(s), Total: 2 test(s)
Name: TestBatchMode
Failed: 0 test(s), Passed: 6 test(s), Total: 6 test(s)
Name: TestBitfields
Failed: 0 test(s), Passed: 4 test(s), Total: 4 test(s)
Name: TestBreakpointAPI
Failed: 0 test(s), Passed: 2 test(s), Total: 2 test(s)
Name: TestBreakpointCaseSensitivity
Failed: 0 test(s), Passed: 0 test(s), Total: 2 test(s)
Name: TestBreakpointCommand
Failed: 0 test(s), Passed: 2 test(s), Total: 2 test(s)
Name: TestBreakpointCommandsFromPython
Failed: 0 test(s), Passed: 2 test(s), Total: 2 test(s)
Name: TestBreakpointConditions
Failed: 0 test(s), Passed: 6 test(s), Total: 6 test(s)
Name: TestBreakpointIDs
Failed: 0 test(s), Passed: 2 test(s), Total: 2 test(s)
Name: TestBreakpointIgnoreCount
Failed: 0 test(s), Passed: 4 test(s), Total: 4 test(s)
Name: TestBreakpointLanguage
Failed: 0 test(s), Passed: 4 test(s), Total: 4 test(s)
Name: TestBreakpointLocations
Failed: 0 test(s), Passed: 2 test(s), Total: 2 test(s)
Name: TestBreakpointOptions
Failed: 0 test(s), Passed: 2 test(s), Total: 2 test(s)
Name: TestBreakpointSetRestart
Failed: 0 test(s), Passed: 2 test(s), Total: 2 test(s)
Name: TestBreakpointsWithNoTargets
Failed: 0 test(s), Passed: 2 test(s), Total: 2 test(s)
Name: TestBuiltinTrap
Failed: 0 test(s), Passed: 2 test(s), Total: 2 test(s)
Name: TestBulkyEnumsVariables
Failed: 0 test(s), Passed: 2 test(s), Total: 2 test(s)
Name: TestCInlines
Failed: 0 test(s), Passed: 2 test(s), Total: 2 test(s)
Name: TestCPP11EnumTypes
Failed: 0 test(s), Passed: 16 test(s), Total: 16 test(s)
Name: TestCPPAuto
Failed: 0 test(s), Passed: 2 test(s), Total: 2 test(s)
Name: TestCPPBool
Failed: 0 test(s), Passed: 2 test(s), Total: 2 test(s)
Name: TestCPPBreakpointCommands
Failed: 0 test(s), Passed: 2 test(s), Total: 2 test(s)
Name: TestCPPBreakpointLocations
Failed: 0 test(s), Passed: 2 test(s), Total: 2 test(s)
Name: TestCPPExceptionBreakpoint
Failed: 0 test(s), Passed: 2 test(s), Total: 2 test(s)
Name: TestCPPExceptionBreakpoints
Failed: 0 test(s), Passed: 2 test(s), Total: 2 test(s)
Name: TestCPPStaticMethods
Failed: 0 test(s), Passed: 2 test(s), Total: 2 test(s)
Name: TestCPPThis
Failed: 0 test(s), Passed: 2 test(s), Total: 2 test(s)
Name: TestCStrings
Failed: 0 test(s), Passed: 2 test(s), Total: 2 test(s)
Name: TestCallCPPFunction
Failed: 0 test(s), Passed: 2 test(s), Total: 2 test(s)
Name: TestCallStdStringFunction
Failed: 0 test(s), Passed: 2 test(s), Total: 2 test(s)
Name: TestCallStopAndContinue
Failed: 0 test(s), Passed: 2 test(s), Total: 2 test(s)
Name: TestCallThatRestarts
Failed: 0 test(s), Passed: 2 test(s), Total: 2 test(s)
Name: TestCallUserAnonTypedef
Failed: 0 test(s), Passed: 2 test(s), Total: 2 test(s)
Name: TestCallUserDefinedFunction
Failed: 0 test(s), Passed: 2 test(s), Total: 2 test(s)
Name: TestCallWithTimeout
Failed: 0 test(s), Passed: 2 test(s), Total: 2 test(s)
Name: TestChangeProcessGroup
Failed: 0 test(s), Passed: 2 test(s), Total: 2 test(s)
Name: TestChangeValueAPI
Failed: 0 test(s), Passed: 2 test(s), Total: 2 test(s)
Name: TestChar1632T
Failed: 0 test(s), Passed: 2 test(s), Total: 2 test(s)
Name: TestClassTypes
Failed: 0 test(s), Passed: 8 test(s), Total: 8 test(s)
Name: TestClassTypesDisassembly
Failed: 0 test(s), Passed: 4 test(s), Total: 4 test(s)
Name: TestCommandHistory
Failed: 0 test(s), Passed: 1 test(s), Total: 1 test(s)
Name: TestCommandInterpreterAPI
Failed: 0 test(s), Passed: 2 test(s), Total: 2 test(s)
Name: TestCommandRegex
Failed: 0 test(s), Passed: 1 test(s), Total: 1 test(s)
Name: TestCommandScript
Failed: 0 test(s), Passed: 2 test(s), Total: 2 test(s)
Name: TestCommandSource
Failed: 0 test(s), Passed: 1 test(s), Total: 1 test(s)
Name: TestCommonShortSpellings
Failed: 0 test(s), Passed: 1 test(s), Total: 1 test(s)
Name: TestCompDirSymLink
Failed: 0 test(s), Passed: 6 test(s), Total: 6 test(s)
Name: TestCompletion
Failed: 0 test(s), Passed: 33 test(s), Total: 33 test(s)
Name: TestConcurrentEvents
Failed: 0 test(s), Passed: 58 test(s), Total: 58 test(s)
Name: TestConditionalBreak
Failed: 0 test(s), Passed: 4 test(s), Total: 4 test(s)
Name: TestConsecutiveBreakpoints
Failed: 0 test(s), Passed: 3 test(s), Total: 3 test(s)
Name: TestConvenienceVariables
Failed: 0 test(s), Passed: 2 test(s), Total: 2 test(s)
Name: TestCppChainedCalls
Failed: 0 test(s), Passed: 2 test(s), Total: 2 test(s)
Name: TestCppGlobalOperators
Failed: 0 test(s), Passed: 2 test(s), Total: 2 test(s)
Name: TestCppIncompleteTypes
Failed: 0 test(s), Passed: 4 test(s), Total: 4 test(s)
Name: TestCppNsImport
Failed: 0 test(s), Passed: 2 test(s), Total: 2 test(s)
Name: TestCppScope
Failed: 0 test(s), Passed: 2 test(s), Total: 2 test(s)
Name: TestCppValueCast
Failed: 0 test(s), Passed: 2 test(s), Total: 2 test(s)
Name: TestCrashDuringStep
Failed: 0 test(s), Passed: 2 test(s), Total: 2 test(s)
Name: TestCreateAfterAttach
Failed: 0 test(s), Passed: 4 test(s), Total: 4 test(s)
Name: TestCreateDuringInstructionStep
Failed: 0 test(s), Passed: 2 test(s), Total: 2 test(s)
Name: TestCxxWCharT
Failed: 0 test(s), Passed: 2 test(s), Total: 2 test(s)
Name: TestDataFormatterAdv
Failed: 0 test(s), Passed: 2 test(s), Total: 2 test(s)
Name: TestDataFormatterCategories
Failed: 0 test(s), Passed: 2 test(s), Total: 2 test(s)
Name: TestDataFormatterCpp
Failed: 0 test(s), Passed: 2 test(s), Total: 2 test(s)
Name: TestDataFormatterDisabling
Failed: 0 test(s), Passed: 2 test(s), Total: 2 test(s)
Name: TestDataFormatterEnumFormat
Failed: 0 test(s), Passed: 2 test(s), Total: 2 test(s)
Name: TestDataFormatterGlobals
Failed: 0 test(s), Passed: 2 test(s), Total: 2 test(s)
Name: TestDataFormatterHexCaps
Failed: 0 test(s), Passed: 2 test(s), Total: 2 test(s)
Name: TestDataFormatterLanguageCategoryUpdates
Failed: 0 test(s), Passed: 2 test(s), Total: 2 test(s)
Name: TestDataFormatterLibccIterator
Failed: 0 test(s), Passed: 0 test(s), Total: 2 test(s)
Name: TestDataFormatterLibccMap
Failed: 0 test(s), Passed: 0 test(s), Total: 2 test(s)
Name: TestDataFormatterLibccMultiMap
Failed: 0 test(s), Passed: 0 test(s), Total: 2 test(s)
Name: TestDataFormatterLibcxxList
Failed: 0 test(s), Passed: 0 test(s), Total: 2 test(s)
Name: TestDataFormatterLibcxxListLoop
Failed: 0 test(s), Passed: 0 test(s), Total: 2 test(s)
Name: TestDataFormatterLibcxxMultiSet
Failed: 0 test(s), Passed: 0 test(s), Total: 2 test(s)
Name: TestDataFormatterLibcxxSet
Failed: 0 test(s), Passed: 2 test(s), Total: 2 test(s)
Name: TestDataFormatterLibcxxString
Failed: 0 test(s), Passed: 0 test(s), Total: 2 test(s)
Name: TestDataFormatterLibcxxVBool
Failed: 0 test(s), Passed: 0 test(s), Total: 2 test(s)
Name: TestDataFormatterLibcxxVector
Failed: 0 test(s), Passed: 0 test(s), Total: 2 test(s)
Name: TestDataFormatterNamedSummaries
Failed: 0 test(s), Passed: 2 test(s), Total: 2 test(s)
Name: TestDataFormatterPythonSynth
Failed: 0 test(s), Passed: 4 test(s), Total: 4 test(s)
Name: TestDataFormatterRefPtrRecursion
Failed: 0 test(s), Passed: 2 test(s), Total: 2 test(s)
Name: TestDataFormatterScript
Failed: 0 test(s), Passed: 2 test(s), Total: 2 test(s)
Name: TestDataFormatterSkipSummary
Failed: 0 test(s), Passed: 2 test(s), Total: 2 test(s)
Name: TestDataFormatterSmartArray
Failed: 0 test(s), Passed: 2 test(s), Total: 2 test(s)
Name: TestDataFormatterStdIterator
Failed: 0 test(s), Passed: 2 test(s), Total: 2 test(s)
Name: TestDataFormatterStdList
Failed: 0 test(s), Passed: 2 test(s), Total: 2 test(s)
Name: TestDataFormatterStdMap
Failed: 0 test(s), Passed: 2 test(s), Total: 2 test(s)
Name: TestDataFormatterStdString
Failed: 0 test(s), Passed: 2 test(s), Total: 2 test(s)
Name: TestDataFormatterStdVBool
Failed: 0 test(s), Passed: 2 test(s), Total: 2 test(s)
Name: TestDataFormatterStdVector
Failed: 0 test(s), Passed: 2 test(s), Total: 2 test(s)
Name: TestDataFormatterSynth
Failed: 0 test(s), Passed: 2 test(s), Total: 2 test(s)
Name: TestDataFormatterSynthVal
Failed: 0 test(s), Passed: 2 test(s), Total: 2 test(s)
Name: TestDataFormatterUnordered
Failed: 0 test(s), Passed: 0 test(s), Total: 2 test(s)
Name: TestDataFormatterVarScriptFormatting
Failed: 0 test(s), Passed: 2 test(s), Total: 2 test(s)
Name: TestDeadStrip
Failed: 0 test(s), Passed: 1 test(s), Total: 1 test(s)
Name: TestDebugBreak
Failed: 0 test(s), Passed: 0 test(s), Total: 1 test(s)
Name: TestDebuggerAPI
Failed: 0 test(s), Passed: 3 test(s), Total: 3 test(s)
Name: TestDefaultCacheLineSize
Failed: 0 test(s), Passed: 0 test(s), Total: 2 test(s)
Name: TestDefaultConstructorForAPIObjects
Failed: 0 test(s), Passed: 34 test(s), Total: 34 test(s)
Name: TestDiamond
Failed: 0 test(s), Passed: 2 test(s), Total: 2 test(s)
Name: TestDisasmAPI
Failed: 0 test(s), Passed: 2 test(s), Total: 2 test(s)
Name: TestDisassembleBreakpoint
Failed: 0 test(s), Passed: 2 test(s), Total: 2 test(s)
Name: TestDisassembleRawData
Failed: 0 test(s), Passed: 1 test(s), Total: 1 test(s)
Name: TestDisassemble_VST1_64
Failed: 0 test(s), Passed: 0 test(s), Total: 1 test(s)
Name: TestDynamicValue
Failed: 0 test(s), Passed: 2 test(s), Total: 2 test(s)
Name: TestDynamicValueChildCount
Failed: 0 test(s), Passed: 2 test(s), Total: 2 test(s)
Name: TestEmulations
Failed: 0 test(s), Passed: 2 test(s), Total: 2 test(s)
Name: TestEnumTypes
Failed: 0 test(s), Passed: 2 test(s), Total: 2 test(s)
Name: TestEnumVariables
Failed: 0 test(s), Passed: 2 test(s), Total: 2 test(s)
Name: TestEvents
Failed: 0 test(s), Passed: 0 test(s), Total: 6 test(s)
Name: TestExitDuringStep
Failed: 0 test(s), Passed: 6 test(s), Total: 6 test(s)
Name: TestExprDoesntBlock
Failed: 0 test(s), Passed: 2 test(s), Total: 2 test(s)
Name: TestExprHelpExamples
Failed: 0 test(s), Passed: 2 test(s), Total: 2 test(s)
Name: TestExprInProtocolExtension
Failed: 0 test(s), Passed: 2 test(s), Total: 2 test(s)
Name: TestExprOptions
Failed: 0 test(s), Passed: 2 test(s), Total: 2 test(s)
Name: TestExpressionAccessControl
Failed: 0 test(s), Passed: 2 test(s), Total: 2 test(s)
Name: TestExpressionErrorBreakpoint
Failed: 0 test(s), Passed: 8 test(s), Total: 8 test(s)
Name: TestExpressionErrors
Failed: 0 test(s), Passed: 2 test(s), Total: 2 test(s)
Name: TestExpressionInSyscall
Failed: 0 test(s), Passed: 2 test(s), Total: 2 test(s)
Name: TestExpressionScopes
Failed: 0 test(s), Passed: 2 test(s), Total: 2 test(s)
Name: TestExprs
Failed: 0 test(s), Passed: 6 test(s), Total: 6 test(s)
Name: TestExprs2
Failed: 0 test(s), Passed: 2 test(s), Total: 2 test(s)
Name: TestExprsChar
Failed: 0 test(s), Passed: 4 test(s), Total: 4 test(s)
Name: TestFloatTypes
Failed: 0 test(s), Passed: 4 test(s), Total: 4 test(s)
Name: TestFloatTypesExpr
Failed: 0 test(s), Passed: 4 test(s), Total: 4 test(s)
Name: TestFormatPropagation
Failed: 0 test(s), Passed: 2 test(s), Total: 2 test(s)
Name: TestFormats
Failed: 0 test(s), Passed: 2 test(s), Total: 2 test(s)
Name: TestFormatters
Failed: 0 test(s), Passed: 2 test(s), Total: 2 test(s)
Name: TestFormattersSBAPI
Failed: 0 test(s), Passed: 4 test(s), Total: 4 test(s)
Name: TestForwardDeclaration
Failed: 0 test(s), Passed: 2 test(s), Total: 2 test(s)
Name: TestFrameFormatSmallStruct
Failed: 0 test(s), Passed: 2 test(s), Total: 2 test(s)
Name: TestFrameUtils
Failed: 0 test(s), Passed: 2 test(s), Total: 2 test(s)
Name: TestFrameVariableAnonymousUnions
Failed: 0 test(s), Passed: 2 test(s), Total: 2 test(s)
Name: TestFrames
Failed: 0 test(s), Passed: 6 test(s), Total: 6 test(s)
Name: TestFunctionTypes
Failed: 0 test(s), Passed: 4 test(s), Total: 4 test(s)
Name: TestFunctionVariables
Failed: 0 test(s), Passed: 2 test(s), Total: 2 test(s)
Name: TestGDBRemoteMemoryRead
Failed: 0 test(s), Passed: 2 test(s), Total: 2 test(s)
Name: TestGdbRemoteAbort
Failed: 0 test(s), Passed: 1 test(s), Total: 1 test(s)
Name: TestGdbRemoteAttach
Failed: 0 test(s), Passed: 1 test(s), Total: 1 test(s)
Name: TestGdbRemoteAuxvSupport
Failed: 0 test(s), Passed: 4 test(s), Total: 4 test(s)
Name: TestGdbRemoteExpeditedRegisters
Failed: 0 test(s), Passed: 5 test(s), Total: 5 test(s)
Name: TestGdbRemoteKill
Failed: 0 test(s), Passed: 1 test(s), Total: 1 test(s)
Name: TestGdbRemoteProcessInfo
Failed: 0 test(s), Passed: 5 test(s), Total: 5 test(s)
Name: TestGdbRemoteRegisterState
Failed: 0 test(s), Passed: 2 test(s), Total: 2 test(s)
Name: TestGdbRemoteSegFault
Failed: 0 test(s), Passed: 1 test(s), Total: 1 test(s)
Name: TestGdbRemoteSingleStep
Failed: 0 test(s), Passed: 1 test(s), Total: 1 test(s)
Name: TestGdbRemoteThreadsInStopReply
Failed: 0 test(s), Passed: 4 test(s), Total: 4 test(s)
Name: TestGdbRemote_qThreadStopInfo
Failed: 0 test(s), Passed: 3 test(s), Total: 4 test(s)
Name: TestGdbRemote_vCont
Failed: 0 test(s), Passed: 6 test(s), Total: 6 test(s)
Name: TestGlobalVariables
Failed: 0 test(s), Passed: 2 test(s), Total: 2 test(s)
Name: TestGoFormatters
Failed: 0 test(s), Passed: 0 test(s), Total: 1 test(s)
Name: TestGoroutines
Failed: 0 test(s), Passed: 0 test(s), Total: 1 test(s)
Name: TestHandleSegv
Failed: 0 test(s), Passed: 2 test(s), Total: 2 test(s)
Name: TestHelloWorld
Failed: 0 test(s), Passed: 6 test(s), Total: 6 test(s)
Name: TestHelp
Failed: 0 test(s), Passed: 18 test(s), Total: 18 test(s)
Name: TestImageListMultiArchitecture
Failed: 0 test(s), Passed: 1 test(s), Total: 1 test(s)
Name: TestImport
Failed: 0 test(s), Passed: 1 test(s), Total: 1 test(s)
Name: TestInOutVariables
Failed: 0 test(s), Passed: 2 test(s), Total: 2 test(s)
Name: TestIndexVariable
Failed: 0 test(s), Passed: 2 test(s), Total: 2 test(s)
Name: TestIndirectEnumVariables
Failed: 0 test(s), Passed: 2 test(s), Total: 2 test(s)
Name: TestInferiorAssert
Failed: 0 test(s), Passed: 12 test(s), Total: 12 test(s)
Name: TestInferiorChanged
Failed: 0 test(s), Passed: 2 test(s), Total: 2 test(s)
Name: TestInferiorCrashing
Failed: 0 test(s), Passed: 12 test(s), Total: 14 test(s)
Name: TestInlineStepping
Failed: 0 test(s), Passed: 0 test(s), Total: 6 test(s)
Name: TestInlinedBreakpoints
Failed: 0 test(s), Passed: 2 test(s), Total: 2 test(s)
Name: TestInlinedFrame
Failed: 0 test(s), Passed: 2 test(s), Total: 2 test(s)
Name: TestInlines
Failed: 0 test(s), Passed: 2 test(s), Total: 2 test(s)
Name: TestIntegerTypes
Failed: 0 test(s), Passed: 20 test(s), Total: 20 test(s)
Name: TestIntegerTypesExpr
Failed: 0 test(s), Passed: 20 test(s), Total: 20 test(s)
Name: TestJITLoaderGDB
Failed: 0 test(s), Passed: 0 test(s), Total: 2 test(s)
Name: TestLLDBIterator
Failed: 0 test(s), Passed: 6 test(s), Total: 6 test(s)
Name: TestLLVM
Failed: 0 test(s), Passed: 1 test(s), Total: 1 test(s)
Name: TestLazyReverse
Failed: 0 test(s), Passed: 1 test(s), Total: 1 test(s)
Name: TestLibCxxAtomic
Failed: 0 test(s), Passed: 0 test(s), Total: 2 test(s)
Name: TestLinuxCore
Failed: 0 test(s), Passed: 3 test(s), Total: 4 test(s)
Name: TestListener
Failed: 0 test(s), Passed: 2 test(s), Total: 2 test(s)
Name: TestLldbGdbServer
Failed: 0 test(s), Passed: 34 test(s), Total: 34 test(s)
Name: TestLoadUnload
Failed: 0 test(s), Passed: 10 test(s), Total: 10 test(s)
Name: TestLogging
Failed: 0 test(s), Passed: 4 test(s), Total: 4 test(s)
Name: TestMembersAndLocalsWithSameName
Failed: 0 test(s), Passed: 4 test(s), Total: 4 test(s)
Name: TestMemoryCache
Failed: 0 test(s), Passed: 2 test(s), Total: 2 test(s)
Name: TestMemoryRead
Failed: 0 test(s), Passed: 2 test(s), Total: 2 test(s)
Name: TestMiBreak
Failed: 0 test(s), Passed: 5 test(s), Total: 5 test(s)
Name: TestMiCliSupport
Failed: 0 test(s), Passed: 1 test(s), Total: 8 test(s)
Name: TestMiData
Failed: 0 test(s), Passed: 6 test(s), Total: 7 test(s)
Name: TestMiExec
Failed: 0 test(s), Passed: 8 test(s), Total: 8 test(s)
Name: TestMiExit
Failed: 0 test(s), Passed: 3 test(s), Total: 3 test(s)
Name: TestMiFile
Failed: 0 test(s), Passed: 4 test(s), Total: 4 test(s)
Name: TestMiGdbSetShow
Failed: 0 test(s), Passed: 4 test(s), Total: 5 test(s)
Name: TestMiGdbSetShowPrint
Failed: 0 test(s), Passed: 2 test(s), Total: 3 test(s)
Name: TestMiInterpreterExec
Failed: 0 test(s), Passed: 7 test(s), Total: 7 test(s)
Name: TestMiLibraryLoaded
Failed: 0 test(s), Passed: 1 test(s), Total: 1 test(s)
Name: TestMiPrompt
Failed: 0 test(s), Passed: 1 test(s), Total: 1 test(s)
Name: TestMiSignal
Failed: 0 test(s), Passed: 1 test(s), Total: 3 test(s)
Name: TestMiStack
Failed: 0 test(s), Passed: 6 test(s), Total: 6 test(s)
Name: TestMiStartupOptions
Failed: 0 test(s), Passed: 8 test(s), Total: 10 test(s)
Name: TestMiSyntax
Failed: 0 test(s), Passed: 2 test(s), Total: 2 test(s)
Name: TestMiTarget
Failed: 0 test(s), Passed: 0 test(s), Total: 3 test(s)
Name: TestMiVar
Failed: 0 test(s), Passed: 2 test(s), Total: 6 test(s)
Name: TestMiniDump
Failed: 0 test(s), Passed: 0 test(s), Total: 7 test(s)
Name: TestMixedLanguages
Failed: 0 test(s), Passed: 2 test(s), Total: 2 test(s)
Name: TestModuleAndSection
Failed: 0 test(s), Passed: 6 test(s), Total: 6 test(s)
Name: TestMultilevelArrays
Failed: 0 test(s), Passed: 1 test(s), Total: 1 test(s)
Name: TestMultipleDebuggersCommands
Failed: 0 test(s), Passed: 1 test(s), Total: 1 test(s)
Name: TestMultithreaded
Failed: 0 test(s), Passed: 0 test(s), Total: 8 test(s)
Name: TestMyFirstWatchpoint
Failed: 0 test(s), Passed: 2 test(s), Total: 2 test(s)
Name: TestNamespace
Failed: 0 test(s), Passed: 2 test(s), Total: 2 test(s)
Name: TestNestedAlias
Failed: 0 test(s), Passed: 2 test(s), Total: 2 test(s)
Name: TestNestedPersistentTypes
Failed: 0 test(s), Passed: 2 test(s), Total: 2 test(s)
Name: TestNoSuchArch
Failed: 0 test(s), Passed: 2 test(s), Total: 2 test(s)
Name: TestNoreturnUnwind
Failed: 0 test(s), Passed: 2 test(s), Total: 2 test(s)
Name: TestNumThreads
Failed: 0 test(s), Passed: 2 test(s), Total: 2 test(s)
Name: TestOverloadedFunctions
Failed: 0 test(s), Passed: 2 test(s), Total: 2 test(s)
Name: TestPaths
Failed: 0 test(s), Passed: 2 test(s), Total: 3 test(s)
Name: TestPersistentPtrUpdate
Failed: 0 test(s), Passed: 2 test(s), Total: 2 test(s)
Name: TestPersistentTypes
Failed: 0 test(s), Passed: 2 test(s), Total: 2 test(s)
Name: TestPersistentVariables
Failed: 0 test(s), Passed: 2 test(s), Total: 2 test(s)
Name: TestPlatformCommand
Failed: 0 test(s), Passed: 7 test(s), Total: 8 test(s)
Name: TestPlatformProcessConnect
Failed: 0 test(s), Passed: 0 test(s), Total: 1 test(s)
Name: TestPluginCommands
Failed: 0 test(s), Passed: 1 test(s), Total: 1 test(s)
Name: TestPrintStackTraces
Failed: 0 test(s), Passed: 2 test(s), Total: 2 test(s)
Name: TestPrintfAfterUp
Failed: 0 test(s), Passed: 2 test(s), Total: 2 test(s)
Name: TestProcessAPI
Failed: 0 test(s), Passed: 10 test(s), Total: 10 test(s)
Name: TestProcessAttach
Failed: 0 test(s), Passed: 4 test(s), Total: 4 test(s)
Name: TestProcessIO
Failed: 0 test(s), Passed: 10 test(s), Total: 10 test(s)
Name: TestProcessLaunch
Failed: 0 test(s), Passed: 4 test(s), Total: 4 test(s)
Name: TestProcessSaveCore
Failed: 0 test(s), Passed: 0 test(s), Total: 4 test(s)
Name: TestPtrRef2Typedef
Failed: 0 test(s), Passed: 2 test(s), Total: 2 test(s)
Name: TestPtrToArrayFormatting
Failed: 0 test(s), Passed: 2 test(s), Total: 2 test(s)
Name: TestPublicAPIHeaders
Failed: 0 test(s), Passed: 0 test(s), Total: 2 test(s)
Name: TestPythonOSPlugin
Failed: 0 test(s), Passed: 2 test(s), Total: 2 test(s)
Name: TestQuoting
Failed: 0 test(s), Passed: 11 test(s), Total: 11 test(s)
Name: TestREPLArray
Failed: 0 test(s), Passed: 1 test(s), Total: 1 test(s)
Name: TestREPLBasic
Failed: 0 test(s), Passed: 1 test(s), Total: 1 test(s)
Name: TestREPLClasses
Failed: 0 test(s), Passed: 1 test(s), Total: 1 test(s)
Name: TestREPLClosure
Failed: 0 test(s), Passed: 1 test(s), Total: 1 test(s)
Name: TestREPLDynamicType
Failed: 0 test(s), Passed: 1 test(s), Total: 1 test(s)
Name: TestREPLFunctionDefinition
Failed: 0 test(s), Passed: 1 test(s), Total: 1 test(s)
Name: TestREPLPOReplType
Failed: 0 test(s), Passed: 1 test(s), Total: 1 test(s)
Name: TestREPLQuickLookObject
Failed: 0 test(s), Passed: 1 test(s), Total: 1 test(s)
Name: TestREPLRecursiveClass
Failed: 0 test(s), Passed: 1 test(s), Total: 1 test(s)
Name: TestREPLSubclassing
Failed: 0 test(s), Passed: 1 test(s), Total: 1 test(s)
Name: TestRaise
Failed: 0 test(s), Passed: 4 test(s), Total: 4 test(s)
Name: TestRdar12586188
Failed: 0 test(s), Passed: 1 test(s), Total: 1 test(s)
Name: TestRecursiveInferior
Failed: 0 test(s), Passed: 12 test(s), Total: 14 test(s)
Name: TestRecursiveTypes
Failed: 0 test(s), Passed: 4 test(s), Total: 4 test(s)
Name: TestRegexpBreakCommand
Failed: 0 test(s), Passed: 2 test(s), Total: 2 test(s)
Name: TestRegisterVariables
Failed: 0 test(s), Passed: 2 test(s), Total: 2 test(s)
Name: TestRegisters
Failed: 0 test(s), Passed: 14 test(s), Total: 14 test(s)
Name: TestRegistersIterator
Failed: 0 test(s), Passed: 2 test(s), Total: 2 test(s)
Name: TestRerun
Failed: 0 test(s), Passed: 2 test(s), Total: 2 test(s)
Name: TestReturnValue
Failed: 0 test(s), Passed: 2 test(s), Total: 2 test(s)
Name: TestRvalueReferences
Failed: 0 test(s), Passed: 2 test(s), Total: 2 test(s)
Name: TestSBData
Failed: 0 test(s), Passed: 2 test(s), Total: 2 test(s)
Name: TestSBFrameFindValue
Failed: 0 test(s), Passed: 2 test(s), Total: 2 test(s)
Name: TestSBValuePersist
Failed: 0 test(s), Passed: 2 test(s), Total: 2 test(s)
Name: TestSBValueUpdates
Failed: 0 test(s), Passed: 2 test(s), Total: 2 test(s)
Name: TestSTL
Failed: 0 test(s), Passed: 2 test(s), Total: 2 test(s)
Name: TestSTTYBeforeAndAfter
Failed: 0 test(s), Passed: 0 test(s), Total: 1 test(s)
Name: TestSectionAPI
Failed: 0 test(s), Passed: 2 test(s), Total: 2 test(s)
Name: TestSendSignal
Failed: 0 test(s), Passed: 2 test(s), Total: 2 test(s)
Name: TestSequenceFunctions
Failed: 0 test(s), Passed: 3 test(s), Total: 3 test(s)
Name: TestSetValues
Failed: 0 test(s), Passed: 2 test(s), Total: 2 test(s)
Name: TestSetWatchlocation
Failed: 0 test(s), Passed: 2 test(s), Total: 2 test(s)
Name: TestSetWatchpoint
Failed: 0 test(s), Passed: 2 test(s), Total: 2 test(s)
Name: TestSettings
Failed: 0 test(s), Passed: 23 test(s), Total: 23 test(s)
Name: TestSharedLib
Failed: 0 test(s), Passed: 2 test(s), Total: 2 test(s)
Name: TestSharedLibStrippedSymbols
Failed: 0 test(s), Passed: 2 test(s), Total: 2 test(s)
Name: TestSignalsAPI
Failed: 0 test(s), Passed: 2 test(s), Total: 2 test(s)
Name: TestSignedTypes
Failed: 0 test(s), Passed: 2 test(s), Total: 2 test(s)
Name: TestSimpleExpressions
Failed: 0 test(s), Passed: 2 test(s), Total: 2 test(s)
Name: TestSingleQuoteInFilename
Failed: 0 test(s), Passed: 1 test(s), Total: 1 test(s)
Name: TestSourceManager
Failed: 0 test(s), Passed: 8 test(s), Total: 8 test(s)
Name: TestStaticVariables
Failed: 0 test(s), Passed: 2 test(s), Total: 2 test(s)
Name: TestStepNoDebug
Failed: 0 test(s), Passed: 6 test(s), Total: 6 test(s)
Name: TestStepTarget
Failed: 0 test(s), Passed: 10 test(s), Total: 10 test(s)
Name: TestStopHookCmd
Failed: 0 test(s), Passed: 3 test(s), Total: 3 test(s)
Name: TestStopHookMechanism
Failed: 0 test(s), Passed: 2 test(s), Total: 2 test(s)
Name: TestStopHookMultipleThreads
Failed: 0 test(s), Passed: 2 test(s), Total: 2 test(s)
Name: TestStubReverseConnect
Failed: 0 test(s), Passed: 1 test(s), Total: 1 test(s)
Name: TestStubSetSID
Failed: 0 test(s), Passed: 3 test(s), Total: 3 test(s)
Name: TestSwiftAnyObjectType
Failed: 0 test(s), Passed: 2 test(s), Total: 2 test(s)
Name: TestSwiftAnyType
Failed: 0 test(s), Passed: 2 test(s), Total: 2 test(s)
Name: TestSwiftArchetypeResolution
Failed: 0 test(s), Passed: 2 test(s), Total: 2 test(s)
Name: TestSwiftArrayType
Failed: 0 test(s), Passed: 2 test(s), Total: 2 test(s)
Name: TestSwiftBacktracePrinting
Failed: 0 test(s), Passed: 2 test(s), Total: 2 test(s)
Name: TestSwiftBreakByPartialName
Failed: 0 test(s), Passed: 2 test(s), Total: 2 test(s)
Name: TestSwiftClassTypes
Failed: 0 test(s), Passed: 2 test(s), Total: 2 test(s)
Name: TestSwiftConditionalBreakpoint
Failed: 0 test(s), Passed: 2 test(s), Total: 2 test(s)
Name: TestSwiftDynamicValue
Failed: 0 test(s), Passed: 2 test(s), Total: 2 test(s)
Name: TestSwiftExpressionsInClassFunctions
Failed: 0 test(s), Passed: 2 test(s), Total: 2 test(s)
Name: TestSwiftExpressionsInMethodsPureSwift
Failed: 0 test(s), Passed: 2 test(s), Total: 2 test(s)
Name: TestSwiftFixIts
Failed: 0 test(s), Passed: 2 test(s), Total: 2 test(s)
Name: TestSwiftGenericTupleLabels
Failed: 0 test(s), Passed: 2 test(s), Total: 2 test(s)
Name: TestSwiftGenericTypes
Failed: 0 test(s), Passed: 2 test(s), Total: 2 test(s)
Name: TestSwiftGlobals
Failed: 0 test(s), Passed: 2 test(s), Total: 2 test(s)
Name: TestSwiftHideRuntimeSupport
Failed: 0 test(s), Passed: 2 test(s), Total: 2 test(s)
Name: TestSwiftInstancePointerSetSP
Failed: 0 test(s), Passed: 2 test(s), Total: 2 test(s)
Name: TestSwiftLetInt
Failed: 0 test(s), Passed: 2 test(s), Total: 2 test(s)
Name: TestSwiftMetadataSymbols
Failed: 0 test(s), Passed: 2 test(s), Total: 2 test(s)
Name: TestSwiftMetadataSymbolsType
Failed: 0 test(s), Passed: 2 test(s), Total: 2 test(s)
Name: TestSwiftMetatype
Failed: 0 test(s), Passed: 2 test(s), Total: 2 test(s)
Name: TestSwiftMultipayloadEnum
Failed: 0 test(s), Passed: 2 test(s), Total: 2 test(s)
Name: TestSwiftNestedArray
Failed: 0 test(s), Passed: 2 test(s), Total: 2 test(s)
Name: TestSwiftOneCaseEnum
Failed: 0 test(s), Passed: 2 test(s), Total: 2 test(s)
Name: TestSwiftOptionals
Failed: 0 test(s), Passed: 2 test(s), Total: 2 test(s)
Name: TestSwiftProtocolTypes
Failed: 0 test(s), Passed: 2 test(s), Total: 2 test(s)
Name: TestSwiftRangeTypes
Failed: 0 test(s), Passed: 2 test(s), Total: 2 test(s)
Name: TestSwiftReferenceStorageTypes
Failed: 0 test(s), Passed: 2 test(s), Total: 2 test(s)
Name: TestSwiftReturns
Failed: 0 test(s), Passed: 0 test(s), Total: 2 test(s)
Name: TestSwiftStaticStringVariables
Failed: 0 test(s), Passed: 2 test(s), Total: 2 test(s)
Name: TestSwiftStdlibDictionary
Failed: 0 test(s), Passed: 0 test(s), Total: 2 test(s)
Name: TestSwiftStdlibSet
Failed: 0 test(s), Passed: 2 test(s), Total: 2 test(s)
Name: TestSwiftStepping
Failed: 0 test(s), Passed: 2 test(s), Total: 2 test(s)
Name: TestSwiftStringVariables
Failed: 0 test(s), Passed: 2 test(s), Total: 2 test(s)
Name: TestSwiftStructChangeRerun
Failed: 0 test(s), Passed: 0 test(s), Total: 2 test(s)
Name: TestSwiftStructInit
Failed: 0 test(s), Passed: 2 test(s), Total: 2 test(s)
Name: TestSwiftTupleTypes
Failed: 0 test(s), Passed: 2 test(s), Total: 2 test(s)
Name: TestSwiftTypeAliasFormatters
Failed: 0 test(s), Passed: 2 test(s), Total: 2 test(s)
Name: TestSwiftTypeLookup
Failed: 0 test(s), Passed: 2 test(s), Total: 2 test(s)
Name: TestSwiftTypeMetadata
Failed: 0 test(s), Passed: 2 test(s), Total: 2 test(s)
Name: TestSwiftTypes
Failed: 0 test(s), Passed: 2 test(s), Total: 2 test(s)
Name: TestSwiftValueOfOptionals
Failed: 0 test(s), Passed: 2 test(s), Total: 2 test(s)
Name: TestSymbolAPI
Failed: 0 test(s), Passed: 2 test(s), Total: 2 test(s)
Name: TestSymbolContext
Failed: 0 test(s), Passed: 2 test(s), Total: 2 test(s)
Name: TestSyntheticCapping
Failed: 0 test(s), Passed: 2 test(s), Total: 2 test(s)
Name: TestTargetAPI
Failed: 0 test(s), Passed: 20 test(s), Total: 20 test(s)
Name: TestTargetCommand
Failed: 0 test(s), Passed: 6 test(s), Total: 6 test(s)
Name: TestTargetWatchAddress
Failed: 0 test(s), Passed: 4 test(s), Total: 4 test(s)
Name: TestThreadAPI
Failed: 0 test(s), Passed: 10 test(s), Total: 10 test(s)
Name: TestThreadExit
Failed: 0 test(s), Passed: 2 test(s), Total: 2 test(s)
Name: TestThreadJump
Failed: 0 test(s), Passed: 2 test(s), Total: 2 test(s)
Name: TestThreadSpecificBpPlusCondition
Failed: 0 test(s), Passed: 2 test(s), Total: 2 test(s)
Name: TestThreadSpecificBreakpoint
Failed: 0 test(s), Passed: 2 test(s), Total: 2 test(s)
Name: TestThreadStates
Failed: 0 test(s), Passed: 2 test(s), Total: 2 test(s)
Name: TestThreadStepOut
Failed: 0 test(s), Passed: 0 test(s), Total: 6 test(s)
Name: TestThreadStepping
Failed: 0 test(s), Passed: 2 test(s), Total: 2 test(s)
Name: TestTopLevelExprs
Failed: 0 test(s), Passed: 2 test(s), Total: 2 test(s)
Name: TestTypeCompletion
Failed: 0 test(s), Passed: 2 test(s), Total: 2 test(s)
Name: TestTypeList
Failed: 0 test(s), Passed: 2 test(s), Total: 2 test(s)
Name: TestTypeSummaryListArg
Failed: 0 test(s), Passed: 1 test(s), Total: 1 test(s)
Name: TestTypeSummaryListScript
Failed: 0 test(s), Passed: 2 test(s), Total: 2 test(s)
Name: TestUnicodeLiterals
Failed: 0 test(s), Passed: 6 test(s), Total: 6 test(s)
Name: TestUnionMembers
Failed: 0 test(s), Passed: 2 test(s), Total: 2 test(s)
Name: TestUniqueTypes
Failed: 0 test(s), Passed: 2 test(s), Total: 2 test(s)
Name: TestUnsignedTypes
Failed: 0 test(s), Passed: 2 test(s), Total: 2 test(s)
Name: TestUserFormatVsSummary
Failed: 0 test(s), Passed: 2 test(s), Total: 2 test(s)
Name: TestValueAPI
Failed: 0 test(s), Passed: 2 test(s), Total: 2 test(s)
Name: TestValueAPILinkedList
Failed: 0 test(s), Passed: 2 test(s), Total: 2 test(s)
Name: TestValueMD5Crash
Failed: 0 test(s), Passed: 2 test(s), Total: 2 test(s)
Name: TestValueObjectRecursion
Failed: 0 test(s), Passed: 2 test(s), Total: 2 test(s)
Name: TestValueOfVectorVariable
Failed: 0 test(s), Passed: 2 test(s), Total: 2 test(s)
Name: TestValueVarUpdate
Failed: 0 test(s), Passed: 2 test(s), Total: 2 test(s)
Name: TestVarInAggregateMisuse
Failed: 0 test(s), Passed: 2 test(s), Total: 2 test(s)
Name: TestVectorTypesFormatting
Failed: 0 test(s), Passed: 2 test(s), Total: 2 test(s)
Name: TestVirtual
Failed: 0 test(s), Passed: 2 test(s), Total: 2 test(s)
Name: TestWatchLocation
Failed: 0 test(s), Passed: 2 test(s), Total: 2 test(s)
Name: TestWatchLocationWithWatchSet
Failed: 0 test(s), Passed: 2 test(s), Total: 2 test(s)
Name: TestWatchpointCommandLLDB
Failed: 0 test(s), Passed: 4 test(s), Total: 4 test(s)
Name: TestWatchpointCommandPython
Failed: 0 test(s), Passed: 2 test(s), Total: 2 test(s)
Name: TestWatchpointCommands
Failed: 0 test(s), Passed: 10 test(s), Total: 10 test(s)
Name: TestWatchpointConditionAPI
Failed: 0 test(s), Passed: 2 test(s), Total: 2 test(s)
Name: TestWatchpointConditionCmd
Failed: 0 test(s), Passed: 2 test(s), Total: 2 test(s)
Name: TestWatchpointEvents
Failed: 0 test(s), Passed: 2 test(s), Total: 2 test(s)
Name: TestWatchpointIgnoreCount
Failed: 0 test(s), Passed: 2 test(s), Total: 2 test(s)
Name: TestWatchpointIter
Failed: 0 test(s), Passed: 2 test(s), Total: 2 test(s)
Name: TestWatchpointMultipleThreads
Failed: 0 test(s), Passed: 4 test(s), Total: 4 test(s)
Name: TestWatchpointSetErrorCases
Failed: 0 test(s), Passed: 2 test(s), Total: 2 test(s)
Name: TestWithLimitDebugInfo
Failed: 0 test(s), Passed: 1 test(s), Total: 2 test(s)
Name: TestWow64MiniDump
Failed: 0 test(s), Passed: 0 test(s), Total: 3 test(s)
Name: lldbsuite.test.lldbtest
Failed: 0 test(s), Passed: 58 test(s), Total: 70 test(s)

Changes

Commit f8c6d46cff8ead22e78bec8a9cc2323688ddaf44 by egranata:
[RemoteAST] Add a MetadataPromise class that will eventually replace

edit: source/Target/SwiftLanguageRuntime.cpp
edit: include/lldb/Target/SwiftLanguageRuntime.h

Thanks,
- Enrico
:envelope_with_arrow: egranata@.com :phone:️ 27683


(Enrico Granata) #3

It looks like we have a SWIFT_ALL_LIBS setting we use to tell ourselves to link every .a file that Swift’s build generates - and that doesn’t seem to include libswiftRemoteAST.a
I am trying to find out how to add libraries to this list, so +Todd

···

On Apr 22, 2016, at 4:17 PM, John McCall via swift-lldb-dev <swift-lldb-dev@swift.org> wrote:

On Apr 22, 2016, at 3:31 PM, Enrico Granata <egranata@apple.com <mailto:egranata@apple.com>> wrote:

John,
is RemoteAST not on Linux?

I was actually just fixing Linux test failures with RemoteAST last night, so it should definitely be there.

I don't know how you'd get a failure using ~RemoteASTContext() but not using any of the constructors / methods; they're implemented right next to each other.

It is its own library, maybe there's something mis-configured about it.

John.

lib/liblldbTarget.a(SwiftLanguageRuntime.cpp.o): In function `MetadataPromise':
/home/buildnode/jenkins/workspace/oss-lldb-incremental-linux-ubuntu-14_04/lldb/source/Target/SwiftLanguageRuntime.cpp:1211: undefined reference to `swift::remoteAST::RemoteASTContext::RemoteASTContext(swift::ASTContext&, std::shared_ptr<swift::remote::MemoryReader>)'
lib/liblldbTarget.a(SwiftLanguageRuntime.cpp.o): In function `lldb_private::SwiftLanguageRuntime::MetadataPromise::FulfillPromise()':
/home/buildnode/jenkins/workspace/oss-lldb-incremental-linux-ubuntu-14_04/lldb/source/Target/SwiftLanguageRuntime.cpp:1221: undefined reference to `swift::remoteAST::RemoteASTContext::getTypeForRemoteTypeMetadata(swift::remote::RemoteAddress)'
lib/liblldbTarget.a(SwiftLanguageRuntime.cpp.o): In function `std::default_delete<swift::remoteAST::RemoteASTContext>::operator()(swift::remoteAST::RemoteASTContext*) const':
/usr/bin/../lib/gcc/x86_64-linux-gnu/4.8/../../../../include/c++/4.8/bits/unique_ptr.h:67: undefined reference to `swift::remoteAST::RemoteASTContext::~RemoteASTContext()'
<>clang: error: linker command failed with exit code 1 (use -v to see invocation)

On Apr 22, 2016, at 3:30 PM, no-reply@swift.org <mailto:no-reply@swift.org> wrote:

[FAILURE] oss-lldb-incremental-linux-ubuntu-14_04 [#2982]

Build URL: https://ci.swift.org/job/oss-lldb-incremental-linux-ubuntu-14_04/2982/
Project: oss-lldb-incremental-linux-ubuntu-14_04
Date of build: Fri, 22 Apr 2016 15:27:18 -0700
Build duration: 2 min 41 sec
Identified problems:

Compile Error: This build failed because of a compile error. Below is a list of all errors in the build log:
Indication 1 <https://ci.swift.org//job/oss-lldb-incremental-linux-ubuntu-14_04/2982/consoleFull#-1586822805ee1a197b-acac-4b17-83cf-a53b95139a76>
Tests:

Name: Test-rdar-12481949
Failed: 0 test(s), Passed: 2 test(s), Total: 2 test(s)
Name: Test-rdar-9974002
Failed: 0 test(s), Passed: 2 test(s), Total: 2 test(s)
Name: Test11588
Failed: 0 test(s), Passed: 2 test(s), Total: 2 test(s)
Name: Test8638051
Failed: 0 test(s), Passed: 2 test(s), Total: 2 test(s)
Name: TestAbbreviations
Failed: 0 test(s), Passed: 1 test(s), Total: 1 test(s)
Name: TestAddressBreakpoints
Failed: 0 test(s), Passed: 2 test(s), Total: 2 test(s)
Name: TestAnonymous
Failed: 0 test(s), Passed: 14 test(s), Total: 14 test(s)
Name: TestAproposWithProcess
Failed: 0 test(s), Passed: 2 test(s), Total: 2 test(s)
Name: TestArrayTypes
Failed: 0 test(s), Passed: 4 test(s), Total: 4 test(s)
Name: TestAttachDenied
Failed: 0 test(s), Passed: 2 test(s), Total: 2 test(s)
Name: TestAttachResume
Failed: 0 test(s), Passed: 2 test(s), Total: 2 test(s)
Name: TestAvoidBreakpointInDelaySlot
Failed: 0 test(s), Passed: 0 test(s), Total: 2 test(s)
Name: TestBSDArchives
Failed: 0 test(s), Passed: 2 test(s), Total: 2 test(s)
Name: TestBackticksWithoutATarget
Failed: 0 test(s), Passed: 1 test(s), Total: 1 test(s)
Name: TestBacktraceAll
Failed: 0 test(s), Passed: 2 test(s), Total: 2 test(s)
Name: TestBatchMode
Failed: 0 test(s), Passed: 6 test(s), Total: 6 test(s)
Name: TestBitfields
Failed: 0 test(s), Passed: 4 test(s), Total: 4 test(s)
Name: TestBreakpointAPI
Failed: 0 test(s), Passed: 2 test(s), Total: 2 test(s)
Name: TestBreakpointCaseSensitivity
Failed: 0 test(s), Passed: 0 test(s), Total: 2 test(s)
Name: TestBreakpointCommand
Failed: 0 test(s), Passed: 2 test(s), Total: 2 test(s)
Name: TestBreakpointCommandsFromPython
Failed: 0 test(s), Passed: 2 test(s), Total: 2 test(s)
Name: TestBreakpointConditions
Failed: 0 test(s), Passed: 6 test(s), Total: 6 test(s)
Name: TestBreakpointIDs
Failed: 0 test(s), Passed: 2 test(s), Total: 2 test(s)
Name: TestBreakpointIgnoreCount
Failed: 0 test(s), Passed: 4 test(s), Total: 4 test(s)
Name: TestBreakpointLanguage
Failed: 0 test(s), Passed: 4 test(s), Total: 4 test(s)
Name: TestBreakpointLocations
Failed: 0 test(s), Passed: 2 test(s), Total: 2 test(s)
Name: TestBreakpointOptions
Failed: 0 test(s), Passed: 2 test(s), Total: 2 test(s)
Name: TestBreakpointSetRestart
Failed: 0 test(s), Passed: 2 test(s), Total: 2 test(s)
Name: TestBreakpointsWithNoTargets
Failed: 0 test(s), Passed: 2 test(s), Total: 2 test(s)
Name: TestBuiltinTrap
Failed: 0 test(s), Passed: 2 test(s), Total: 2 test(s)
Name: TestBulkyEnumsVariables
Failed: 0 test(s), Passed: 2 test(s), Total: 2 test(s)
Name: TestCInlines
Failed: 0 test(s), Passed: 2 test(s), Total: 2 test(s)
Name: TestCPP11EnumTypes
Failed: 0 test(s), Passed: 16 test(s), Total: 16 test(s)
Name: TestCPPAuto
Failed: 0 test(s), Passed: 2 test(s), Total: 2 test(s)
Name: TestCPPBool
Failed: 0 test(s), Passed: 2 test(s), Total: 2 test(s)
Name: TestCPPBreakpointCommands
Failed: 0 test(s), Passed: 2 test(s), Total: 2 test(s)
Name: TestCPPBreakpointLocations
Failed: 0 test(s), Passed: 2 test(s), Total: 2 test(s)
Name: TestCPPExceptionBreakpoint
Failed: 0 test(s), Passed: 2 test(s), Total: 2 test(s)
Name: TestCPPExceptionBreakpoints
Failed: 0 test(s), Passed: 2 test(s), Total: 2 test(s)
Name: TestCPPStaticMethods
Failed: 0 test(s), Passed: 2 test(s), Total: 2 test(s)
Name: TestCPPThis
Failed: 0 test(s), Passed: 2 test(s), Total: 2 test(s)
Name: TestCStrings
Failed: 0 test(s), Passed: 2 test(s), Total: 2 test(s)
Name: TestCallCPPFunction
Failed: 0 test(s), Passed: 2 test(s), Total: 2 test(s)
Name: TestCallStdStringFunction
Failed: 0 test(s), Passed: 2 test(s), Total: 2 test(s)
Name: TestCallStopAndContinue
Failed: 0 test(s), Passed: 2 test(s), Total: 2 test(s)
Name: TestCallThatRestarts
Failed: 0 test(s), Passed: 2 test(s), Total: 2 test(s)
Name: TestCallUserAnonTypedef
Failed: 0 test(s), Passed: 2 test(s), Total: 2 test(s)
Name: TestCallUserDefinedFunction
Failed: 0 test(s), Passed: 2 test(s), Total: 2 test(s)
Name: TestCallWithTimeout
Failed: 0 test(s), Passed: 2 test(s), Total: 2 test(s)
Name: TestChangeProcessGroup
Failed: 0 test(s), Passed: 2 test(s), Total: 2 test(s)
Name: TestChangeValueAPI
Failed: 0 test(s), Passed: 2 test(s), Total: 2 test(s)
Name: TestChar1632T
Failed: 0 test(s), Passed: 2 test(s), Total: 2 test(s)
Name: TestClassTypes
Failed: 0 test(s), Passed: 8 test(s), Total: 8 test(s)
Name: TestClassTypesDisassembly
Failed: 0 test(s), Passed: 4 test(s), Total: 4 test(s)
Name: TestCommandHistory
Failed: 0 test(s), Passed: 1 test(s), Total: 1 test(s)
Name: TestCommandInterpreterAPI
Failed: 0 test(s), Passed: 2 test(s), Total: 2 test(s)
Name: TestCommandRegex
Failed: 0 test(s), Passed: 1 test(s), Total: 1 test(s)
Name: TestCommandScript
Failed: 0 test(s), Passed: 2 test(s), Total: 2 test(s)
Name: TestCommandSource
Failed: 0 test(s), Passed: 1 test(s), Total: 1 test(s)
Name: TestCommonShortSpellings
Failed: 0 test(s), Passed: 1 test(s), Total: 1 test(s)
Name: TestCompDirSymLink
Failed: 0 test(s), Passed: 6 test(s), Total: 6 test(s)
Name: TestCompletion
Failed: 0 test(s), Passed: 33 test(s), Total: 33 test(s)
Name: TestConcurrentEvents
Failed: 0 test(s), Passed: 58 test(s), Total: 58 test(s)
Name: TestConditionalBreak
Failed: 0 test(s), Passed: 4 test(s), Total: 4 test(s)
Name: TestConsecutiveBreakpoints
Failed: 0 test(s), Passed: 3 test(s), Total: 3 test(s)
Name: TestConvenienceVariables
Failed: 0 test(s), Passed: 2 test(s), Total: 2 test(s)
Name: TestCppChainedCalls
Failed: 0 test(s), Passed: 2 test(s), Total: 2 test(s)
Name: TestCppGlobalOperators
Failed: 0 test(s), Passed: 2 test(s), Total: 2 test(s)
Name: TestCppIncompleteTypes
Failed: 0 test(s), Passed: 4 test(s), Total: 4 test(s)
Name: TestCppNsImport
Failed: 0 test(s), Passed: 2 test(s), Total: 2 test(s)
Name: TestCppScope
Failed: 0 test(s), Passed: 2 test(s), Total: 2 test(s)
Name: TestCppValueCast
Failed: 0 test(s), Passed: 2 test(s), Total: 2 test(s)
Name: TestCrashDuringStep
Failed: 0 test(s), Passed: 2 test(s), Total: 2 test(s)
Name: TestCreateAfterAttach
Failed: 0 test(s), Passed: 4 test(s), Total: 4 test(s)
Name: TestCreateDuringInstructionStep
Failed: 0 test(s), Passed: 2 test(s), Total: 2 test(s)
Name: TestCxxWCharT
Failed: 0 test(s), Passed: 2 test(s), Total: 2 test(s)
Name: TestDataFormatterAdv
Failed: 0 test(s), Passed: 2 test(s), Total: 2 test(s)
Name: TestDataFormatterCategories
Failed: 0 test(s), Passed: 2 test(s), Total: 2 test(s)
Name: TestDataFormatterCpp
Failed: 0 test(s), Passed: 2 test(s), Total: 2 test(s)
Name: TestDataFormatterDisabling
Failed: 0 test(s), Passed: 2 test(s), Total: 2 test(s)
Name: TestDataFormatterEnumFormat
Failed: 0 test(s), Passed: 2 test(s), Total: 2 test(s)
Name: TestDataFormatterGlobals
Failed: 0 test(s), Passed: 2 test(s), Total: 2 test(s)
Name: TestDataFormatterHexCaps
Failed: 0 test(s), Passed: 2 test(s), Total: 2 test(s)
Name: TestDataFormatterLanguageCategoryUpdates
Failed: 0 test(s), Passed: 2 test(s), Total: 2 test(s)
Name: TestDataFormatterLibccIterator
Failed: 0 test(s), Passed: 0 test(s), Total: 2 test(s)
Name: TestDataFormatterLibccMap
Failed: 0 test(s), Passed: 0 test(s), Total: 2 test(s)
Name: TestDataFormatterLibccMultiMap
Failed: 0 test(s), Passed: 0 test(s), Total: 2 test(s)
Name: TestDataFormatterLibcxxList
Failed: 0 test(s), Passed: 0 test(s), Total: 2 test(s)
Name: TestDataFormatterLibcxxListLoop
Failed: 0 test(s), Passed: 0 test(s), Total: 2 test(s)
Name: TestDataFormatterLibcxxMultiSet
Failed: 0 test(s), Passed: 0 test(s), Total: 2 test(s)
Name: TestDataFormatterLibcxxSet
Failed: 0 test(s), Passed: 2 test(s), Total: 2 test(s)
Name: TestDataFormatterLibcxxString
Failed: 0 test(s), Passed: 0 test(s), Total: 2 test(s)
Name: TestDataFormatterLibcxxVBool
Failed: 0 test(s), Passed: 0 test(s), Total: 2 test(s)
Name: TestDataFormatterLibcxxVector
Failed: 0 test(s), Passed: 0 test(s), Total: 2 test(s)
Name: TestDataFormatterNamedSummaries
Failed: 0 test(s), Passed: 2 test(s), Total: 2 test(s)
Name: TestDataFormatterPythonSynth
Failed: 0 test(s), Passed: 4 test(s), Total: 4 test(s)
Name: TestDataFormatterRefPtrRecursion
Failed: 0 test(s), Passed: 2 test(s), Total: 2 test(s)
Name: TestDataFormatterScript
Failed: 0 test(s), Passed: 2 test(s), Total: 2 test(s)
Name: TestDataFormatterSkipSummary
Failed: 0 test(s), Passed: 2 test(s), Total: 2 test(s)
Name: TestDataFormatterSmartArray
Failed: 0 test(s), Passed: 2 test(s), Total: 2 test(s)
Name: TestDataFormatterStdIterator
Failed: 0 test(s), Passed: 2 test(s), Total: 2 test(s)
Name: TestDataFormatterStdList
Failed: 0 test(s), Passed: 2 test(s), Total: 2 test(s)
Name: TestDataFormatterStdMap
Failed: 0 test(s), Passed: 2 test(s), Total: 2 test(s)
Name: TestDataFormatterStdString
Failed: 0 test(s), Passed: 2 test(s), Total: 2 test(s)
Name: TestDataFormatterStdVBool
Failed: 0 test(s), Passed: 2 test(s), Total: 2 test(s)
Name: TestDataFormatterStdVector
Failed: 0 test(s), Passed: 2 test(s), Total: 2 test(s)
Name: TestDataFormatterSynth
Failed: 0 test(s), Passed: 2 test(s), Total: 2 test(s)
Name: TestDataFormatterSynthVal
Failed: 0 test(s), Passed: 2 test(s), Total: 2 test(s)
Name: TestDataFormatterUnordered
Failed: 0 test(s), Passed: 0 test(s), Total: 2 test(s)
Name: TestDataFormatterVarScriptFormatting
Failed: 0 test(s), Passed: 2 test(s), Total: 2 test(s)
Name: TestDeadStrip
Failed: 0 test(s), Passed: 1 test(s), Total: 1 test(s)
Name: TestDebugBreak
Failed: 0 test(s), Passed: 0 test(s), Total: 1 test(s)
Name: TestDebuggerAPI
Failed: 0 test(s), Passed: 3 test(s), Total: 3 test(s)
Name: TestDefaultCacheLineSize
Failed: 0 test(s), Passed: 0 test(s), Total: 2 test(s)
Name: TestDefaultConstructorForAPIObjects
Failed: 0 test(s), Passed: 34 test(s), Total: 34 test(s)
Name: TestDiamond
Failed: 0 test(s), Passed: 2 test(s), Total: 2 test(s)
Name: TestDisasmAPI
Failed: 0 test(s), Passed: 2 test(s), Total: 2 test(s)
Name: TestDisassembleBreakpoint
Failed: 0 test(s), Passed: 2 test(s), Total: 2 test(s)
Name: TestDisassembleRawData
Failed: 0 test(s), Passed: 1 test(s), Total: 1 test(s)
Name: TestDisassemble_VST1_64
Failed: 0 test(s), Passed: 0 test(s), Total: 1 test(s)
Name: TestDynamicValue
Failed: 0 test(s), Passed: 2 test(s), Total: 2 test(s)
Name: TestDynamicValueChildCount
Failed: 0 test(s), Passed: 2 test(s), Total: 2 test(s)
Name: TestEmulations
Failed: 0 test(s), Passed: 2 test(s), Total: 2 test(s)
Name: TestEnumTypes
Failed: 0 test(s), Passed: 2 test(s), Total: 2 test(s)
Name: TestEnumVariables
Failed: 0 test(s), Passed: 2 test(s), Total: 2 test(s)
Name: TestEvents
Failed: 0 test(s), Passed: 0 test(s), Total: 6 test(s)
Name: TestExitDuringStep
Failed: 0 test(s), Passed: 6 test(s), Total: 6 test(s)
Name: TestExprDoesntBlock
Failed: 0 test(s), Passed: 2 test(s), Total: 2 test(s)
Name: TestExprHelpExamples
Failed: 0 test(s), Passed: 2 test(s), Total: 2 test(s)
Name: TestExprInProtocolExtension
Failed: 0 test(s), Passed: 2 test(s), Total: 2 test(s)
Name: TestExprOptions
Failed: 0 test(s), Passed: 2 test(s), Total: 2 test(s)
Name: TestExpressionAccessControl
Failed: 0 test(s), Passed: 2 test(s), Total: 2 test(s)
Name: TestExpressionErrorBreakpoint
Failed: 0 test(s), Passed: 8 test(s), Total: 8 test(s)
Name: TestExpressionErrors
Failed: 0 test(s), Passed: 2 test(s), Total: 2 test(s)
Name: TestExpressionInSyscall
Failed: 0 test(s), Passed: 2 test(s), Total: 2 test(s)
Name: TestExpressionScopes
Failed: 0 test(s), Passed: 2 test(s), Total: 2 test(s)
Name: TestExprs
Failed: 0 test(s), Passed: 6 test(s), Total: 6 test(s)
Name: TestExprs2
Failed: 0 test(s), Passed: 2 test(s), Total: 2 test(s)
Name: TestExprsChar
Failed: 0 test(s), Passed: 4 test(s), Total: 4 test(s)
Name: TestFloatTypes
Failed: 0 test(s), Passed: 4 test(s), Total: 4 test(s)
Name: TestFloatTypesExpr
Failed: 0 test(s), Passed: 4 test(s), Total: 4 test(s)
Name: TestFormatPropagation
Failed: 0 test(s), Passed: 2 test(s), Total: 2 test(s)
Name: TestFormats
Failed: 0 test(s), Passed: 2 test(s), Total: 2 test(s)
Name: TestFormatters
Failed: 0 test(s), Passed: 2 test(s), Total: 2 test(s)
Name: TestFormattersSBAPI
Failed: 0 test(s), Passed: 4 test(s), Total: 4 test(s)
Name: TestForwardDeclaration
Failed: 0 test(s), Passed: 2 test(s), Total: 2 test(s)
Name: TestFrameFormatSmallStruct
Failed: 0 test(s), Passed: 2 test(s), Total: 2 test(s)
Name: TestFrameUtils
Failed: 0 test(s), Passed: 2 test(s), Total: 2 test(s)
Name: TestFrameVariableAnonymousUnions
Failed: 0 test(s), Passed: 2 test(s), Total: 2 test(s)
Name: TestFrames
Failed: 0 test(s), Passed: 6 test(s), Total: 6 test(s)
Name: TestFunctionTypes
Failed: 0 test(s), Passed: 4 test(s), Total: 4 test(s)
Name: TestFunctionVariables
Failed: 0 test(s), Passed: 2 test(s), Total: 2 test(s)
Name: TestGDBRemoteMemoryRead
Failed: 0 test(s), Passed: 2 test(s), Total: 2 test(s)
Name: TestGdbRemoteAbort
Failed: 0 test(s), Passed: 1 test(s), Total: 1 test(s)
Name: TestGdbRemoteAttach
Failed: 0 test(s), Passed: 1 test(s), Total: 1 test(s)
Name: TestGdbRemoteAuxvSupport
Failed: 0 test(s), Passed: 4 test(s), Total: 4 test(s)
Name: TestGdbRemoteExpeditedRegisters
Failed: 0 test(s), Passed: 5 test(s), Total: 5 test(s)
Name: TestGdbRemoteKill
Failed: 0 test(s), Passed: 1 test(s), Total: 1 test(s)
Name: TestGdbRemoteProcessInfo
Failed: 0 test(s), Passed: 5 test(s), Total: 5 test(s)
Name: TestGdbRemoteRegisterState
Failed: 0 test(s), Passed: 2 test(s), Total: 2 test(s)
Name: TestGdbRemoteSegFault
Failed: 0 test(s), Passed: 1 test(s), Total: 1 test(s)
Name: TestGdbRemoteSingleStep
Failed: 0 test(s), Passed: 1 test(s), Total: 1 test(s)
Name: TestGdbRemoteThreadsInStopReply
Failed: 0 test(s), Passed: 4 test(s), Total: 4 test(s)
Name: TestGdbRemote_qThreadStopInfo
Failed: 0 test(s), Passed: 3 test(s), Total: 4 test(s)
Name: TestGdbRemote_vCont
Failed: 0 test(s), Passed: 6 test(s), Total: 6 test(s)
Name: TestGlobalVariables
Failed: 0 test(s), Passed: 2 test(s), Total: 2 test(s)
Name: TestGoFormatters
Failed: 0 test(s), Passed: 0 test(s), Total: 1 test(s)
Name: TestGoroutines
Failed: 0 test(s), Passed: 0 test(s), Total: 1 test(s)
Name: TestHandleSegv
Failed: 0 test(s), Passed: 2 test(s), Total: 2 test(s)
Name: TestHelloWorld
Failed: 0 test(s), Passed: 6 test(s), Total: 6 test(s)
Name: TestHelp
Failed: 0 test(s), Passed: 18 test(s), Total: 18 test(s)
Name: TestImageListMultiArchitecture
Failed: 0 test(s), Passed: 1 test(s), Total: 1 test(s)
Name: TestImport
Failed: 0 test(s), Passed: 1 test(s), Total: 1 test(s)
Name: TestInOutVariables
Failed: 0 test(s), Passed: 2 test(s), Total: 2 test(s)
Name: TestIndexVariable
Failed: 0 test(s), Passed: 2 test(s), Total: 2 test(s)
Name: TestIndirectEnumVariables
Failed: 0 test(s), Passed: 2 test(s), Total: 2 test(s)
Name: TestInferiorAssert
Failed: 0 test(s), Passed: 12 test(s), Total: 12 test(s)
Name: TestInferiorChanged
Failed: 0 test(s), Passed: 2 test(s), Total: 2 test(s)
Name: TestInferiorCrashing
Failed: 0 test(s), Passed: 12 test(s), Total: 14 test(s)
Name: TestInlineStepping
Failed: 0 test(s), Passed: 0 test(s), Total: 6 test(s)
Name: TestInlinedBreakpoints
Failed: 0 test(s), Passed: 2 test(s), Total: 2 test(s)
Name: TestInlinedFrame
Failed: 0 test(s), Passed: 2 test(s), Total: 2 test(s)
Name: TestInlines
Failed: 0 test(s), Passed: 2 test(s), Total: 2 test(s)
Name: TestIntegerTypes
Failed: 0 test(s), Passed: 20 test(s), Total: 20 test(s)
Name: TestIntegerTypesExpr
Failed: 0 test(s), Passed: 20 test(s), Total: 20 test(s)
Name: TestJITLoaderGDB
Failed: 0 test(s), Passed: 0 test(s), Total: 2 test(s)
Name: TestLLDBIterator
Failed: 0 test(s), Passed: 6 test(s), Total: 6 test(s)
Name: TestLLVM
Failed: 0 test(s), Passed: 1 test(s), Total: 1 test(s)
Name: TestLazyReverse
Failed: 0 test(s), Passed: 1 test(s), Total: 1 test(s)
Name: TestLibCxxAtomic
Failed: 0 test(s), Passed: 0 test(s), Total: 2 test(s)
Name: TestLinuxCore
Failed: 0 test(s), Passed: 3 test(s), Total: 4 test(s)
Name: TestListener
Failed: 0 test(s), Passed: 2 test(s), Total: 2 test(s)
Name: TestLldbGdbServer
Failed: 0 test(s), Passed: 34 test(s), Total: 34 test(s)
Name: TestLoadUnload
Failed: 0 test(s), Passed: 10 test(s), Total: 10 test(s)
Name: TestLogging
Failed: 0 test(s), Passed: 4 test(s), Total: 4 test(s)
Name: TestMembersAndLocalsWithSameName
Failed: 0 test(s), Passed: 4 test(s), Total: 4 test(s)
Name: TestMemoryCache
Failed: 0 test(s), Passed: 2 test(s), Total: 2 test(s)
Name: TestMemoryRead
Failed: 0 test(s), Passed: 2 test(s), Total: 2 test(s)
Name: TestMiBreak
Failed: 0 test(s), Passed: 5 test(s), Total: 5 test(s)
Name: TestMiCliSupport
Failed: 0 test(s), Passed: 1 test(s), Total: 8 test(s)
Name: TestMiData
Failed: 0 test(s), Passed: 6 test(s), Total: 7 test(s)
Name: TestMiExec
Failed: 0 test(s), Passed: 8 test(s), Total: 8 test(s)
Name: TestMiExit
Failed: 0 test(s), Passed: 3 test(s), Total: 3 test(s)
Name: TestMiFile
Failed: 0 test(s), Passed: 4 test(s), Total: 4 test(s)
Name: TestMiGdbSetShow
Failed: 0 test(s), Passed: 4 test(s), Total: 5 test(s)
Name: TestMiGdbSetShowPrint
Failed: 0 test(s), Passed: 2 test(s), Total: 3 test(s)
Name: TestMiInterpreterExec
Failed: 0 test(s), Passed: 7 test(s), Total: 7 test(s)
Name: TestMiLibraryLoaded
Failed: 0 test(s), Passed: 1 test(s), Total: 1 test(s)
Name: TestMiPrompt
Failed: 0 test(s), Passed: 1 test(s), Total: 1 test(s)
Name: TestMiSignal
Failed: 0 test(s), Passed: 1 test(s), Total: 3 test(s)
Name: TestMiStack
Failed: 0 test(s), Passed: 6 test(s), Total: 6 test(s)
Name: TestMiStartupOptions
Failed: 0 test(s), Passed: 8 test(s), Total: 10 test(s)
Name: TestMiSyntax
Failed: 0 test(s), Passed: 2 test(s), Total: 2 test(s)
Name: TestMiTarget
Failed: 0 test(s), Passed: 0 test(s), Total: 3 test(s)
Name: TestMiVar
Failed: 0 test(s), Passed: 2 test(s), Total: 6 test(s)
Name: TestMiniDump
Failed: 0 test(s), Passed: 0 test(s), Total: 7 test(s)
Name: TestMixedLanguages
Failed: 0 test(s), Passed: 2 test(s), Total: 2 test(s)
Name: TestModuleAndSection
Failed: 0 test(s), Passed: 6 test(s), Total: 6 test(s)
Name: TestMultilevelArrays
Failed: 0 test(s), Passed: 1 test(s), Total: 1 test(s)
Name: TestMultipleDebuggersCommands
Failed: 0 test(s), Passed: 1 test(s), Total: 1 test(s)
Name: TestMultithreaded
Failed: 0 test(s), Passed: 0 test(s), Total: 8 test(s)
Name: TestMyFirstWatchpoint
Failed: 0 test(s), Passed: 2 test(s), Total: 2 test(s)
Name: TestNamespace
Failed: 0 test(s), Passed: 2 test(s), Total: 2 test(s)
Name: TestNestedAlias
Failed: 0 test(s), Passed: 2 test(s), Total: 2 test(s)
Name: TestNestedPersistentTypes
Failed: 0 test(s), Passed: 2 test(s), Total: 2 test(s)
Name: TestNoSuchArch
Failed: 0 test(s), Passed: 2 test(s), Total: 2 test(s)
Name: TestNoreturnUnwind
Failed: 0 test(s), Passed: 2 test(s), Total: 2 test(s)
Name: TestNumThreads
Failed: 0 test(s), Passed: 2 test(s), Total: 2 test(s)
Name: TestOverloadedFunctions
Failed: 0 test(s), Passed: 2 test(s), Total: 2 test(s)
Name: TestPaths
Failed: 0 test(s), Passed: 2 test(s), Total: 3 test(s)
Name: TestPersistentPtrUpdate
Failed: 0 test(s), Passed: 2 test(s), Total: 2 test(s)
Name: TestPersistentTypes
Failed: 0 test(s), Passed: 2 test(s), Total: 2 test(s)
Name: TestPersistentVariables
Failed: 0 test(s), Passed: 2 test(s), Total: 2 test(s)
Name: TestPlatformCommand
Failed: 0 test(s), Passed: 7 test(s), Total: 8 test(s)
Name: TestPlatformProcessConnect
Failed: 0 test(s), Passed: 0 test(s), Total: 1 test(s)
Name: TestPluginCommands
Failed: 0 test(s), Passed: 1 test(s), Total: 1 test(s)
Name: TestPrintStackTraces
Failed: 0 test(s), Passed: 2 test(s), Total: 2 test(s)
Name: TestPrintfAfterUp
Failed: 0 test(s), Passed: 2 test(s), Total: 2 test(s)
Name: TestProcessAPI
Failed: 0 test(s), Passed: 10 test(s), Total: 10 test(s)
Name: TestProcessAttach
Failed: 0 test(s), Passed: 4 test(s), Total: 4 test(s)
Name: TestProcessIO
Failed: 0 test(s), Passed: 10 test(s), Total: 10 test(s)
Name: TestProcessLaunch
Failed: 0 test(s), Passed: 4 test(s), Total: 4 test(s)
Name: TestProcessSaveCore
Failed: 0 test(s), Passed: 0 test(s), Total: 4 test(s)
Name: TestPtrRef2Typedef
Failed: 0 test(s), Passed: 2 test(s), Total: 2 test(s)
Name: TestPtrToArrayFormatting
Failed: 0 test(s), Passed: 2 test(s), Total: 2 test(s)
Name: TestPublicAPIHeaders
Failed: 0 test(s), Passed: 0 test(s), Total: 2 test(s)
Name: TestPythonOSPlugin
Failed: 0 test(s), Passed: 2 test(s), Total: 2 test(s)
Name: TestQuoting
Failed: 0 test(s), Passed: 11 test(s), Total: 11 test(s)
Name: TestREPLArray
Failed: 0 test(s), Passed: 1 test(s), Total: 1 test(s)
Name: TestREPLBasic
Failed: 0 test(s), Passed: 1 test(s), Total: 1 test(s)
Name: TestREPLClasses
Failed: 0 test(s), Passed: 1 test(s), Total: 1 test(s)
Name: TestREPLClosure
Failed: 0 test(s), Passed: 1 test(s), Total: 1 test(s)
Name: TestREPLDynamicType
Failed: 0 test(s), Passed: 1 test(s), Total: 1 test(s)
Name: TestREPLFunctionDefinition
Failed: 0 test(s), Passed: 1 test(s), Total: 1 test(s)
Name: TestREPLPOReplType
Failed: 0 test(s), Passed: 1 test(s), Total: 1 test(s)
Name: TestREPLQuickLookObject
Failed: 0 test(s), Passed: 1 test(s), Total: 1 test(s)
Name: TestREPLRecursiveClass
Failed: 0 test(s), Passed: 1 test(s), Total: 1 test(s)
Name: TestREPLSubclassing
Failed: 0 test(s), Passed: 1 test(s), Total: 1 test(s)
Name: TestRaise
Failed: 0 test(s), Passed: 4 test(s), Total: 4 test(s)
Name: TestRdar12586188
Failed: 0 test(s), Passed: 1 test(s), Total: 1 test(s)
Name: TestRecursiveInferior
Failed: 0 test(s), Passed: 12 test(s), Total: 14 test(s)
Name: TestRecursiveTypes
Failed: 0 test(s), Passed: 4 test(s), Total: 4 test(s)
Name: TestRegexpBreakCommand
Failed: 0 test(s), Passed: 2 test(s), Total: 2 test(s)
Name: TestRegisterVariables
Failed: 0 test(s), Passed: 2 test(s), Total: 2 test(s)
Name: TestRegisters
Failed: 0 test(s), Passed: 14 test(s), Total: 14 test(s)
Name: TestRegistersIterator
Failed: 0 test(s), Passed: 2 test(s), Total: 2 test(s)
Name: TestRerun
Failed: 0 test(s), Passed: 2 test(s), Total: 2 test(s)
Name: TestReturnValue
Failed: 0 test(s), Passed: 2 test(s), Total: 2 test(s)
Name: TestRvalueReferences
Failed: 0 test(s), Passed: 2 test(s), Total: 2 test(s)
Name: TestSBData
Failed: 0 test(s), Passed: 2 test(s), Total: 2 test(s)
Name: TestSBFrameFindValue
Failed: 0 test(s), Passed: 2 test(s), Total: 2 test(s)
Name: TestSBValuePersist
Failed: 0 test(s), Passed: 2 test(s), Total: 2 test(s)
Name: TestSBValueUpdates
Failed: 0 test(s), Passed: 2 test(s), Total: 2 test(s)
Name: TestSTL
Failed: 0 test(s), Passed: 2 test(s), Total: 2 test(s)
Name: TestSTTYBeforeAndAfter
Failed: 0 test(s), Passed: 0 test(s), Total: 1 test(s)
Name: TestSectionAPI
Failed: 0 test(s), Passed: 2 test(s), Total: 2 test(s)
Name: TestSendSignal
Failed: 0 test(s), Passed: 2 test(s), Total: 2 test(s)
Name: TestSequenceFunctions
Failed: 0 test(s), Passed: 3 test(s), Total: 3 test(s)
Name: TestSetValues
Failed: 0 test(s), Passed: 2 test(s), Total: 2 test(s)
Name: TestSetWatchlocation
Failed: 0 test(s), Passed: 2 test(s), Total: 2 test(s)
Name: TestSetWatchpoint
Failed: 0 test(s), Passed: 2 test(s), Total: 2 test(s)
Name: TestSettings
Failed: 0 test(s), Passed: 23 test(s), Total: 23 test(s)
Name: TestSharedLib
Failed: 0 test(s), Passed: 2 test(s), Total: 2 test(s)
Name: TestSharedLibStrippedSymbols
Failed: 0 test(s), Passed: 2 test(s), Total: 2 test(s)
Name: TestSignalsAPI
Failed: 0 test(s), Passed: 2 test(s), Total: 2 test(s)
Name: TestSignedTypes
Failed: 0 test(s), Passed: 2 test(s), Total: 2 test(s)
Name: TestSimpleExpressions
Failed: 0 test(s), Passed: 2 test(s), Total: 2 test(s)
Name: TestSingleQuoteInFilename
Failed: 0 test(s), Passed: 1 test(s), Total: 1 test(s)
Name: TestSourceManager
Failed: 0 test(s), Passed: 8 test(s), Total: 8 test(s)
Name: TestStaticVariables
Failed: 0 test(s), Passed: 2 test(s), Total: 2 test(s)
Name: TestStepNoDebug
Failed: 0 test(s), Passed: 6 test(s), Total: 6 test(s)
Name: TestStepTarget
Failed: 0 test(s), Passed: 10 test(s), Total: 10 test(s)
Name: TestStopHookCmd
Failed: 0 test(s), Passed: 3 test(s), Total: 3 test(s)
Name: TestStopHookMechanism
Failed: 0 test(s), Passed: 2 test(s), Total: 2 test(s)
Name: TestStopHookMultipleThreads
Failed: 0 test(s), Passed: 2 test(s), Total: 2 test(s)
Name: TestStubReverseConnect
Failed: 0 test(s), Passed: 1 test(s), Total: 1 test(s)
Name: TestStubSetSID
Failed: 0 test(s), Passed: 3 test(s), Total: 3 test(s)
Name: TestSwiftAnyObjectType
Failed: 0 test(s), Passed: 2 test(s), Total: 2 test(s)
Name: TestSwiftAnyType
Failed: 0 test(s), Passed: 2 test(s), Total: 2 test(s)
Name: TestSwiftArchetypeResolution
Failed: 0 test(s), Passed: 2 test(s), Total: 2 test(s)
Name: TestSwiftArrayType
Failed: 0 test(s), Passed: 2 test(s), Total: 2 test(s)
Name: TestSwiftBacktracePrinting
Failed: 0 test(s), Passed: 2 test(s), Total: 2 test(s)
Name: TestSwiftBreakByPartialName
Failed: 0 test(s), Passed: 2 test(s), Total: 2 test(s)
Name: TestSwiftClassTypes
Failed: 0 test(s), Passed: 2 test(s), Total: 2 test(s)
Name: TestSwiftConditionalBreakpoint
Failed: 0 test(s), Passed: 2 test(s), Total: 2 test(s)
Name: TestSwiftDynamicValue
Failed: 0 test(s), Passed: 2 test(s), Total: 2 test(s)
Name: TestSwiftExpressionsInClassFunctions
Failed: 0 test(s), Passed: 2 test(s), Total: 2 test(s)
Name: TestSwiftExpressionsInMethodsPureSwift
Failed: 0 test(s), Passed: 2 test(s), Total: 2 test(s)
Name: TestSwiftFixIts
Failed: 0 test(s), Passed: 2 test(s), Total: 2 test(s)
Name: TestSwiftGenericTupleLabels
Failed: 0 test(s), Passed: 2 test(s), Total: 2 test(s)
Name: TestSwiftGenericTypes
Failed: 0 test(s), Passed: 2 test(s), Total: 2 test(s)
Name: TestSwiftGlobals
Failed: 0 test(s), Passed: 2 test(s), Total: 2 test(s)
Name: TestSwiftHideRuntimeSupport
Failed: 0 test(s), Passed: 2 test(s), Total: 2 test(s)
Name: TestSwiftInstancePointerSetSP
Failed: 0 test(s), Passed: 2 test(s), Total: 2 test(s)
Name: TestSwiftLetInt
Failed: 0 test(s), Passed: 2 test(s), Total: 2 test(s)
Name: TestSwiftMetadataSymbols
Failed: 0 test(s), Passed: 2 test(s), Total: 2 test(s)
Name: TestSwiftMetadataSymbolsType
Failed: 0 test(s), Passed: 2 test(s), Total: 2 test(s)
Name: TestSwiftMetatype
Failed: 0 test(s), Passed: 2 test(s), Total: 2 test(s)
Name: TestSwiftMultipayloadEnum
Failed: 0 test(s), Passed: 2 test(s), Total: 2 test(s)
Name: TestSwiftNestedArray
Failed: 0 test(s), Passed: 2 test(s), Total: 2 test(s)
Name: TestSwiftOneCaseEnum
Failed: 0 test(s), Passed: 2 test(s), Total: 2 test(s)
Name: TestSwiftOptionals
Failed: 0 test(s), Passed: 2 test(s), Total: 2 test(s)
Name: TestSwiftProtocolTypes
Failed: 0 test(s), Passed: 2 test(s), Total: 2 test(s)
Name: TestSwiftRangeTypes
Failed: 0 test(s), Passed: 2 test(s), Total: 2 test(s)
Name: TestSwiftReferenceStorageTypes
Failed: 0 test(s), Passed: 2 test(s), Total: 2 test(s)
Name: TestSwiftReturns
Failed: 0 test(s), Passed: 0 test(s), Total: 2 test(s)
Name: TestSwiftStaticStringVariables
Failed: 0 test(s), Passed: 2 test(s), Total: 2 test(s)
Name: TestSwiftStdlibDictionary
Failed: 0 test(s), Passed: 0 test(s), Total: 2 test(s)
Name: TestSwiftStdlibSet
Failed: 0 test(s), Passed: 2 test(s), Total: 2 test(s)
Name: TestSwiftStepping
Failed: 0 test(s), Passed: 2 test(s), Total: 2 test(s)
Name: TestSwiftStringVariables
Failed: 0 test(s), Passed: 2 test(s), Total: 2 test(s)
Name: TestSwiftStructChangeRerun
Failed: 0 test(s), Passed: 0 test(s), Total: 2 test(s)
Name: TestSwiftStructInit
Failed: 0 test(s), Passed: 2 test(s), Total: 2 test(s)
Name: TestSwiftTupleTypes
Failed: 0 test(s), Passed: 2 test(s), Total: 2 test(s)
Name: TestSwiftTypeAliasFormatters
Failed: 0 test(s), Passed: 2 test(s), Total: 2 test(s)
Name: TestSwiftTypeLookup
Failed: 0 test(s), Passed: 2 test(s), Total: 2 test(s)
Name: TestSwiftTypeMetadata
Failed: 0 test(s), Passed: 2 test(s), Total: 2 test(s)
Name: TestSwiftTypes
Failed: 0 test(s), Passed: 2 test(s), Total: 2 test(s)
Name: TestSwiftValueOfOptionals
Failed: 0 test(s), Passed: 2 test(s), Total: 2 test(s)
Name: TestSymbolAPI
Failed: 0 test(s), Passed: 2 test(s), Total: 2 test(s)
Name: TestSymbolContext
Failed: 0 test(s), Passed: 2 test(s), Total: 2 test(s)
Name: TestSyntheticCapping
Failed: 0 test(s), Passed: 2 test(s), Total: 2 test(s)
Name: TestTargetAPI
Failed: 0 test(s), Passed: 20 test(s), Total: 20 test(s)
Name: TestTargetCommand
Failed: 0 test(s), Passed: 6 test(s), Total: 6 test(s)
Name: TestTargetWatchAddress
Failed: 0 test(s), Passed: 4 test(s), Total: 4 test(s)
Name: TestThreadAPI
Failed: 0 test(s), Passed: 10 test(s), Total: 10 test(s)
Name: TestThreadExit
Failed: 0 test(s), Passed: 2 test(s), Total: 2 test(s)
Name: TestThreadJump
Failed: 0 test(s), Passed: 2 test(s), Total: 2 test(s)
Name: TestThreadSpecificBpPlusCondition
Failed: 0 test(s), Passed: 2 test(s), Total: 2 test(s)
Name: TestThreadSpecificBreakpoint
Failed: 0 test(s), Passed: 2 test(s), Total: 2 test(s)
Name: TestThreadStates
Failed: 0 test(s), Passed: 2 test(s), Total: 2 test(s)
Name: TestThreadStepOut
Failed: 0 test(s), Passed: 0 test(s), Total: 6 test(s)
Name: TestThreadStepping
Failed: 0 test(s), Passed: 2 test(s), Total: 2 test(s)
Name: TestTopLevelExprs
Failed: 0 test(s), Passed: 2 test(s), Total: 2 test(s)
Name: TestTypeCompletion
Failed: 0 test(s), Passed: 2 test(s), Total: 2 test(s)
Name: TestTypeList
Failed: 0 test(s), Passed: 2 test(s), Total: 2 test(s)
Name: TestTypeSummaryListArg
Failed: 0 test(s), Passed: 1 test(s), Total: 1 test(s)
Name: TestTypeSummaryListScript
Failed: 0 test(s), Passed: 2 test(s), Total: 2 test(s)
Name: TestUnicodeLiterals
Failed: 0 test(s), Passed: 6 test(s), Total: 6 test(s)
Name: TestUnionMembers
Failed: 0 test(s), Passed: 2 test(s), Total: 2 test(s)
Name: TestUniqueTypes
Failed: 0 test(s), Passed: 2 test(s), Total: 2 test(s)
Name: TestUnsignedTypes
Failed: 0 test(s), Passed: 2 test(s), Total: 2 test(s)
Name: TestUserFormatVsSummary
Failed: 0 test(s), Passed: 2 test(s), Total: 2 test(s)
Name: TestValueAPI
Failed: 0 test(s), Passed: 2 test(s), Total: 2 test(s)
Name: TestValueAPILinkedList
Failed: 0 test(s), Passed: 2 test(s), Total: 2 test(s)
Name: TestValueMD5Crash
Failed: 0 test(s), Passed: 2 test(s), Total: 2 test(s)
Name: TestValueObjectRecursion
Failed: 0 test(s), Passed: 2 test(s), Total: 2 test(s)
Name: TestValueOfVectorVariable
Failed: 0 test(s), Passed: 2 test(s), Total: 2 test(s)
Name: TestValueVarUpdate
Failed: 0 test(s), Passed: 2 test(s), Total: 2 test(s)
Name: TestVarInAggregateMisuse
Failed: 0 test(s), Passed: 2 test(s), Total: 2 test(s)
Name: TestVectorTypesFormatting
Failed: 0 test(s), Passed: 2 test(s), Total: 2 test(s)
Name: TestVirtual
Failed: 0 test(s), Passed: 2 test(s), Total: 2 test(s)
Name: TestWatchLocation
Failed: 0 test(s), Passed: 2 test(s), Total: 2 test(s)
Name: TestWatchLocationWithWatchSet
Failed: 0 test(s), Passed: 2 test(s), Total: 2 test(s)
Name: TestWatchpointCommandLLDB
Failed: 0 test(s), Passed: 4 test(s), Total: 4 test(s)
Name: TestWatchpointCommandPython
Failed: 0 test(s), Passed: 2 test(s), Total: 2 test(s)
Name: TestWatchpointCommands
Failed: 0 test(s), Passed: 10 test(s), Total: 10 test(s)
Name: TestWatchpointConditionAPI
Failed: 0 test(s), Passed: 2 test(s), Total: 2 test(s)
Name: TestWatchpointConditionCmd
Failed: 0 test(s), Passed: 2 test(s), Total: 2 test(s)
Name: TestWatchpointEvents
Failed: 0 test(s), Passed: 2 test(s), Total: 2 test(s)
Name: TestWatchpointIgnoreCount
Failed: 0 test(s), Passed: 2 test(s), Total: 2 test(s)
Name: TestWatchpointIter
Failed: 0 test(s), Passed: 2 test(s), Total: 2 test(s)
Name: TestWatchpointMultipleThreads
Failed: 0 test(s), Passed: 4 test(s), Total: 4 test(s)
Name: TestWatchpointSetErrorCases
Failed: 0 test(s), Passed: 2 test(s), Total: 2 test(s)
Name: TestWithLimitDebugInfo
Failed: 0 test(s), Passed: 1 test(s), Total: 2 test(s)
Name: TestWow64MiniDump
Failed: 0 test(s), Passed: 0 test(s), Total: 3 test(s)
Name: lldbsuite.test.lldbtest
Failed: 0 test(s), Passed: 58 test(s), Total: 70 test(s)

Changes

Commit f8c6d46cff8ead22e78bec8a9cc2323688ddaf44 by egranata:
[RemoteAST] Add a MetadataPromise class that will eventually replace

edit: source/Target/SwiftLanguageRuntime.cpp
edit: include/lldb/Target/SwiftLanguageRuntime.h

Thanks,
- Enrico
:envelope_with_arrow: egranata@.com :phone:️ 27683

_______________________________________________
swift-lldb-dev mailing list
swift-lldb-dev@swift.org
https://lists.swift.org/mailman/listinfo/swift-lldb-dev

Thanks,
- Enrico
:envelope_with_arrow: egranata@.com :phone:️ 27683


(Todd Fiala) #4

I wiped the builder. It could be that the step that collects up all the .a files might not be incremental-friendly (yet - I didn’t write it but that’s my first guess). I wiped the builder and we’ll see if that clears the issue. If so, we should file a bug to make sure we never have a stale list of libs.

-Todd

···

On Apr 22, 2016, at 5:03 PM, Enrico Granata via swift-lldb-dev <swift-lldb-dev@swift.org> wrote:

It looks like we have a SWIFT_ALL_LIBS setting we use to tell ourselves to link every .a file that Swift’s build generates - and that doesn’t seem to include libswiftRemoteAST.a
I am trying to find out how to add libraries to this list, so +Todd

On Apr 22, 2016, at 4:17 PM, John McCall via swift-lldb-dev <swift-lldb-dev@swift.org <mailto:swift-lldb-dev@swift.org>> wrote:

On Apr 22, 2016, at 3:31 PM, Enrico Granata <egranata@apple.com <mailto:egranata@apple.com>> wrote:

John,
is RemoteAST not on Linux?

I was actually just fixing Linux test failures with RemoteAST last night, so it should definitely be there.

I don't know how you'd get a failure using ~RemoteASTContext() but not using any of the constructors / methods; they're implemented right next to each other.

It is its own library, maybe there's something mis-configured about it.

John.

lib/liblldbTarget.a(SwiftLanguageRuntime.cpp.o): In function `MetadataPromise':
/home/buildnode/jenkins/workspace/oss-lldb-incremental-linux-ubuntu-14_04/lldb/source/Target/SwiftLanguageRuntime.cpp:1211: undefined reference to `swift::remoteAST::RemoteASTContext::RemoteASTContext(swift::ASTContext&, std::shared_ptr<swift::remote::MemoryReader>)'
lib/liblldbTarget.a(SwiftLanguageRuntime.cpp.o): In function `lldb_private::SwiftLanguageRuntime::MetadataPromise::FulfillPromise()':
/home/buildnode/jenkins/workspace/oss-lldb-incremental-linux-ubuntu-14_04/lldb/source/Target/SwiftLanguageRuntime.cpp:1221: undefined reference to `swift::remoteAST::RemoteASTContext::getTypeForRemoteTypeMetadata(swift::remote::RemoteAddress)'
lib/liblldbTarget.a(SwiftLanguageRuntime.cpp.o): In function `std::default_delete<swift::remoteAST::RemoteASTContext>::operator()(swift::remoteAST::RemoteASTContext*) const':
/usr/bin/../lib/gcc/x86_64-linux-gnu/4.8/../../../../include/c++/4.8/bits/unique_ptr.h:67: undefined reference to `swift::remoteAST::RemoteASTContext::~RemoteASTContext()'
<>clang: error: linker command failed with exit code 1 (use -v to see invocation)

On Apr 22, 2016, at 3:30 PM, no-reply@swift.org <mailto:no-reply@swift.org> wrote:

[FAILURE] oss-lldb-incremental-linux-ubuntu-14_04 [#2982]

Build URL: https://ci.swift.org/job/oss-lldb-incremental-linux-ubuntu-14_04/2982/
Project: oss-lldb-incremental-linux-ubuntu-14_04
Date of build: Fri, 22 Apr 2016 15:27:18 -0700
Build duration: 2 min 41 sec
Identified problems:

Compile Error: This build failed because of a compile error. Below is a list of all errors in the build log:
Indication 1 <https://ci.swift.org//job/oss-lldb-incremental-linux-ubuntu-14_04/2982/consoleFull#-1586822805ee1a197b-acac-4b17-83cf-a53b95139a76>
Tests:

Name: Test-rdar-12481949
Failed: 0 test(s), Passed: 2 test(s), Total: 2 test(s)
Name: Test-rdar-9974002
Failed: 0 test(s), Passed: 2 test(s), Total: 2 test(s)
Name: Test11588
Failed: 0 test(s), Passed: 2 test(s), Total: 2 test(s)
Name: Test8638051
Failed: 0 test(s), Passed: 2 test(s), Total: 2 test(s)
Name: TestAbbreviations
Failed: 0 test(s), Passed: 1 test(s), Total: 1 test(s)
Name: TestAddressBreakpoints
Failed: 0 test(s), Passed: 2 test(s), Total: 2 test(s)
Name: TestAnonymous
Failed: 0 test(s), Passed: 14 test(s), Total: 14 test(s)
Name: TestAproposWithProcess
Failed: 0 test(s), Passed: 2 test(s), Total: 2 test(s)
Name: TestArrayTypes
Failed: 0 test(s), Passed: 4 test(s), Total: 4 test(s)
Name: TestAttachDenied
Failed: 0 test(s), Passed: 2 test(s), Total: 2 test(s)
Name: TestAttachResume
Failed: 0 test(s), Passed: 2 test(s), Total: 2 test(s)
Name: TestAvoidBreakpointInDelaySlot
Failed: 0 test(s), Passed: 0 test(s), Total: 2 test(s)
Name: TestBSDArchives
Failed: 0 test(s), Passed: 2 test(s), Total: 2 test(s)
Name: TestBackticksWithoutATarget
Failed: 0 test(s), Passed: 1 test(s), Total: 1 test(s)
Name: TestBacktraceAll
Failed: 0 test(s), Passed: 2 test(s), Total: 2 test(s)
Name: TestBatchMode
Failed: 0 test(s), Passed: 6 test(s), Total: 6 test(s)
Name: TestBitfields
Failed: 0 test(s), Passed: 4 test(s), Total: 4 test(s)
Name: TestBreakpointAPI
Failed: 0 test(s), Passed: 2 test(s), Total: 2 test(s)
Name: TestBreakpointCaseSensitivity
Failed: 0 test(s), Passed: 0 test(s), Total: 2 test(s)
Name: TestBreakpointCommand
Failed: 0 test(s), Passed: 2 test(s), Total: 2 test(s)
Name: TestBreakpointCommandsFromPython
Failed: 0 test(s), Passed: 2 test(s), Total: 2 test(s)
Name: TestBreakpointConditions
Failed: 0 test(s), Passed: 6 test(s), Total: 6 test(s)
Name: TestBreakpointIDs
Failed: 0 test(s), Passed: 2 test(s), Total: 2 test(s)
Name: TestBreakpointIgnoreCount
Failed: 0 test(s), Passed: 4 test(s), Total: 4 test(s)
Name: TestBreakpointLanguage
Failed: 0 test(s), Passed: 4 test(s), Total: 4 test(s)
Name: TestBreakpointLocations
Failed: 0 test(s), Passed: 2 test(s), Total: 2 test(s)
Name: TestBreakpointOptions
Failed: 0 test(s), Passed: 2 test(s), Total: 2 test(s)
Name: TestBreakpointSetRestart
Failed: 0 test(s), Passed: 2 test(s), Total: 2 test(s)
Name: TestBreakpointsWithNoTargets
Failed: 0 test(s), Passed: 2 test(s), Total: 2 test(s)
Name: TestBuiltinTrap
Failed: 0 test(s), Passed: 2 test(s), Total: 2 test(s)
Name: TestBulkyEnumsVariables
Failed: 0 test(s), Passed: 2 test(s), Total: 2 test(s)
Name: TestCInlines
Failed: 0 test(s), Passed: 2 test(s), Total: 2 test(s)
Name: TestCPP11EnumTypes
Failed: 0 test(s), Passed: 16 test(s), Total: 16 test(s)
Name: TestCPPAuto
Failed: 0 test(s), Passed: 2 test(s), Total: 2 test(s)
Name: TestCPPBool
Failed: 0 test(s), Passed: 2 test(s), Total: 2 test(s)
Name: TestCPPBreakpointCommands
Failed: 0 test(s), Passed: 2 test(s), Total: 2 test(s)
Name: TestCPPBreakpointLocations
Failed: 0 test(s), Passed: 2 test(s), Total: 2 test(s)
Name: TestCPPExceptionBreakpoint
Failed: 0 test(s), Passed: 2 test(s), Total: 2 test(s)
Name: TestCPPExceptionBreakpoints
Failed: 0 test(s), Passed: 2 test(s), Total: 2 test(s)
Name: TestCPPStaticMethods
Failed: 0 test(s), Passed: 2 test(s), Total: 2 test(s)
Name: TestCPPThis
Failed: 0 test(s), Passed: 2 test(s), Total: 2 test(s)
Name: TestCStrings
Failed: 0 test(s), Passed: 2 test(s), Total: 2 test(s)
Name: TestCallCPPFunction
Failed: 0 test(s), Passed: 2 test(s), Total: 2 test(s)
Name: TestCallStdStringFunction
Failed: 0 test(s), Passed: 2 test(s), Total: 2 test(s)
Name: TestCallStopAndContinue
Failed: 0 test(s), Passed: 2 test(s), Total: 2 test(s)
Name: TestCallThatRestarts
Failed: 0 test(s), Passed: 2 test(s), Total: 2 test(s)
Name: TestCallUserAnonTypedef
Failed: 0 test(s), Passed: 2 test(s), Total: 2 test(s)
Name: TestCallUserDefinedFunction
Failed: 0 test(s), Passed: 2 test(s), Total: 2 test(s)
Name: TestCallWithTimeout
Failed: 0 test(s), Passed: 2 test(s), Total: 2 test(s)
Name: TestChangeProcessGroup
Failed: 0 test(s), Passed: 2 test(s), Total: 2 test(s)
Name: TestChangeValueAPI
Failed: 0 test(s), Passed: 2 test(s), Total: 2 test(s)
Name: TestChar1632T
Failed: 0 test(s), Passed: 2 test(s), Total: 2 test(s)
Name: TestClassTypes
Failed: 0 test(s), Passed: 8 test(s), Total: 8 test(s)
Name: TestClassTypesDisassembly
Failed: 0 test(s), Passed: 4 test(s), Total: 4 test(s)
Name: TestCommandHistory
Failed: 0 test(s), Passed: 1 test(s), Total: 1 test(s)
Name: TestCommandInterpreterAPI
Failed: 0 test(s), Passed: 2 test(s), Total: 2 test(s)
Name: TestCommandRegex
Failed: 0 test(s), Passed: 1 test(s), Total: 1 test(s)
Name: TestCommandScript
Failed: 0 test(s), Passed: 2 test(s), Total: 2 test(s)
Name: TestCommandSource
Failed: 0 test(s), Passed: 1 test(s), Total: 1 test(s)
Name: TestCommonShortSpellings
Failed: 0 test(s), Passed: 1 test(s), Total: 1 test(s)
Name: TestCompDirSymLink
Failed: 0 test(s), Passed: 6 test(s), Total: 6 test(s)
Name: TestCompletion
Failed: 0 test(s), Passed: 33 test(s), Total: 33 test(s)
Name: TestConcurrentEvents
Failed: 0 test(s), Passed: 58 test(s), Total: 58 test(s)
Name: TestConditionalBreak
Failed: 0 test(s), Passed: 4 test(s), Total: 4 test(s)
Name: TestConsecutiveBreakpoints
Failed: 0 test(s), Passed: 3 test(s), Total: 3 test(s)
Name: TestConvenienceVariables
Failed: 0 test(s), Passed: 2 test(s), Total: 2 test(s)
Name: TestCppChainedCalls
Failed: 0 test(s), Passed: 2 test(s), Total: 2 test(s)
Name: TestCppGlobalOperators
Failed: 0 test(s), Passed: 2 test(s), Total: 2 test(s)
Name: TestCppIncompleteTypes
Failed: 0 test(s), Passed: 4 test(s), Total: 4 test(s)
Name: TestCppNsImport
Failed: 0 test(s), Passed: 2 test(s), Total: 2 test(s)
Name: TestCppScope
Failed: 0 test(s), Passed: 2 test(s), Total: 2 test(s)
Name: TestCppValueCast
Failed: 0 test(s), Passed: 2 test(s), Total: 2 test(s)
Name: TestCrashDuringStep
Failed: 0 test(s), Passed: 2 test(s), Total: 2 test(s)
Name: TestCreateAfterAttach
Failed: 0 test(s), Passed: 4 test(s), Total: 4 test(s)
Name: TestCreateDuringInstructionStep
Failed: 0 test(s), Passed: 2 test(s), Total: 2 test(s)
Name: TestCxxWCharT
Failed: 0 test(s), Passed: 2 test(s), Total: 2 test(s)
Name: TestDataFormatterAdv
Failed: 0 test(s), Passed: 2 test(s), Total: 2 test(s)
Name: TestDataFormatterCategories
Failed: 0 test(s), Passed: 2 test(s), Total: 2 test(s)
Name: TestDataFormatterCpp
Failed: 0 test(s), Passed: 2 test(s), Total: 2 test(s)
Name: TestDataFormatterDisabling
Failed: 0 test(s), Passed: 2 test(s), Total: 2 test(s)
Name: TestDataFormatterEnumFormat
Failed: 0 test(s), Passed: 2 test(s), Total: 2 test(s)
Name: TestDataFormatterGlobals
Failed: 0 test(s), Passed: 2 test(s), Total: 2 test(s)
Name: TestDataFormatterHexCaps
Failed: 0 test(s), Passed: 2 test(s), Total: 2 test(s)
Name: TestDataFormatterLanguageCategoryUpdates
Failed: 0 test(s), Passed: 2 test(s), Total: 2 test(s)
Name: TestDataFormatterLibccIterator
Failed: 0 test(s), Passed: 0 test(s), Total: 2 test(s)
Name: TestDataFormatterLibccMap
Failed: 0 test(s), Passed: 0 test(s), Total: 2 test(s)
Name: TestDataFormatterLibccMultiMap
Failed: 0 test(s), Passed: 0 test(s), Total: 2 test(s)
Name: TestDataFormatterLibcxxList
Failed: 0 test(s), Passed: 0 test(s), Total: 2 test(s)
Name: TestDataFormatterLibcxxListLoop
Failed: 0 test(s), Passed: 0 test(s), Total: 2 test(s)
Name: TestDataFormatterLibcxxMultiSet
Failed: 0 test(s), Passed: 0 test(s), Total: 2 test(s)
Name: TestDataFormatterLibcxxSet
Failed: 0 test(s), Passed: 2 test(s), Total: 2 test(s)
Name: TestDataFormatterLibcxxString
Failed: 0 test(s), Passed: 0 test(s), Total: 2 test(s)
Name: TestDataFormatterLibcxxVBool
Failed: 0 test(s), Passed: 0 test(s), Total: 2 test(s)
Name: TestDataFormatterLibcxxVector
Failed: 0 test(s), Passed: 0 test(s), Total: 2 test(s)
Name: TestDataFormatterNamedSummaries
Failed: 0 test(s), Passed: 2 test(s), Total: 2 test(s)
Name: TestDataFormatterPythonSynth
Failed: 0 test(s), Passed: 4 test(s), Total: 4 test(s)
Name: TestDataFormatterRefPtrRecursion
Failed: 0 test(s), Passed: 2 test(s), Total: 2 test(s)
Name: TestDataFormatterScript
Failed: 0 test(s), Passed: 2 test(s), Total: 2 test(s)
Name: TestDataFormatterSkipSummary
Failed: 0 test(s), Passed: 2 test(s), Total: 2 test(s)
Name: TestDataFormatterSmartArray
Failed: 0 test(s), Passed: 2 test(s), Total: 2 test(s)
Name: TestDataFormatterStdIterator
Failed: 0 test(s), Passed: 2 test(s), Total: 2 test(s)
Name: TestDataFormatterStdList
Failed: 0 test(s), Passed: 2 test(s), Total: 2 test(s)
Name: TestDataFormatterStdMap
Failed: 0 test(s), Passed: 2 test(s), Total: 2 test(s)
Name: TestDataFormatterStdString
Failed: 0 test(s), Passed: 2 test(s), Total: 2 test(s)
Name: TestDataFormatterStdVBool
Failed: 0 test(s), Passed: 2 test(s), Total: 2 test(s)
Name: TestDataFormatterStdVector
Failed: 0 test(s), Passed: 2 test(s), Total: 2 test(s)
Name: TestDataFormatterSynth
Failed: 0 test(s), Passed: 2 test(s), Total: 2 test(s)
Name: TestDataFormatterSynthVal
Failed: 0 test(s), Passed: 2 test(s), Total: 2 test(s)
Name: TestDataFormatterUnordered
Failed: 0 test(s), Passed: 0 test(s), Total: 2 test(s)
Name: TestDataFormatterVarScriptFormatting
Failed: 0 test(s), Passed: 2 test(s), Total: 2 test(s)
Name: TestDeadStrip
Failed: 0 test(s), Passed: 1 test(s), Total: 1 test(s)
Name: TestDebugBreak
Failed: 0 test(s), Passed: 0 test(s), Total: 1 test(s)
Name: TestDebuggerAPI
Failed: 0 test(s), Passed: 3 test(s), Total: 3 test(s)
Name: TestDefaultCacheLineSize
Failed: 0 test(s), Passed: 0 test(s), Total: 2 test(s)
Name: TestDefaultConstructorForAPIObjects
Failed: 0 test(s), Passed: 34 test(s), Total: 34 test(s)
Name: TestDiamond
Failed: 0 test(s), Passed: 2 test(s), Total: 2 test(s)
Name: TestDisasmAPI
Failed: 0 test(s), Passed: 2 test(s), Total: 2 test(s)
Name: TestDisassembleBreakpoint
Failed: 0 test(s), Passed: 2 test(s), Total: 2 test(s)
Name: TestDisassembleRawData
Failed: 0 test(s), Passed: 1 test(s), Total: 1 test(s)
Name: TestDisassemble_VST1_64
Failed: 0 test(s), Passed: 0 test(s), Total: 1 test(s)
Name: TestDynamicValue
Failed: 0 test(s), Passed: 2 test(s), Total: 2 test(s)
Name: TestDynamicValueChildCount
Failed: 0 test(s), Passed: 2 test(s), Total: 2 test(s)
Name: TestEmulations
Failed: 0 test(s), Passed: 2 test(s), Total: 2 test(s)
Name: TestEnumTypes
Failed: 0 test(s), Passed: 2 test(s), Total: 2 test(s)
Name: TestEnumVariables
Failed: 0 test(s), Passed: 2 test(s), Total: 2 test(s)
Name: TestEvents
Failed: 0 test(s), Passed: 0 test(s), Total: 6 test(s)
Name: TestExitDuringStep
Failed: 0 test(s), Passed: 6 test(s), Total: 6 test(s)
Name: TestExprDoesntBlock
Failed: 0 test(s), Passed: 2 test(s), Total: 2 test(s)
Name: TestExprHelpExamples
Failed: 0 test(s), Passed: 2 test(s), Total: 2 test(s)
Name: TestExprInProtocolExtension
Failed: 0 test(s), Passed: 2 test(s), Total: 2 test(s)
Name: TestExprOptions
Failed: 0 test(s), Passed: 2 test(s), Total: 2 test(s)
Name: TestExpressionAccessControl
Failed: 0 test(s), Passed: 2 test(s), Total: 2 test(s)
Name: TestExpressionErrorBreakpoint
Failed: 0 test(s), Passed: 8 test(s), Total: 8 test(s)
Name: TestExpressionErrors
Failed: 0 test(s), Passed: 2 test(s), Total: 2 test(s)
Name: TestExpressionInSyscall
Failed: 0 test(s), Passed: 2 test(s), Total: 2 test(s)
Name: TestExpressionScopes
Failed: 0 test(s), Passed: 2 test(s), Total: 2 test(s)
Name: TestExprs
Failed: 0 test(s), Passed: 6 test(s), Total: 6 test(s)
Name: TestExprs2
Failed: 0 test(s), Passed: 2 test(s), Total: 2 test(s)
Name: TestExprsChar
Failed: 0 test(s), Passed: 4 test(s), Total: 4 test(s)
Name: TestFloatTypes
Failed: 0 test(s), Passed: 4 test(s), Total: 4 test(s)
Name: TestFloatTypesExpr
Failed: 0 test(s), Passed: 4 test(s), Total: 4 test(s)
Name: TestFormatPropagation
Failed: 0 test(s), Passed: 2 test(s), Total: 2 test(s)
Name: TestFormats
Failed: 0 test(s), Passed: 2 test(s), Total: 2 test(s)
Name: TestFormatters
Failed: 0 test(s), Passed: 2 test(s), Total: 2 test(s)
Name: TestFormattersSBAPI
Failed: 0 test(s), Passed: 4 test(s), Total: 4 test(s)
Name: TestForwardDeclaration
Failed: 0 test(s), Passed: 2 test(s), Total: 2 test(s)
Name: TestFrameFormatSmallStruct
Failed: 0 test(s), Passed: 2 test(s), Total: 2 test(s)
Name: TestFrameUtils
Failed: 0 test(s), Passed: 2 test(s), Total: 2 test(s)
Name: TestFrameVariableAnonymousUnions
Failed: 0 test(s), Passed: 2 test(s), Total: 2 test(s)
Name: TestFrames
Failed: 0 test(s), Passed: 6 test(s), Total: 6 test(s)
Name: TestFunctionTypes
Failed: 0 test(s), Passed: 4 test(s), Total: 4 test(s)
Name: TestFunctionVariables
Failed: 0 test(s), Passed: 2 test(s), Total: 2 test(s)
Name: TestGDBRemoteMemoryRead
Failed: 0 test(s), Passed: 2 test(s), Total: 2 test(s)
Name: TestGdbRemoteAbort
Failed: 0 test(s), Passed: 1 test(s), Total: 1 test(s)
Name: TestGdbRemoteAttach
Failed: 0 test(s), Passed: 1 test(s), Total: 1 test(s)
Name: TestGdbRemoteAuxvSupport
Failed: 0 test(s), Passed: 4 test(s), Total: 4 test(s)
Name: TestGdbRemoteExpeditedRegisters
Failed: 0 test(s), Passed: 5 test(s), Total: 5 test(s)
Name: TestGdbRemoteKill
Failed: 0 test(s), Passed: 1 test(s), Total: 1 test(s)
Name: TestGdbRemoteProcessInfo
Failed: 0 test(s), Passed: 5 test(s), Total: 5 test(s)
Name: TestGdbRemoteRegisterState
Failed: 0 test(s), Passed: 2 test(s), Total: 2 test(s)
Name: TestGdbRemoteSegFault
Failed: 0 test(s), Passed: 1 test(s), Total: 1 test(s)
Name: TestGdbRemoteSingleStep
Failed: 0 test(s), Passed: 1 test(s), Total: 1 test(s)
Name: TestGdbRemoteThreadsInStopReply
Failed: 0 test(s), Passed: 4 test(s), Total: 4 test(s)
Name: TestGdbRemote_qThreadStopInfo
Failed: 0 test(s), Passed: 3 test(s), Total: 4 test(s)
Name: TestGdbRemote_vCont
Failed: 0 test(s), Passed: 6 test(s), Total: 6 test(s)
Name: TestGlobalVariables
Failed: 0 test(s), Passed: 2 test(s), Total: 2 test(s)
Name: TestGoFormatters
Failed: 0 test(s), Passed: 0 test(s), Total: 1 test(s)
Name: TestGoroutines
Failed: 0 test(s), Passed: 0 test(s), Total: 1 test(s)
Name: TestHandleSegv
Failed: 0 test(s), Passed: 2 test(s), Total: 2 test(s)
Name: TestHelloWorld
Failed: 0 test(s), Passed: 6 test(s), Total: 6 test(s)
Name: TestHelp
Failed: 0 test(s), Passed: 18 test(s), Total: 18 test(s)
Name: TestImageListMultiArchitecture
Failed: 0 test(s), Passed: 1 test(s), Total: 1 test(s)
Name: TestImport
Failed: 0 test(s), Passed: 1 test(s), Total: 1 test(s)
Name: TestInOutVariables
Failed: 0 test(s), Passed: 2 test(s), Total: 2 test(s)
Name: TestIndexVariable
Failed: 0 test(s), Passed: 2 test(s), Total: 2 test(s)
Name: TestIndirectEnumVariables
Failed: 0 test(s), Passed: 2 test(s), Total: 2 test(s)
Name: TestInferiorAssert
Failed: 0 test(s), Passed: 12 test(s), Total: 12 test(s)
Name: TestInferiorChanged
Failed: 0 test(s), Passed: 2 test(s), Total: 2 test(s)
Name: TestInferiorCrashing
Failed: 0 test(s), Passed: 12 test(s), Total: 14 test(s)
Name: TestInlineStepping
Failed: 0 test(s), Passed: 0 test(s), Total: 6 test(s)
Name: TestInlinedBreakpoints
Failed: 0 test(s), Passed: 2 test(s), Total: 2 test(s)
Name: TestInlinedFrame
Failed: 0 test(s), Passed: 2 test(s), Total: 2 test(s)
Name: TestInlines
Failed: 0 test(s), Passed: 2 test(s), Total: 2 test(s)
Name: TestIntegerTypes
Failed: 0 test(s), Passed: 20 test(s), Total: 20 test(s)
Name: TestIntegerTypesExpr
Failed: 0 test(s), Passed: 20 test(s), Total: 20 test(s)
Name: TestJITLoaderGDB
Failed: 0 test(s), Passed: 0 test(s), Total: 2 test(s)
Name: TestLLDBIterator
Failed: 0 test(s), Passed: 6 test(s), Total: 6 test(s)
Name: TestLLVM
Failed: 0 test(s), Passed: 1 test(s), Total: 1 test(s)
Name: TestLazyReverse
Failed: 0 test(s), Passed: 1 test(s), Total: 1 test(s)
Name: TestLibCxxAtomic
Failed: 0 test(s), Passed: 0 test(s), Total: 2 test(s)
Name: TestLinuxCore
Failed: 0 test(s), Passed: 3 test(s), Total: 4 test(s)
Name: TestListener
Failed: 0 test(s), Passed: 2 test(s), Total: 2 test(s)
Name: TestLldbGdbServer
Failed: 0 test(s), Passed: 34 test(s), Total: 34 test(s)
Name: TestLoadUnload
Failed: 0 test(s), Passed: 10 test(s), Total: 10 test(s)
Name: TestLogging
Failed: 0 test(s), Passed: 4 test(s), Total: 4 test(s)
Name: TestMembersAndLocalsWithSameName
Failed: 0 test(s), Passed: 4 test(s), Total: 4 test(s)
Name: TestMemoryCache
Failed: 0 test(s), Passed: 2 test(s), Total: 2 test(s)
Name: TestMemoryRead
Failed: 0 test(s), Passed: 2 test(s), Total: 2 test(s)
Name: TestMiBreak
Failed: 0 test(s), Passed: 5 test(s), Total: 5 test(s)
Name: TestMiCliSupport
Failed: 0 test(s), Passed: 1 test(s), Total: 8 test(s)
Name: TestMiData
Failed: 0 test(s), Passed: 6 test(s), Total: 7 test(s)
Name: TestMiExec
Failed: 0 test(s), Passed: 8 test(s), Total: 8 test(s)
Name: TestMiExit
Failed: 0 test(s), Passed: 3 test(s), Total: 3 test(s)
Name: TestMiFile
Failed: 0 test(s), Passed: 4 test(s), Total: 4 test(s)
Name: TestMiGdbSetShow
Failed: 0 test(s), Passed: 4 test(s), Total: 5 test(s)
Name: TestMiGdbSetShowPrint
Failed: 0 test(s), Passed: 2 test(s), Total: 3 test(s)
Name: TestMiInterpreterExec
Failed: 0 test(s), Passed: 7 test(s), Total: 7 test(s)
Name: TestMiLibraryLoaded
Failed: 0 test(s), Passed: 1 test(s), Total: 1 test(s)
Name: TestMiPrompt
Failed: 0 test(s), Passed: 1 test(s), Total: 1 test(s)
Name: TestMiSignal
Failed: 0 test(s), Passed: 1 test(s), Total: 3 test(s)
Name: TestMiStack
Failed: 0 test(s), Passed: 6 test(s), Total: 6 test(s)
Name: TestMiStartupOptions
Failed: 0 test(s), Passed: 8 test(s), Total: 10 test(s)
Name: TestMiSyntax
Failed: 0 test(s), Passed: 2 test(s), Total: 2 test(s)
Name: TestMiTarget
Failed: 0 test(s), Passed: 0 test(s), Total: 3 test(s)
Name: TestMiVar
Failed: 0 test(s), Passed: 2 test(s), Total: 6 test(s)
Name: TestMiniDump
Failed: 0 test(s), Passed: 0 test(s), Total: 7 test(s)
Name: TestMixedLanguages
Failed: 0 test(s), Passed: 2 test(s), Total: 2 test(s)
Name: TestModuleAndSection
Failed: 0 test(s), Passed: 6 test(s), Total: 6 test(s)
Name: TestMultilevelArrays
Failed: 0 test(s), Passed: 1 test(s), Total: 1 test(s)
Name: TestMultipleDebuggersCommands
Failed: 0 test(s), Passed: 1 test(s), Total: 1 test(s)
Name: TestMultithreaded
Failed: 0 test(s), Passed: 0 test(s), Total: 8 test(s)
Name: TestMyFirstWatchpoint
Failed: 0 test(s), Passed: 2 test(s), Total: 2 test(s)
Name: TestNamespace
Failed: 0 test(s), Passed: 2 test(s), Total: 2 test(s)
Name: TestNestedAlias
Failed: 0 test(s), Passed: 2 test(s), Total: 2 test(s)
Name: TestNestedPersistentTypes
Failed: 0 test(s), Passed: 2 test(s), Total: 2 test(s)
Name: TestNoSuchArch
Failed: 0 test(s), Passed: 2 test(s), Total: 2 test(s)
Name: TestNoreturnUnwind
Failed: 0 test(s), Passed: 2 test(s), Total: 2 test(s)
Name: TestNumThreads
Failed: 0 test(s), Passed: 2 test(s), Total: 2 test(s)
Name: TestOverloadedFunctions
Failed: 0 test(s), Passed: 2 test(s), Total: 2 test(s)
Name: TestPaths
Failed: 0 test(s), Passed: 2 test(s), Total: 3 test(s)
Name: TestPersistentPtrUpdate
Failed: 0 test(s), Passed: 2 test(s), Total: 2 test(s)
Name: TestPersistentTypes
Failed: 0 test(s), Passed: 2 test(s), Total: 2 test(s)
Name: TestPersistentVariables
Failed: 0 test(s), Passed: 2 test(s), Total: 2 test(s)
Name: TestPlatformCommand
Failed: 0 test(s), Passed: 7 test(s), Total: 8 test(s)
Name: TestPlatformProcessConnect
Failed: 0 test(s), Passed: 0 test(s), Total: 1 test(s)
Name: TestPluginCommands
Failed: 0 test(s), Passed: 1 test(s), Total: 1 test(s)
Name: TestPrintStackTraces
Failed: 0 test(s), Passed: 2 test(s), Total: 2 test(s)
Name: TestPrintfAfterUp
Failed: 0 test(s), Passed: 2 test(s), Total: 2 test(s)
Name: TestProcessAPI
Failed: 0 test(s), Passed: 10 test(s), Total: 10 test(s)
Name: TestProcessAttach
Failed: 0 test(s), Passed: 4 test(s), Total: 4 test(s)
Name: TestProcessIO
Failed: 0 test(s), Passed: 10 test(s), Total: 10 test(s)
Name: TestProcessLaunch
Failed: 0 test(s), Passed: 4 test(s), Total: 4 test(s)
Name: TestProcessSaveCore
Failed: 0 test(s), Passed: 0 test(s), Total: 4 test(s)
Name: TestPtrRef2Typedef
Failed: 0 test(s), Passed: 2 test(s), Total: 2 test(s)
Name: TestPtrToArrayFormatting
Failed: 0 test(s), Passed: 2 test(s), Total: 2 test(s)
Name: TestPublicAPIHeaders
Failed: 0 test(s), Passed: 0 test(s), Total: 2 test(s)
Name: TestPythonOSPlugin
Failed: 0 test(s), Passed: 2 test(s), Total: 2 test(s)
Name: TestQuoting
Failed: 0 test(s), Passed: 11 test(s), Total: 11 test(s)
Name: TestREPLArray
Failed: 0 test(s), Passed: 1 test(s), Total: 1 test(s)
Name: TestREPLBasic
Failed: 0 test(s), Passed: 1 test(s), Total: 1 test(s)
Name: TestREPLClasses
Failed: 0 test(s), Passed: 1 test(s), Total: 1 test(s)
Name: TestREPLClosure
Failed: 0 test(s), Passed: 1 test(s), Total: 1 test(s)
Name: TestREPLDynamicType
Failed: 0 test(s), Passed: 1 test(s), Total: 1 test(s)
Name: TestREPLFunctionDefinition
Failed: 0 test(s), Passed: 1 test(s), Total: 1 test(s)
Name: TestREPLPOReplType
Failed: 0 test(s), Passed: 1 test(s), Total: 1 test(s)
Name: TestREPLQuickLookObject
Failed: 0 test(s), Passed: 1 test(s), Total: 1 test(s)
Name: TestREPLRecursiveClass
Failed: 0 test(s), Passed: 1 test(s), Total: 1 test(s)
Name: TestREPLSubclassing
Failed: 0 test(s), Passed: 1 test(s), Total: 1 test(s)
Name: TestRaise
Failed: 0 test(s), Passed: 4 test(s), Total: 4 test(s)
Name: TestRdar12586188
Failed: 0 test(s), Passed: 1 test(s), Total: 1 test(s)
Name: TestRecursiveInferior
Failed: 0 test(s), Passed: 12 test(s), Total: 14 test(s)
Name: TestRecursiveTypes
Failed: 0 test(s), Passed: 4 test(s), Total: 4 test(s)
Name: TestRegexpBreakCommand
Failed: 0 test(s), Passed: 2 test(s), Total: 2 test(s)
Name: TestRegisterVariables
Failed: 0 test(s), Passed: 2 test(s), Total: 2 test(s)
Name: TestRegisters
Failed: 0 test(s), Passed: 14 test(s), Total: 14 test(s)
Name: TestRegistersIterator
Failed: 0 test(s), Passed: 2 test(s), Total: 2 test(s)
Name: TestRerun
Failed: 0 test(s), Passed: 2 test(s), Total: 2 test(s)
Name: TestReturnValue
Failed: 0 test(s), Passed: 2 test(s), Total: 2 test(s)
Name: TestRvalueReferences
Failed: 0 test(s), Passed: 2 test(s), Total: 2 test(s)
Name: TestSBData
Failed: 0 test(s), Passed: 2 test(s), Total: 2 test(s)
Name: TestSBFrameFindValue
Failed: 0 test(s), Passed: 2 test(s), Total: 2 test(s)
Name: TestSBValuePersist
Failed: 0 test(s), Passed: 2 test(s), Total: 2 test(s)
Name: TestSBValueUpdates
Failed: 0 test(s), Passed: 2 test(s), Total: 2 test(s)
Name: TestSTL
Failed: 0 test(s), Passed: 2 test(s), Total: 2 test(s)
Name: TestSTTYBeforeAndAfter
Failed: 0 test(s), Passed: 0 test(s), Total: 1 test(s)
Name: TestSectionAPI
Failed: 0 test(s), Passed: 2 test(s), Total: 2 test(s)
Name: TestSendSignal
Failed: 0 test(s), Passed: 2 test(s), Total: 2 test(s)
Name: TestSequenceFunctions
Failed: 0 test(s), Passed: 3 test(s), Total: 3 test(s)
Name: TestSetValues
Failed: 0 test(s), Passed: 2 test(s), Total: 2 test(s)
Name: TestSetWatchlocation
Failed: 0 test(s), Passed: 2 test(s), Total: 2 test(s)
Name: TestSetWatchpoint
Failed: 0 test(s), Passed: 2 test(s), Total: 2 test(s)
Name: TestSettings
Failed: 0 test(s), Passed: 23 test(s), Total: 23 test(s)
Name: TestSharedLib
Failed: 0 test(s), Passed: 2 test(s), Total: 2 test(s)
Name: TestSharedLibStrippedSymbols
Failed: 0 test(s), Passed: 2 test(s), Total: 2 test(s)
Name: TestSignalsAPI
Failed: 0 test(s), Passed: 2 test(s), Total: 2 test(s)
Name: TestSignedTypes
Failed: 0 test(s), Passed: 2 test(s), Total: 2 test(s)
Name: TestSimpleExpressions
Failed: 0 test(s), Passed: 2 test(s), Total: 2 test(s)
Name: TestSingleQuoteInFilename
Failed: 0 test(s), Passed: 1 test(s), Total: 1 test(s)
Name: TestSourceManager
Failed: 0 test(s), Passed: 8 test(s), Total: 8 test(s)
Name: TestStaticVariables
Failed: 0 test(s), Passed: 2 test(s), Total: 2 test(s)
Name: TestStepNoDebug
Failed: 0 test(s), Passed: 6 test(s), Total: 6 test(s)
Name: TestStepTarget
Failed: 0 test(s), Passed: 10 test(s), Total: 10 test(s)
Name: TestStopHookCmd
Failed: 0 test(s), Passed: 3 test(s), Total: 3 test(s)
Name: TestStopHookMechanism
Failed: 0 test(s), Passed: 2 test(s), Total: 2 test(s)
Name: TestStopHookMultipleThreads
Failed: 0 test(s), Passed: 2 test(s), Total: 2 test(s)
Name: TestStubReverseConnect
Failed: 0 test(s), Passed: 1 test(s), Total: 1 test(s)
Name: TestStubSetSID
Failed: 0 test(s), Passed: 3 test(s), Total: 3 test(s)
Name: TestSwiftAnyObjectType
Failed: 0 test(s), Passed: 2 test(s), Total: 2 test(s)
Name: TestSwiftAnyType
Failed: 0 test(s), Passed: 2 test(s), Total: 2 test(s)
Name: TestSwiftArchetypeResolution
Failed: 0 test(s), Passed: 2 test(s), Total: 2 test(s)
Name: TestSwiftArrayType
Failed: 0 test(s), Passed: 2 test(s), Total: 2 test(s)
Name: TestSwiftBacktracePrinting
Failed: 0 test(s), Passed: 2 test(s), Total: 2 test(s)
Name: TestSwiftBreakByPartialName
Failed: 0 test(s), Passed: 2 test(s), Total: 2 test(s)
Name: TestSwiftClassTypes
Failed: 0 test(s), Passed: 2 test(s), Total: 2 test(s)
Name: TestSwiftConditionalBreakpoint
Failed: 0 test(s), Passed: 2 test(s), Total: 2 test(s)
Name: TestSwiftDynamicValue
Failed: 0 test(s), Passed: 2 test(s), Total: 2 test(s)
Name: TestSwiftExpressionsInClassFunctions
Failed: 0 test(s), Passed: 2 test(s), Total: 2 test(s)
Name: TestSwiftExpressionsInMethodsPureSwift
Failed: 0 test(s), Passed: 2 test(s), Total: 2 test(s)
Name: TestSwiftFixIts
Failed: 0 test(s), Passed: 2 test(s), Total: 2 test(s)
Name: TestSwiftGenericTupleLabels
Failed: 0 test(s), Passed: 2 test(s), Total: 2 test(s)
Name: TestSwiftGenericTypes
Failed: 0 test(s), Passed: 2 test(s), Total: 2 test(s)
Name: TestSwiftGlobals
Failed: 0 test(s), Passed: 2 test(s), Total: 2 test(s)
Name: TestSwiftHideRuntimeSupport
Failed: 0 test(s), Passed: 2 test(s), Total: 2 test(s)
Name: TestSwiftInstancePointerSetSP
Failed: 0 test(s), Passed: 2 test(s), Total: 2 test(s)
Name: TestSwiftLetInt
Failed: 0 test(s), Passed: 2 test(s), Total: 2 test(s)
Name: TestSwiftMetadataSymbols
Failed: 0 test(s), Passed: 2 test(s), Total: 2 test(s)
Name: TestSwiftMetadataSymbolsType
Failed: 0 test(s), Passed: 2 test(s), Total: 2 test(s)
Name: TestSwiftMetatype
Failed: 0 test(s), Passed: 2 test(s), Total: 2 test(s)
Name: TestSwiftMultipayloadEnum
Failed: 0 test(s), Passed: 2 test(s), Total: 2 test(s)
Name: TestSwiftNestedArray
Failed: 0 test(s), Passed: 2 test(s), Total: 2 test(s)
Name: TestSwiftOneCaseEnum
Failed: 0 test(s), Passed: 2 test(s), Total: 2 test(s)
Name: TestSwiftOptionals
Failed: 0 test(s), Passed: 2 test(s), Total: 2 test(s)
Name: TestSwiftProtocolTypes
Failed: 0 test(s), Passed: 2 test(s), Total: 2 test(s)
Name: TestSwiftRangeTypes
Failed: 0 test(s), Passed: 2 test(s), Total: 2 test(s)
Name: TestSwiftReferenceStorageTypes
Failed: 0 test(s), Passed: 2 test(s), Total: 2 test(s)
Name: TestSwiftReturns
Failed: 0 test(s), Passed: 0 test(s), Total: 2 test(s)
Name: TestSwiftStaticStringVariables
Failed: 0 test(s), Passed: 2 test(s), Total: 2 test(s)
Name: TestSwiftStdlibDictionary
Failed: 0 test(s), Passed: 0 test(s), Total: 2 test(s)
Name: TestSwiftStdlibSet
Failed: 0 test(s), Passed: 2 test(s), Total: 2 test(s)
Name: TestSwiftStepping
Failed: 0 test(s), Passed: 2 test(s), Total: 2 test(s)
Name: TestSwiftStringVariables
Failed: 0 test(s), Passed: 2 test(s), Total: 2 test(s)
Name: TestSwiftStructChangeRerun
Failed: 0 test(s), Passed: 0 test(s), Total: 2 test(s)
Name: TestSwiftStructInit
Failed: 0 test(s), Passed: 2 test(s), Total: 2 test(s)
Name: TestSwiftTupleTypes
Failed: 0 test(s), Passed: 2 test(s), Total: 2 test(s)
Name: TestSwiftTypeAliasFormatters
Failed: 0 test(s), Passed: 2 test(s), Total: 2 test(s)
Name: TestSwiftTypeLookup
Failed: 0 test(s), Passed: 2 test(s), Total: 2 test(s)
Name: TestSwiftTypeMetadata
Failed: 0 test(s), Passed: 2 test(s), Total: 2 test(s)
Name: TestSwiftTypes
Failed: 0 test(s), Passed: 2 test(s), Total: 2 test(s)
Name: TestSwiftValueOfOptionals
Failed: 0 test(s), Passed: 2 test(s), Total: 2 test(s)
Name: TestSymbolAPI
Failed: 0 test(s), Passed: 2 test(s), Total: 2 test(s)
Name: TestSymbolContext
Failed: 0 test(s), Passed: 2 test(s), Total: 2 test(s)
Name: TestSyntheticCapping
Failed: 0 test(s), Passed: 2 test(s), Total: 2 test(s)
Name: TestTargetAPI
Failed: 0 test(s), Passed: 20 test(s), Total: 20 test(s)
Name: TestTargetCommand
Failed: 0 test(s), Passed: 6 test(s), Total: 6 test(s)
Name: TestTargetWatchAddress
Failed: 0 test(s), Passed: 4 test(s), Total: 4 test(s)
Name: TestThreadAPI
Failed: 0 test(s), Passed: 10 test(s), Total: 10 test(s)
Name: TestThreadExit
Failed: 0 test(s), Passed: 2 test(s), Total: 2 test(s)
Name: TestThreadJump
Failed: 0 test(s), Passed: 2 test(s), Total: 2 test(s)
Name: TestThreadSpecificBpPlusCondition
Failed: 0 test(s), Passed: 2 test(s), Total: 2 test(s)
Name: TestThreadSpecificBreakpoint
Failed: 0 test(s), Passed: 2 test(s), Total: 2 test(s)
Name: TestThreadStates
Failed: 0 test(s), Passed: 2 test(s), Total: 2 test(s)
Name: TestThreadStepOut
Failed: 0 test(s), Passed: 0 test(s), Total: 6 test(s)
Name: TestThreadStepping
Failed: 0 test(s), Passed: 2 test(s), Total: 2 test(s)
Name: TestTopLevelExprs
Failed: 0 test(s), Passed: 2 test(s), Total: 2 test(s)
Name: TestTypeCompletion
Failed: 0 test(s), Passed: 2 test(s), Total: 2 test(s)
Name: TestTypeList
Failed: 0 test(s), Passed: 2 test(s), Total: 2 test(s)
Name: TestTypeSummaryListArg
Failed: 0 test(s), Passed: 1 test(s), Total: 1 test(s)
Name: TestTypeSummaryListScript
Failed: 0 test(s), Passed: 2 test(s), Total: 2 test(s)
Name: TestUnicodeLiterals
Failed: 0 test(s), Passed: 6 test(s), Total: 6 test(s)
Name: TestUnionMembers
Failed: 0 test(s), Passed: 2 test(s), Total: 2 test(s)
Name: TestUniqueTypes
Failed: 0 test(s), Passed: 2 test(s), Total: 2 test(s)
Name: TestUnsignedTypes
Failed: 0 test(s), Passed: 2 test(s), Total: 2 test(s)
Name: TestUserFormatVsSummary
Failed: 0 test(s), Passed: 2 test(s), Total: 2 test(s)
Name: TestValueAPI
Failed: 0 test(s), Passed: 2 test(s), Total: 2 test(s)
Name: TestValueAPILinkedList
Failed: 0 test(s), Passed: 2 test(s), Total: 2 test(s)
Name: TestValueMD5Crash
Failed: 0 test(s), Passed: 2 test(s), Total: 2 test(s)
Name: TestValueObjectRecursion
Failed: 0 test(s), Passed: 2 test(s), Total: 2 test(s)
Name: TestValueOfVectorVariable
Failed: 0 test(s), Passed: 2 test(s), Total: 2 test(s)
Name: TestValueVarUpdate
Failed: 0 test(s), Passed: 2 test(s), Total: 2 test(s)
Name: TestVarInAggregateMisuse
Failed: 0 test(s), Passed: 2 test(s), Total: 2 test(s)
Name: TestVectorTypesFormatting
Failed: 0 test(s), Passed: 2 test(s), Total: 2 test(s)
Name: TestVirtual
Failed: 0 test(s), Passed: 2 test(s), Total: 2 test(s)
Name: TestWatchLocation
Failed: 0 test(s), Passed: 2 test(s), Total: 2 test(s)
Name: TestWatchLocationWithWatchSet
Failed: 0 test(s), Passed: 2 test(s), Total: 2 test(s)
Name: TestWatchpointCommandLLDB
Failed: 0 test(s), Passed: 4 test(s), Total: 4 test(s)
Name: TestWatchpointCommandPython
Failed: 0 test(s), Passed: 2 test(s), Total: 2 test(s)
Name: TestWatchpointCommands
Failed: 0 test(s), Passed: 10 test(s), Total: 10 test(s)
Name: TestWatchpointConditionAPI
Failed: 0 test(s), Passed: 2 test(s), Total: 2 test(s)
Name: TestWatchpointConditionCmd
Failed: 0 test(s), Passed: 2 test(s), Total: 2 test(s)
Name: TestWatchpointEvents
Failed: 0 test(s), Passed: 2 test(s), Total: 2 test(s)
Name: TestWatchpointIgnoreCount
Failed: 0 test(s), Passed: 2 test(s), Total: 2 test(s)
Name: TestWatchpointIter
Failed: 0 test(s), Passed: 2 test(s), Total: 2 test(s)
Name: TestWatchpointMultipleThreads
Failed: 0 test(s), Passed: 4 test(s), Total: 4 test(s)
Name: TestWatchpointSetErrorCases
Failed: 0 test(s), Passed: 2 test(s), Total: 2 test(s)
Name: TestWithLimitDebugInfo
Failed: 0 test(s), Passed: 1 test(s), Total: 2 test(s)
Name: TestWow64MiniDump
Failed: 0 test(s), Passed: 0 test(s), Total: 3 test(s)
Name: lldbsuite.test.lldbtest
Failed: 0 test(s), Passed: 58 test(s), Total: 70 test(s)

Changes

Commit f8c6d46cff8ead22e78bec8a9cc2323688ddaf44 by egranata:
[RemoteAST] Add a MetadataPromise class that will eventually replace

edit: source/Target/SwiftLanguageRuntime.cpp
edit: include/lldb/Target/SwiftLanguageRuntime.h

Thanks,
- Enrico
:envelope_with_arrow: egranata@.com :phone:️ 27683

_______________________________________________
swift-lldb-dev mailing list
swift-lldb-dev@swift.org <mailto:swift-lldb-dev@swift.org>
https://lists.swift.org/mailman/listinfo/swift-lldb-dev

Thanks,
- Enrico
:envelope_with_arrow: egranata@.com :phone:️ 27683

_______________________________________________
swift-lldb-dev mailing list
swift-lldb-dev@swift.org
https://lists.swift.org/mailman/listinfo/swift-lldb-dev