[Swift CI] Build Failure: 0. OSS - LLDB Incremental - OS X (master) #383

Adrian, could this be caused by your changes?

···

On Nov 10, 2017, at 10:48 PM, no-reply@swift.org wrote:

[FAILURE] oss-lldb-incremental-osx [#383]

Build URL: https://ci.swift.org/job/oss-lldb-incremental-osx/383/
Project: oss-lldb-incremental-osx
Date of build: Fri, 10 Nov 2017 22:40:18 -0600
Build duration: 2 hr 7 min
Identified problems:

Assertion failure: This build failed because of an assertion failure. Below is a list of all errors in the build log:
Indication 1 <https://ci.swift.org//job/oss-lldb-incremental-osx/383/consoleFull#1256565552ef3c3c00-f496-40b9-85a7-0eb69d0f491b>
Regression test failed: This build failed because a regression test in the test suite FAILed. Below is a list of all errors:
Indication 1 <https://ci.swift.org//job/oss-lldb-incremental-osx/383/consoleFull#527207262ba62d58e-7248-467b-91e0-c7508d5cf947>
Tests:

Name: Test-rdar-12481949
Failed: 0 test(s), Passed: 3 test(s), Total: 3 test(s)
Name: Test-rdar-9974002
Failed: 0 test(s), Passed: 3 test(s), Total: 3 test(s)
Name: Test11588
Failed: 0 test(s), Passed: 3 test(s), Total: 3 test(s)
Name: Test8638051
Failed: 0 test(s), Passed: 3 test(s), Total: 3 test(s)
Name: TestABIv2
Failed: 0 test(s), Passed: 3 test(s), Total: 3 test(s)
Name: TestAbbreviations
Failed: 0 test(s), Passed: 1 test(s), Total: 1 test(s)
Name: TestAddDsymCommand
Failed: 0 test(s), Passed: 3 test(s), Total: 3 test(s)
Name: TestAddDsymMidExecutionCommand
Failed: 0 test(s), Passed: 1 test(s), Total: 1 test(s)
Name: TestAddressBreakpoints
Failed: 0 test(s), Passed: 1 test(s), Total: 1 test(s)
Name: TestAnonymous
Failed: 0 test(s), Passed: 21 test(s), Total: 21 test(s)
Name: TestAppleTypesIsProduced
Failed: 0 test(s), Passed: 0 test(s), Total: 3 test(s)
Name: TestApropos
Failed: 0 test(s), Passed: 1 test(s), Total: 1 test(s)
Name: TestAproposWithProcess
Failed: 0 test(s), Passed: 3 test(s), Total: 3 test(s)
Name: TestArray
Failed: 0 test(s), Passed: 0 test(s), Total: 3 test(s)
Name: TestArrayTypes
Failed: 0 test(s), Passed: 6 test(s), Total: 6 test(s)
Name: TestAsanSwift
Failed: 0 test(s), Passed: 3 test(s), Total: 3 test(s)
Name: TestAttachDenied
Failed: 0 test(s), Passed: 3 test(s), Total: 3 test(s)
Name: TestAttachResume
Failed: 0 test(s), Passed: 3 test(s), Total: 3 test(s)
Name: TestAvoidBreakpointInDelaySlot
Failed: 0 test(s), Passed: 0 test(s), Total: 3 test(s)
Name: TestBSDArchives
Failed: 0 test(s), Passed: 3 test(s), Total: 3 test(s)
Name: TestBackticksWithoutATarget
Failed: 0 test(s), Passed: 1 test(s), Total: 1 test(s)
Name: TestBacktraceAll
Failed: 0 test(s), Passed: 3 test(s), Total: 3 test(s)
Name: TestBadAddressBreakpoints
Failed: 0 test(s), Passed: 1 test(s), Total: 1 test(s)
Name: TestBadReference
Failed: 0 test(s), Passed: 0 test(s), Total: 3 test(s)
Name: TestBatchMode
Failed: 0 test(s), Passed: 9 test(s), Total: 9 test(s)
Name: TestBenchmarkContinue
Failed: 0 test(s), Passed: 0 test(s), Total: 3 test(s)
Name: TestBenchmarkLibcxxList
Failed: 0 test(s), Passed: 0 test(s), Total: 3 test(s)
Name: TestBenchmarkLibcxxMap
Failed: 0 test(s), Passed: 0 test(s), Total: 3 test(s)
Name: TestBenchmarkSwiftDictionary
Failed: 0 test(s), Passed: 0 test(s), Total: 3 test(s)
Name: TestBitfields
Failed: 0 test(s), Passed: 6 test(s), Total: 6 test(s)
Name: TestBlocks
Failed: 0 test(s), Passed: 6 test(s), Total: 6 test(s)
Name: TestBoundViolation
Failed: 0 test(s), Passed: 0 test(s), Total: 3 test(s)
Name: TestBreakAfterJoin
Failed: 0 test(s), Passed: 3 test(s), Total: 3 test(s)
Name: TestBreakpointAPI
Failed: 0 test(s), Passed: 2 test(s), Total: 2 test(s)
Name: TestBreakpointAutoContinue
Failed: 0 test(s), Passed: 3 test(s), Total: 3 test(s)
Name: TestBreakpointCaseSensitivity
Failed: 0 test(s), Passed: 3 test(s), Total: 6 test(s)
Name: TestBreakpointCommand
Failed: 0 test(s), Passed: 9 test(s), Total: 9 test(s)
Name: TestBreakpointCommandsFromPython
Failed: 0 test(s), Passed: 3 test(s), Total: 3 test(s)
Name: TestBreakpointConditions
Failed: 0 test(s), Passed: 12 test(s), Total: 12 test(s)
Name: TestBreakpointHitCount
Failed: 0 test(s), Passed: 1 test(s), Total: 1 test(s)
Name: TestBreakpointIDs
Failed: 0 test(s), Passed: 3 test(s), Total: 3 test(s)
Name: TestBreakpointIgnoreCount
Failed: 0 test(s), Passed: 6 test(s), Total: 6 test(s)
Name: TestBreakpointLanguage
Failed: 0 test(s), Passed: 6 test(s), Total: 6 test(s)
Name: TestBreakpointLocations
Failed: 0 test(s), Passed: 9 test(s), Total: 9 test(s)
Name: TestBreakpointNames
Failed: 0 test(s), Passed: 6 test(s), Total: 6 test(s)
Name: TestBreakpointOptions
Failed: 0 test(s), Passed: 3 test(s), Total: 3 test(s)
Name: TestBreakpointSerialization
Failed: 0 test(s), Passed: 15 test(s), Total: 15 test(s)
Name: TestBreakpointSetRestart
Failed: 0 test(s), Passed: 3 test(s), Total: 3 test(s)
Name: TestBreakpointsWithNoTargets
Failed: 0 test(s), Passed: 3 test(s), Total: 3 test(s)
Name: TestBuiltinTrap
Failed: 0 test(s), Passed: 3 test(s), Total: 3 test(s)
Name: TestBulkyEnumsVariables
Failed: 0 test(s), Passed: 3 test(s), Total: 3 test(s)
Name: TestBundleWithDotInFilename
Failed: 0 test(s), Passed: 3 test(s), Total: 3 test(s)
Name: TestCGImportedTypes
Failed: 0 test(s), Passed: 3 test(s), Total: 3 test(s)
Name: TestCGTypes
Failed: 0 test(s), Passed: 3 test(s), Total: 3 test(s)
Name: TestCInlines
Failed: 0 test(s), Passed: 3 test(s), Total: 3 test(s)
Name: TestCModules
Failed: 0 test(s), Passed: 3 test(s), Total: 3 test(s)
Name: TestCPP11EnumTypes
Failed: 0 test(s), Passed: 24 test(s), Total: 24 test(s)
Name: TestCPPAuto
Failed: 0 test(s), Passed: 3 test(s), Total: 3 test(s)
Name: TestCPPBool
Failed: 0 test(s), Passed: 3 test(s), Total: 3 test(s)
Name: TestCPPBreakpointCommands
Failed: 0 test(s), Passed: 3 test(s), Total: 3 test(s)
Name: TestCPPBreakpointLocations
Failed: 0 test(s), Passed: 6 test(s), Total: 6 test(s)
Name: TestCPPExceptionBreakpoint
Failed: 0 test(s), Passed: 3 test(s), Total: 3 test(s)
Name: TestCPPExceptionBreakpoints
Failed: 0 test(s), Passed: 3 test(s), Total: 3 test(s)
Name: TestCPPStaticMembers
Failed: 0 test(s), Passed: 3 test(s), Total: 3 test(s)
Name: TestCPPStaticMethods
Failed: 0 test(s), Passed: 3 test(s), Total: 3 test(s)
Name: TestCPPThis
Failed: 0 test(s), Passed: 3 test(s), Total: 3 test(s)
Name: TestCStrings
Failed: 0 test(s), Passed: 3 test(s), Total: 3 test(s)
Name: TestCalculatorMode
Failed: 0 test(s), Passed: 3 test(s), Total: 3 test(s)
Name: TestCallCPPFunction
Failed: 0 test(s), Passed: 3 test(s), Total: 3 test(s)
Name: TestCallStdStringFunction
Failed: 0 test(s), Passed: 3 test(s), Total: 3 test(s)
Name: TestCallStopAndContinue
Failed: 0 test(s), Passed: 3 test(s), Total: 3 test(s)
Name: TestCallThatRestarts
Failed: 0 test(s), Passed: 0 test(s), Total: 1 test(s)
Name: TestCallThatThrows
Failed: 0 test(s), Passed: 3 test(s), Total: 3 test(s)
Name: TestCallUserAnonTypedef
Failed: 0 test(s), Passed: 3 test(s), Total: 3 test(s)
Name: TestCallUserDefinedFunction
Failed: 0 test(s), Passed: 3 test(s), Total: 3 test(s)
Name: TestCallWithTimeout
Failed: 0 test(s), Passed: 3 test(s), Total: 3 test(s)
Name: TestChangeProcessGroup
Failed: 0 test(s), Passed: 1 test(s), Total: 1 test(s)
Name: TestChangeValueAPI
Failed: 0 test(s), Passed: 3 test(s), Total: 3 test(s)
Name: TestChar1632T
Failed: 0 test(s), Passed: 3 test(s), Total: 3 test(s)
Name: TestClassConstrainedProtocol
Failed: 0 test(s), Passed: 4 test(s), Total: 4 test(s)
Name: TestClassTypes
Failed: 0 test(s), Passed: 12 test(s), Total: 12 test(s)
Name: TestClassTypesDisassembly
Failed: 0 test(s), Passed: 6 test(s), Total: 6 test(s)
Name: TestCommandHistory
Failed: 0 test(s), Passed: 1 test(s), Total: 1 test(s)
Name: TestCommandInterpreterAPI
Failed: 0 test(s), Passed: 3 test(s), Total: 3 test(s)
Name: TestCommandRegex
Failed: 0 test(s), Passed: 1 test(s), Total: 1 test(s)
Name: TestCommandScript
Failed: 0 test(s), Passed: 3 test(s), Total: 3 test(s)
Name: TestCommandScriptAlias
Failed: 0 test(s), Passed: 3 test(s), Total: 3 test(s)
Name: TestCommandScriptImmediateOutput
Failed: 0 test(s), Passed: 2 test(s), Total: 2 test(s)
Name: TestCommandSource
Failed: 0 test(s), Passed: 1 test(s), Total: 1 test(s)
Name: TestCommonShortSpellings
Failed: 0 test(s), Passed: 1 test(s), Total: 1 test(s)
Name: TestCompDirSymLink
Failed: 0 test(s), Passed: 6 test(s), Total: 9 test(s)
Name: TestCompactVectors
Failed: 0 test(s), Passed: 3 test(s), Total: 3 test(s)
Name: TestCompileRunToBreakpointTurnaround
Failed: 0 test(s), Passed: 0 test(s), Total: 1 test(s)
Name: TestCompletion
Failed: 0 test(s), Passed: 34 test(s), Total: 34 test(s)
Name: TestComplicatedExpression
Failed: 0 test(s), Passed: 0 test(s), Total: 3 test(s)
Name: TestConcurrentBreakpointDelayBreakpointOneSignal
Failed: 0 test(s), Passed: 1 test(s), Total: 1 test(s)
Name: TestConcurrentBreakpointOneDelayBreakpointThreads
Failed: 0 test(s), Passed: 1 test(s), Total: 1 test(s)
Name: TestConcurrentBreakpointsDelayedBreakpointOneWatchpoint
Failed: 0 test(s), Passed: 1 test(s), Total: 1 test(s)
Name: TestConcurrentCrashWithBreak
Failed: 0 test(s), Passed: 1 test(s), Total: 1 test(s)
Name: TestConcurrentCrashWithSignal
Failed: 0 test(s), Passed: 1 test(s), Total: 1 test(s)
Name: TestConcurrentCrashWithWatchpoint
Failed: 0 test(s), Passed: 1 test(s), Total: 1 test(s)
Name: TestConcurrentCrashWithWatchpointBreakpointSignal
Failed: 0 test(s), Passed: 1 test(s), Total: 1 test(s)
Name: TestConcurrentDelaySignalBreak
Failed: 0 test(s), Passed: 1 test(s), Total: 1 test(s)
Name: TestConcurrentDelaySignalWatch
Failed: 0 test(s), Passed: 1 test(s), Total: 1 test(s)
Name: TestConcurrentDelayWatchBreak
Failed: 0 test(s), Passed: 1 test(s), Total: 1 test(s)
Name: TestConcurrentDelayedCrashWithBreakpointSignal
Failed: 0 test(s), Passed: 1 test(s), Total: 1 test(s)
Name: TestConcurrentDelayedCrashWithBreakpointWatchpoint
Failed: 0 test(s), Passed: 1 test(s), Total: 1 test(s)
Name: TestConcurrentManyBreakpoints
Failed: 0 test(s), Passed: 0 test(s), Total: 1 test(s)
Name: TestConcurrentManyCrash
Failed: 0 test(s), Passed: 0 test(s), Total: 1 test(s)
Name: TestConcurrentManySignals
Failed: 0 test(s), Passed: 0 test(s), Total: 1 test(s)
Name: TestConcurrentManyWatchpoints
Failed: 0 test(s), Passed: 0 test(s), Total: 1 test(s)
Name: TestConcurrentNWatchNBreak
Failed: 0 test(s), Passed: 1 test(s), Total: 1 test(s)
Name: TestConcurrentSignalBreak
Failed: 0 test(s), Passed: 1 test(s), Total: 1 test(s)
Name: TestConcurrentSignalDelayBreak
Failed: 0 test(s), Passed: 1 test(s), Total: 1 test(s)
Name: TestConcurrentSignalDelayWatch
Failed: 0 test(s), Passed: 1 test(s), Total: 1 test(s)
Name: TestConcurrentSignalNWatchNBreak
Failed: 0 test(s), Passed: 1 test(s), Total: 1 test(s)
Name: TestConcurrentSignalWatch
Failed: 0 test(s), Passed: 1 test(s), Total: 1 test(s)
Name: TestConcurrentSignalWatchBreak
Failed: 0 test(s), Passed: 1 test(s), Total: 1 test(s)
Name: TestConcurrentTwoBreakpointThreads
Failed: 0 test(s), Passed: 1 test(s), Total: 1 test(s)
Name: TestConcurrentTwoBreakpointsOneDelaySignal
Failed: 0 test(s), Passed: 1 test(s), Total: 1 test(s)
Name: TestConcurrentTwoBreakpointsOneSignal
Failed: 0 test(s), Passed: 1 test(s), Total: 1 test(s)
Name: TestConcurrentTwoBreakpointsOneWatchpoint
Failed: 0 test(s), Passed: 1 test(s), Total: 1 test(s)
Name: TestConcurrentTwoWatchpointThreads
Failed: 0 test(s), Passed: 1 test(s), Total: 1 test(s)
Name: TestConcurrentTwoWatchpointsOneBreakpoint
Failed: 0 test(s), Passed: 1 test(s), Total: 1 test(s)
Name: TestConcurrentTwoWatchpointsOneDelayBreakpoint
Failed: 0 test(s), Passed: 1 test(s), Total: 1 test(s)
Name: TestConcurrentTwoWatchpointsOneSignal
Failed: 0 test(s), Passed: 1 test(s), Total: 1 test(s)
Name: TestConcurrentWatchBreak
Failed: 0 test(s), Passed: 1 test(s), Total: 1 test(s)
Name: TestConcurrentWatchBreakDelay
Failed: 0 test(s), Passed: 1 test(s), Total: 1 test(s)
Name: TestConcurrentWatchpointDelayWatchpointOneBreakpoint
Failed: 0 test(s), Passed: 1 test(s), Total: 1 test(s)
Name: TestConcurrentWatchpointWithDelayWatchpointThreads
Failed: 0 test(s), Passed: 1 test(s), Total: 1 test(s)
Name: TestConditionalBreak
Failed: 0 test(s), Passed: 6 test(s), Total: 6 test(s)
Name: TestConflictingDefinition
Failed: 0 test(s), Passed: 3 test(s), Total: 3 test(s)
Name: TestConflictingSymbol
Failed: 0 test(s), Passed: 1 test(s), Total: 1 test(s)
Name: TestConsecutiveBreakpoints
Failed: 0 test(s), Passed: 3 test(s), Total: 3 test(s)
Name: TestConstStrings
Failed: 0 test(s), Passed: 3 test(s), Total: 3 test(s)
Name: TestConstVariables
Failed: 0 test(s), Passed: 3 test(s), Total: 3 test(s)
Name: TestConvenienceVariables
Failed: 0 test(s), Passed: 3 test(s), Total: 3 test(s)
Name: TestCppChainedCalls
Failed: 0 test(s), Passed: 3 test(s), Total: 3 test(s)
Name: TestCppGlobalOperators
Failed: 0 test(s), Passed: 6 test(s), Total: 6 test(s)
Name: TestCppIncompleteTypes
Failed: 0 test(s), Passed: 6 test(s), Total: 6 test(s)
Name: TestCppNsImport
Failed: 0 test(s), Passed: 3 test(s), Total: 3 test(s)
Name: TestCppScope
Failed: 0 test(s), Passed: 6 test(s), Total: 6 test(s)
Name: TestCppValueCast
Failed: 0 test(s), Passed: 6 test(s), Total: 6 test(s)
Name: TestCrashDuringStep
Failed: 0 test(s), Passed: 3 test(s), Total: 3 test(s)
Name: TestCreateAfterAttach
Failed: 0 test(s), Passed: 6 test(s), Total: 6 test(s)
Name: TestCreateDuringInstructionStep
Failed: 0 test(s), Passed: 0 test(s), Total: 1 test(s)
Name: TestCreateDuringStep
Failed: 0 test(s), Passed: 9 test(s), Total: 9 test(s)
Name: TestCxxWCharT
Failed: 0 test(s), Passed: 3 test(s), Total: 3 test(s)
Name: TestDarwinLogBasic
Failed: 0 test(s), Passed: 0 test(s), Total: 1 test(s)
Name: TestDarwinLogFilterMatchActivity
Failed: 0 test(s), Passed: 0 test(s), Total: 4 test(s)
Name: TestDarwinLogFilterMatchActivityChain
Failed: 0 test(s), Passed: 0 test(s), Total: 4 test(s)
Name: TestDarwinLogFilterMatchCategory
Failed: 0 test(s), Passed: 0 test(s), Total: 4 test(s)
Name: TestDarwinLogFilterMatchMessage
Failed: 0 test(s), Passed: 0 test(s), Total: 4 test(s)
Name: TestDarwinLogFilterMatchSubsystem
Failed: 0 test(s), Passed: 0 test(s), Total: 4 test(s)
Name: TestDarwinLogFilterRegexActivity
Failed: 0 test(s), Passed: 0 test(s), Total: 5 test(s)
Name: TestDarwinLogFilterRegexActivityChain
Failed: 0 test(s), Passed: 0 test(s), Total: 5 test(s)
Name: TestDarwinLogFilterRegexCategory
Failed: 0 test(s), Passed: 0 test(s), Total: 5 test(s)
Name: TestDarwinLogFilterRegexMessage
Failed: 0 test(s), Passed: 0 test(s), Total: 5 test(s)
Name: TestDarwinLogFilterRegexSubsystem
Failed: 0 test(s), Passed: 0 test(s), Total: 6 test(s)
Name: TestDarwinLogMessageFormat
Failed: 0 test(s), Passed: 0 test(s), Total: 6 test(s)
Name: TestDarwinLogSourceDebug
Failed: 0 test(s), Passed: 0 test(s), Total: 2 test(s)
Name: TestDarwinLogSourceInfo
Failed: 0 test(s), Passed: 0 test(s), Total: 2 test(s)
Name: TestDarwinNSLogOutput
Failed: 0 test(s), Passed: 2 test(s), Total: 2 test(s)
Name: TestDataFormatterAdv
Failed: 0 test(s), Passed: 3 test(s), Total: 3 test(s)
Name: TestDataFormatterCategories
Failed: 0 test(s), Passed: 3 test(s), Total: 3 test(s)
Name: TestDataFormatterCpp
Failed: 0 test(s), Passed: 3 test(s), Total: 3 test(s)
Name: TestDataFormatterDisabling
Failed: 0 test(s), Passed: 3 test(s), Total: 3 test(s)
Name: TestDataFormatterEnumFormat
Failed: 0 test(s), Passed: 3 test(s), Total: 3 test(s)
Name: TestDataFormatterGlobals
Failed: 0 test(s), Passed: 3 test(s), Total: 3 test(s)
Name: TestDataFormatterHexCaps
Failed: 0 test(s), Passed: 3 test(s), Total: 3 test(s)
Name: TestDataFormatterLanguageCategoryUpdates
Failed: 0 test(s), Passed: 3 test(s), Total: 3 test(s)
Name: TestDataFormatterLibccIterator
Failed: 0 test(s), Passed: 3 test(s), Total: 3 test(s)
Name: TestDataFormatterLibccMap
Failed: 0 test(s), Passed: 3 test(s), Total: 3 test(s)
Name: TestDataFormatterLibccMultiMap
Failed: 0 test(s), Passed: 3 test(s), Total: 3 test(s)
Name: TestDataFormatterLibcxxList
Failed: 0 test(s), Passed: 3 test(s), Total: 3 test(s)
Name: TestDataFormatterLibcxxListLoop
Failed: 0 test(s), Passed: 0 test(s), Total: 3 test(s)
Name: TestDataFormatterLibcxxMultiSet
Failed: 0 test(s), Passed: 3 test(s), Total: 3 test(s)
Name: TestDataFormatterLibcxxSet
Failed: 0 test(s), Passed: 3 test(s), Total: 3 test(s)
Name: TestDataFormatterLibcxxString
Failed: 0 test(s), Passed: 3 test(s), Total: 3 test(s)
Name: TestDataFormatterLibcxxVBool
Failed: 0 test(s), Passed: 3 test(s), Total: 3 test(s)
Name: TestDataFormatterLibcxxVector
Failed: 0 test(s), Passed: 3 test(s), Total: 3 test(s)
Name: TestDataFormatterNSIndexPath
Failed: 0 test(s), Passed: 3 test(s), Total: 3 test(s)
Name: TestDataFormatterNSString
Failed: 0 test(s), Passed: 9 test(s), Total: 9 test(s)
Name: TestDataFormatterNamedSummaries
Failed: 0 test(s), Passed: 3 test(s), Total: 3 test(s)
Name: TestDataFormatterObjC
Failed: 0 test(s), Passed: 36 test(s), Total: 36 test(s)
Name: TestDataFormatterPythonSynth
Failed: 0 test(s), Passed: 6 test(s), Total: 6 test(s)
Name: TestDataFormatterRefPtrRecursion
Failed: 0 test(s), Passed: 3 test(s), Total: 3 test(s)
Name: TestDataFormatterScript
Failed: 0 test(s), Passed: 3 test(s), Total: 3 test(s)
Name: TestDataFormatterSkipSummary
Failed: 0 test(s), Passed: 3 test(s), Total: 3 test(s)
Name: TestDataFormatterSmartArray
Failed: 0 test(s), Passed: 3 test(s), Total: 3 test(s)
Name: TestDataFormatterStdIterator
Failed: 0 test(s), Passed: 3 test(s), Total: 3 test(s)
Name: TestDataFormatterStdList
Failed: 0 test(s), Passed: 3 test(s), Total: 3 test(s)
Name: TestDataFormatterStdMap
Failed: 0 test(s), Passed: 3 test(s), Total: 3 test(s)
Name: TestDataFormatterStdSmartPtr
Failed: 0 test(s), Passed: 0 test(s), Total: 3 test(s)
Name: TestDataFormatterStdString
Failed: 0 test(s), Passed: 3 test(s), Total: 3 test(s)
Name: TestDataFormatterStdTuple
Failed: 0 test(s), Passed: 0 test(s), Total: 3 test(s)
Name: TestDataFormatterStdUniquePtr
Failed: 0 test(s), Passed: 0 test(s), Total: 6 test(s)
Name: TestDataFormatterStdVBool
Failed: 0 test(s), Passed: 0 test(s), Total: 3 test(s)
Name: TestDataFormatterStdVector
Failed: 0 test(s), Passed: 3 test(s), Total: 3 test(s)
Name: TestDataFormatterSynth
Failed: 0 test(s), Passed: 3 test(s), Total: 3 test(s)
Name: TestDataFormatterSynthType
Failed: 0 test(s), Passed: 3 test(s), Total: 3 test(s)
Name: TestDataFormatterSynthVal
Failed: 0 test(s), Passed: 3 test(s), Total: 3 test(s)
Name: TestDataFormatterUnordered
Failed: 0 test(s), Passed: 3 test(s), Total: 3 test(s)
Name: TestDataFormatterVarScriptFormatting
Failed: 0 test(s), Passed: 3 test(s), Total: 3 test(s)
Name: TestDeadStrip
Failed: 0 test(s), Passed: 3 test(s), Total: 3 test(s)
Name: TestDebugBreak
Failed: 0 test(s), Passed: 1 test(s), Total: 1 test(s)
Name: TestDebuggerAPI
Failed: 0 test(s), Passed: 4 test(s), Total: 4 test(s)
Name: TestDeepBundle
Failed: 0 test(s), Passed: 3 test(s), Total: 3 test(s)
Name: TestDefaultCacheLineSize
Failed: 0 test(s), Passed: 0 test(s), Total: 3 test(s)
Name: TestDefaultConstructorForAPIObjects
Failed: 0 test(s), Passed: 36 test(s), Total: 36 test(s)
Name: TestDefiningOverloadedFunctions
Failed: 0 test(s), Passed: 3 test(s), Total: 3 test(s)
Name: TestDiagnoseDereferenceArgument
Failed: 0 test(s), Passed: 0 test(s), Total: 3 test(s)
Name: TestDiagnoseDereferenceFunctionReturn
Failed: 0 test(s), Passed: 0 test(s), Total: 3 test(s)
Name: TestDiagnoseDereferenceThis
Failed: 0 test(s), Passed: 0 test(s), Total: 3 test(s)
Name: TestDiagnoseDereferenceVirtualMethodCall
Failed: 0 test(s), Passed: 0 test(s), Total: 3 test(s)
Name: TestDiagnoseInheritance
Failed: 0 test(s), Passed: 0 test(s), Total: 3 test(s)
Name: TestDiamond
Failed: 0 test(s), Passed: 3 test(s), Total: 3 test(s)
Name: TestDisasmAPI
Failed: 0 test(s), Passed: 3 test(s), Total: 3 test(s)
Name: TestDisassembleBreakpoint
Failed: 0 test(s), Passed: 3 test(s), Total: 3 test(s)
Name: TestDisassembleRawData
Failed: 0 test(s), Passed: 1 test(s), Total: 1 test(s)
Name: TestDisassemble_VST1_64
Failed: 0 test(s), Passed: 0 test(s), Total: 1 test(s)
Name: TestDisassembly
Failed: 0 test(s), Passed: 0 test(s), Total: 2 test(s)
Name: TestDoAttachThenDisassembly
Failed: 0 test(s), Passed: 0 test(s), Total: 1 test(s)
Name: TestDynamicValue
Failed: 0 test(s), Passed: 3 test(s), Total: 3 test(s)
Name: TestDynamicValueChildCount
Failed: 0 test(s), Passed: 3 test(s), Total: 3 test(s)
Name: TestEhFrameUnwind
Failed: 0 test(s), Passed: 0 test(s), Total: 3 test(s)
Name: TestEmulations
Failed: 0 test(s), Passed: 2 test(s), Total: 2 test(s)
Name: TestEnumTypes
Failed: 0 test(s), Passed: 3 test(s), Total: 3 test(s)
Name: TestEnumVariables
Failed: 0 test(s), Passed: 3 test(s), Total: 3 test(s)
Name: TestEqualityOperators
Failed: 0 test(s), Passed: 9 test(s), Total: 9 test(s)
Name: TestEvents
Failed: 0 test(s), Passed: 9 test(s), Total: 9 test(s)
Name: TestExclusivitySuppression
Failed: 0 test(s), Passed: 6 test(s), Total: 6 test(s)
Name: TestExclusivityViolation
Failed: 0 test(s), Passed: 3 test(s), Total: 3 test(s)
Name: TestExec
Failed: 0 test(s), Passed: 3 test(s), Total: 3 test(s)
Name: TestExitDuringBreak
Failed: 0 test(s), Passed: 3 test(s), Total: 3 test(s)
Name: TestExitDuringStep
Failed: 0 test(s), Passed: 9 test(s), Total: 9 test(s)
Name: TestExprDoesntBlock
Failed: 0 test(s), Passed: 3 test(s), Total: 3 test(s)
Name: TestExprHelpExamples
Failed: 0 test(s), Passed: 3 test(s), Total: 3 test(s)
Name: TestExprInProtocolExtension
Failed: 0 test(s), Passed: 3 test(s), Total: 3 test(s)
Name: TestExprOptions
Failed: 0 test(s), Passed: 3 test(s), Total: 3 test(s)
Name: TestExpressionAccessControl
Failed: 0 test(s), Passed: 3 test(s), Total: 3 test(s)
Name: TestExpressionCmd
Failed: 0 test(s), Passed: 0 test(s), Total: 3 test(s)
Name: TestExpressionErrorBreakpoint
Failed: 0 test(s), Passed: 12 test(s), Total: 12 test(s)
Name: TestExpressionErrors
Failed: 0 test(s), Passed: 6 test(s), Total: 6 test(s)
Name: TestExpressionInSyscall
Failed: 0 test(s), Passed: 3 test(s), Total: 3 test(s)
Name: TestExpressionScopes
Failed: 0 test(s), Passed: 3 test(s), Total: 3 test(s)
Name: TestExpressions
Failed: 0 test(s), Passed: 0 test(s), Total: 3 test(s)
Name: TestExprs
Failed: 0 test(s), Passed: 12 test(s), Total: 12 test(s)
Name: TestExprs2
Failed: 0 test(s), Passed: 3 test(s), Total: 3 test(s)
Name: TestExprsChar
Failed: 0 test(s), Passed: 9 test(s), Total: 9 test(s)
Name: TestFatArchives
Failed: 0 test(s), Passed: 1 test(s), Total: 1 test(s)
Name: TestFdLeak
Failed: 0 test(s), Passed: 3 test(s), Total: 3 test(s)
Name: TestFilePrivate
Failed: 0 test(s), Passed: 3 test(s), Total: 3 test(s)
Name: TestFindStructTypes
Failed: 0 test(s), Passed: 1 test(s), Total: 1 test(s)
Name: TestFixIts
Failed: 0 test(s), Passed: 6 test(s), Total: 6 test(s)
Name: TestFloatTypes
Failed: 0 test(s), Passed: 12 test(s), Total: 12 test(s)
Name: TestFloatTypesExpr
Failed: 0 test(s), Passed: 12 test(s), Total: 12 test(s)
Name: TestFormatPropagation
Failed: 0 test(s), Passed: 3 test(s), Total: 3 test(s)
Name: TestFormats
Failed: 0 test(s), Passed: 3 test(s), Total: 3 test(s)
Name: TestFormatters
Failed: 0 test(s), Passed: 3 test(s), Total: 3 test(s)
Name: TestFormattersBoolRefPtr
Failed: 0 test(s), Passed: 3 test(s), Total: 3 test(s)
Name: TestFormattersOneIsSingular
Failed: 0 test(s), Passed: 3 test(s), Total: 3 test(s)
Name: TestFormattersOsType
Failed: 0 test(s), Passed: 3 test(s), Total: 3 test(s)
Name: TestFormattersSBAPI
Failed: 0 test(s), Passed: 6 test(s), Total: 6 test(s)
Name: TestForwardDecl
Failed: 0 test(s), Passed: 3 test(s), Total: 3 test(s)
Name: TestForwardDeclaration
Failed: 0 test(s), Passed: 3 test(s), Total: 3 test(s)
Name: TestFoundationDisassembly
Failed: 0 test(s), Passed: 3 test(s), Total: 6 test(s)
Name: TestFrameDisassemble
Failed: 0 test(s), Passed: 1 test(s), Total: 1 test(s)
Name: TestFrameFormatSmallStruct
Failed: 0 test(s), Passed: 3 test(s), Total: 3 test(s)
Name: TestFrameUtils
Failed: 0 test(s), Passed: 3 test(s), Total: 3 test(s)
Name: TestFrameVar
Failed: 0 test(s), Passed: 1 test(s), Total: 1 test(s)
Name: TestFrameVariableAnonymousUnions
Failed: 0 test(s), Passed: 3 test(s), Total: 3 test(s)
Name: TestFrameVariableResponse
Failed: 0 test(s), Passed: 0 test(s), Total: 1 test(s)
Name: TestFrames
Failed: 0 test(s), Passed: 9 test(s), Total: 9 test(s)
Name: TestFunctionTypes
Failed: 0 test(s), Passed: 6 test(s), Total: 6 test(s)
Name: TestFunctionVariables
Failed: 0 test(s), Passed: 3 test(s), Total: 3 test(s)
Name: TestGCore
Failed: 0 test(s), Passed: 2 test(s), Total: 2 test(s)
Name: TestGdbRemoteAbort
Failed: 0 test(s), Passed: 1 test(s), Total: 2 test(s)
Name: TestGdbRemoteAttach
Failed: 0 test(s), Passed: 1 test(s), Total: 2 test(s)
Name: TestGdbRemoteAuxvSupport
Failed: 0 test(s), Passed: 0 test(s), Total: 7 test(s)
Name: TestGdbRemoteExitCode
Failed: 0 test(s), Passed: 3 test(s), Total: 6 test(s)
Name: TestGdbRemoteExpeditedRegisters
Failed: 0 test(s), Passed: 5 test(s), Total: 10 test(s)
Name: TestGdbRemoteHostInfo
Failed: 0 test(s), Passed: 2 test(s), Total: 4 test(s)
Name: TestGdbRemoteKill
Failed: 0 test(s), Passed: 1 test(s), Total: 2 test(s)
Name: TestGdbRemoteModuleInfo
Failed: 0 test(s), Passed: 0 test(s), Total: 1 test(s)
Name: TestGdbRemoteProcessInfo
Failed: 0 test(s), Passed: 5 test(s), Total: 12 test(s)
Name: TestGdbRemoteRegisterState
Failed: 0 test(s), Passed: 2 test(s), Total: 4 test(s)
Name: TestGdbRemoteSegFault
Failed: 0 test(s), Passed: 1 test(s), Total: 2 test(s)
Name: TestGdbRemoteSingleStep
Failed: 0 test(s), Passed: 1 test(s), Total: 2 test(s)
Name: TestGdbRemoteThreadName
Failed: 0 test(s), Passed: 0 test(s), Total: 1 test(s)
Name: TestGdbRemoteThreadsInStopReply
Failed: 0 test(s), Passed: 5 test(s), Total: 10 test(s)
Name: TestGdbRemote_QPassSignals
Failed: 0 test(s), Passed: 0 test(s), Total: 4 test(s)
Name: TestGdbRemote_qThreadStopInfo
Failed: 0 test(s), Passed: 2 test(s), Total: 6 test(s)
Name: TestGdbRemote_vCont
Failed: 0 test(s), Passed: 6 test(s), Total: 12 test(s)
Name: TestGetVariables
Failed: 0 test(s), Passed: 3 test(s), Total: 3 test(s)
Name: TestGlobalObjects
Failed: 0 test(s), Passed: 3 test(s), Total: 3 test(s)
Name: TestGlobalVariables
Failed: 0 test(s), Passed: 3 test(s), Total: 3 test(s)
Name: TestGoASTContext
Failed: 0 test(s), Passed: 0 test(s), Total: 1 test(s)
Name: TestGoFormatters
Failed: 0 test(s), Passed: 0 test(s), Total: 1 test(s)
Name: TestGoroutines
Failed: 0 test(s), Passed: 0 test(s), Total: 1 test(s)
Name: TestGuessLanguage
Failed: 0 test(s), Passed: 1 test(s), Total: 1 test(s)
Name: TestHWBreakMultiThread
Failed: 0 test(s), Passed: 0 test(s), Total: 2 test(s)
Name: TestHandleSegv
Failed: 0 test(s), Passed: 0 test(s), Total: 3 test(s)
Name: TestHelloWorld
Failed: 0 test(s), Passed: 9 test(s), Total: 9 test(s)
Name: TestHelp
Failed: 0 test(s), Passed: 18 test(s), Total: 18 test(s)
Name: TestHiddenIvars
Failed: 0 test(s), Passed: 11 test(s), Total: 15 test(s)
Name: TestHistoryRecall
Failed: 0 test(s), Passed: 1 test(s), Total: 1 test(s)
Name: TestIRInterpreter
Failed: 0 test(s), Passed: 3 test(s), Total: 3 test(s)
Name: TestIRInterpreterPHINodes
Failed: 0 test(s), Passed: 3 test(s), Total: 3 test(s)
Name: TestImageListMultiArchitecture
Failed: 0 test(s), Passed: 1 test(s), Total: 1 test(s)
Name: TestImport
Failed: 0 test(s), Passed: 1 test(s), Total: 1 test(s)
Name: TestInOutVariables
Failed: 0 test(s), Passed: 3 test(s), Total: 3 test(s)
Name: TestIncompleteModules
Failed: 0 test(s), Passed: 3 test(s), Total: 3 test(s)
Name: TestIndexVariable
Failed: 0 test(s), Passed: 3 test(s), Total: 3 test(s)
Name: TestIndirectEnumVariables
Failed: 0 test(s), Passed: 6 test(s), Total: 6 test(s)
Name: TestIndirectSymbols
Failed: 0 test(s), Passed: 3 test(s), Total: 3 test(s)
Name: TestInferiorAssert
Failed: 0 test(s), Passed: 18 test(s), Total: 18 test(s)
Name: TestInferiorChanged
Failed: 0 test(s), Passed: 1 test(s), Total: 1 test(s)
Name: TestInferiorCrashing
Failed: 0 test(s), Passed: 21 test(s), Total: 21 test(s)
Name: TestInitializerList
Failed: 0 test(s), Passed: 3 test(s), Total: 3 test(s)
Name: TestInlineStepping
Failed: 0 test(s), Passed: 9 test(s), Total: 9 test(s)
Name: TestInlinedBreakpoints
Failed: 0 test(s), Passed: 3 test(s), Total: 3 test(s)
Name: TestInlinedFrame
Failed: 0 test(s), Passed: 3 test(s), Total: 3 test(s)
Name: TestInlines
Failed: 0 test(s), Passed: 3 test(s), Total: 3 test(s)
Name: TestIntegerTypes
Failed: 0 test(s), Passed: 60 test(s), Total: 60 test(s)
Name: TestIntegerTypesExpr
Failed: 0 test(s), Passed: 60 test(s), Total: 60 test(s)
Name: TestInterruptThreadNames
Failed: 0 test(s), Passed: 3 test(s), Total: 3 test(s)
Name: TestJITLoaderGDB
Failed: 0 test(s), Passed: 0 test(s), Total: 3 test(s)
Name: TestLLDBIterator
Failed: 0 test(s), Passed: 9 test(s), Total: 9 test(s)
Name: TestLaunchWithShellExpand
Failed: 0 test(s), Passed: 3 test(s), Total: 3 test(s)
Name: TestLazyReverse
Failed: 0 test(s), Passed: 1 test(s), Total: 1 test(s)
Name: TestLibCxxAtomic
Failed: 0 test(s), Passed: 3 test(s), Total: 3 test(s)
Name: TestLibCxxFunction
Failed: 0 test(s), Passed: 3 test(s), Total: 3 test(s)
Name: TestLinuxCore
Failed: 0 test(s), Passed: 9 test(s), Total: 9 test(s)
Name: TestLinuxCoreThreads
Failed: 0 test(s), Passed: 2 test(s), Total: 2 test(s)
Name: TestListener
Failed: 0 test(s), Passed: 3 test(s), Total: 3 test(s)
Name: TestLldbGdbServer
Failed: 0 test(s), Passed: 32 test(s), Total: 65 test(s)
Name: TestLoadUnload
Failed: 0 test(s), Passed: 18 test(s), Total: 18 test(s)
Name: TestLocalVariable
Failed: 0 test(s), Passed: 0 test(s), Total: 3 test(s)
Name: TestLogging
Failed: 0 test(s), Passed: 5 test(s), Total: 5 test(s)
Name: TestLongjmp
Failed: 0 test(s), Passed: 0 test(s), Total: 9 test(s)
Name: TestMPXRegisters
Failed: 0 test(s), Passed: 0 test(s), Total: 3 test(s)
Name: TestMTCSimple
Failed: 0 test(s), Passed: 3 test(s), Total: 3 test(s)
Name: TestMTCSwift
Failed: 0 test(s), Passed: 3 test(s), Total: 3 test(s)
Name: TestMTCSwiftProperty
Failed: 0 test(s), Passed: 3 test(s), Total: 3 test(s)
Name: TestMacros
Failed: 0 test(s), Passed: 3 test(s), Total: 3 test(s)
Name: TestMembersAndLocalsWithSameName
Failed: 0 test(s), Passed: 6 test(s), Total: 6 test(s)
Name: TestMemoryCache
Failed: 0 test(s), Passed: 3 test(s), Total: 3 test(s)
Name: TestMemoryFind
Failed: 0 test(s), Passed: 3 test(s), Total: 3 test(s)
Name: TestMemoryHistory
Failed: 0 test(s), Passed: 3 test(s), Total: 3 test(s)
Name: TestMemoryRead
Failed: 0 test(s), Passed: 3 test(s), Total: 3 test(s)
Name: TestMiBreak
Failed: 0 test(s), Passed: 7 test(s), Total: 7 test(s)
Name: TestMiCliSupport
Failed: 0 test(s), Passed: 8 test(s), Total: 8 test(s)
Name: TestMiData
Failed: 0 test(s), Passed: 6 test(s), Total: 7 test(s)
Name: TestMiEnvironmentCd
Failed: 0 test(s), Passed: 0 test(s), Total: 1 test(s)
Name: TestMiExec
Failed: 0 test(s), Passed: 9 test(s), Total: 9 test(s)
Name: TestMiExit
Failed: 0 test(s), Passed: 3 test(s), Total: 3 test(s)
Name: TestMiFile
Failed: 0 test(s), Passed: 4 test(s), Total: 4 test(s)
Name: TestMiGdbSetShow
Failed: 0 test(s), Passed: 9 test(s), Total: 9 test(s)
Name: TestMiGdbSetShowPrint
Failed: 0 test(s), Passed: 3 test(s), Total: 3 test(s)
Name: TestMiInterpreterExec
Failed: 0 test(s), Passed: 8 test(s), Total: 8 test(s)
Name: TestMiLexicalScope
Failed: 0 test(s), Passed: 1 test(s), Total: 1 test(s)
Name: TestMiLibraryLoaded
Failed: 0 test(s), Passed: 1 test(s), Total: 1 test(s)
Name: TestMiPrompt
Failed: 0 test(s), Passed: 1 test(s), Total: 1 test(s)
Name: TestMiSignal
Failed: 0 test(s), Passed: 5 test(s), Total: 5 test(s)
Name: TestMiStack
Failed: 0 test(s), Passed: 7 test(s), Total: 7 test(s)
Name: TestMiStartupOptions
Failed: 0 test(s), Passed: 10 test(s), Total: 10 test(s)
Name: TestMiSymbol
Failed: 0 test(s), Passed: 1 test(s), Total: 1 test(s)
Name: TestMiSyntax
Failed: 0 test(s), Passed: 4 test(s), Total: 4 test(s)
Name: TestMiTarget
Failed: 0 test(s), Passed: 3 test(s), Total: 3 test(s)
Name: TestMiThreadInfo
Failed: 0 test(s), Passed: 1 test(s), Total: 1 test(s)
Name: TestMiVar
Failed: 0 test(s), Passed: 5 test(s), Total: 6 test(s)
Name: TestMiniDump
Failed: 0 test(s), Passed: 3 test(s), Total: 5 test(s)
Name: TestMiniDumpNew
Failed: 0 test(s), Passed: 8 test(s), Total: 8 test(s)
Name: TestMixedLanguages
Failed: 0 test(s), Passed: 3 test(s), Total: 3 test(s)
Name: TestModuleAndSection
Failed: 0 test(s), Passed: 9 test(s), Total: 9 test(s)
Name: TestModulesAutoImport
Failed: 0 test(s), Passed: 3 test(s), Total: 3 test(s)
Name: TestModulesInlineFunctions
Failed: 0 test(s), Passed: 3 test(s), Total: 3 test(s)
Name: TestMoveNearest
Failed: 0 test(s), Passed: 1 test(s), Total: 1 test(s)
Name: TestMultilangFormatterCategories
Failed: 0 test(s), Passed: 3 test(s), Total: 3 test(s)
Name: TestMultilevelArrays
Failed: 0 test(s), Passed: 1 test(s), Total: 1 test(s)
Name: TestMultilineExpressions
Failed: 0 test(s), Passed: 2 test(s), Total: 2 test(s)
Name: TestMultipleBreakpoints
Failed: 0 test(s), Passed: 3 test(s), Total: 3 test(s)
Name: TestMultipleDebuggers
Failed: 0 test(s), Passed: 3 test(s), Total: 3 test(s)
Name: TestMultipleDebuggersCommands
Failed: 0 test(s), Passed: 1 test(s), Total: 1 test(s)
Name: TestMultipleHits
Failed: 0 test(s), Passed: 1 test(s), Total: 1 test(s)
Name: TestMultipleTargets
Failed: 0 test(s), Passed: 1 test(s), Total: 1 test(s)
Name: TestMultithreaded
Failed: 0 test(s), Passed: 0 test(s), Total: 12 test(s)
Name: TestMyFirstWatchpoint
Failed: 0 test(s), Passed: 3 test(s), Total: 3 test(s)
Name: TestNSArraySynthetic
Failed: 0 test(s), Passed: 3 test(s), Total: 3 test(s)
Name: TestNSDictionarySynthetic
Failed: 0 test(s), Passed: 3 test(s), Total: 3 test(s)
Name: TestNSError
Failed: 0 test(s), Passed: 3 test(s), Total: 3 test(s)
Name: TestNSObjectSubclass
Failed: 0 test(s), Passed: 1 test(s), Total: 1 test(s)
Name: TestNSSetSynthetic
Failed: 0 test(s), Passed: 3 test(s), Total: 3 test(s)
Name: TestNameLookup
Failed: 0 test(s), Passed: 3 test(s), Total: 3 test(s)
Name: TestNamespace
Failed: 0 test(s), Passed: 12 test(s), Total: 12 test(s)
Name: TestNamespaceDefinitions
Failed: 0 test(s), Passed: 3 test(s), Total: 3 test(s)
Name: TestNamespaceLookup
Failed: 0 test(s), Passed: 24 test(s), Total: 24 test(s)
Name: TestNestedAlias
Failed: 0 test(s), Passed: 3 test(s), Total: 3 test(s)
Name: TestNestedPersistentTypes
Failed: 0 test(s), Passed: 3 test(s), Total: 3 test(s)
Name: TestNoReturnModuleEnd
Failed: 0 test(s), Passed: 1 test(s), Total: 1 test(s)
Name: TestNoSuchArch
Failed: 0 test(s), Passed: 3 test(s), Total: 3 test(s)
Name: TestNoreturnUnwind
Failed: 0 test(s), Passed: 3 test(s), Total: 3 test(s)
Name: TestNumThreads
Failed: 0 test(s), Passed: 0 test(s), Total: 6 test(s)
Name: TestObjCBaseClassSBType
Failed: 0 test(s), Passed: 3 test(s), Total: 3 test(s)
Name: TestObjCBreakpoints
Failed: 0 test(s), Passed: 3 test(s), Total: 3 test(s)
Name: TestObjCBuiltinTypes
Failed: 0 test(s), Passed: 3 test(s), Total: 3 test(s)
Name: TestObjCCheckers
Failed: 0 test(s), Passed: 3 test(s), Total: 3 test(s)
Name: TestObjCClassMethod
Failed: 0 test(s), Passed: 3 test(s), Total: 3 test(s)
Name: TestObjCDynamicSBType
Failed: 0 test(s), Passed: 3 test(s), Total: 3 test(s)
Name: TestObjCDynamicValue
Failed: 0 test(s), Passed: 3 test(s), Total: 3 test(s)
Name: TestObjCImportedTypes
Failed: 0 test(s), Passed: 3 test(s), Total: 3 test(s)
Name: TestObjCIvarDiscovery
Failed: 0 test(s), Passed: 4 test(s), Total: 4 test(s)
Name: TestObjCIvarOffsets
Failed: 0 test(s), Passed: 3 test(s), Total: 3 test(s)
Name: TestObjCIvarStripped
Failed: 0 test(s), Passed: 1 test(s), Total: 3 test(s)
Name: TestObjCIvarsInBlocks
Failed: 0 test(s), Passed: 3 test(s), Total: 3 test(s)
Name: TestObjCMethodReturningBOOL
Failed: 0 test(s), Passed: 3 test(s), Total: 3 test(s)
Name: TestObjCMethods
Failed: 0 test(s), Passed: 12 test(s), Total: 12 test(s)
Name: TestObjCMethods2
Failed: 0 test(s), Passed: 18 test(s), Total: 18 test(s)
Name: TestObjCModules
Failed: 0 test(s), Passed: 3 test(s), Total: 3 test(s)
Name: TestObjCNewSyntax
Failed: 0 test(s), Passed: 30 test(s), Total: 30 test(s)
Name: TestObjCProperty
Failed: 0 test(s), Passed: 3 test(s), Total: 3 test(s)
Name: TestObjCSelf
Failed: 0 test(s), Passed: 3 test(s), Total: 3 test(s)
Name: TestObjCSingleEntryDictionary
Failed: 0 test(s), Passed: 3 test(s), Total: 3 test(s)
Name: TestObjCStaticMethod
Failed: 0 test(s), Passed: 3 test(s), Total: 3 test(s)
Name: TestObjCStaticMethodStripped
Failed: 0 test(s), Passed: 1 test(s), Total: 3 test(s)
Name: TestObjCStepping
Failed: 0 test(s), Passed: 3 test(s), Total: 3 test(s)
Name: TestObjCStructArgument
Failed: 0 test(s), Passed: 3 test(s), Total: 3 test(s)
Name: TestObjCStructReturn
Failed: 0 test(s), Passed: 3 test(s), Total: 3 test(s)
Name: TestObjCSuper
Failed: 0 test(s), Passed: 3 test(s), Total: 3 test(s)
Name: TestObjCType
Failed: 0 test(s), Passed: 3 test(s), Total: 3 test(s)
Name: TestObjCTypeQueryFromOtherCompileUnit
Failed: 0 test(s), Passed: 3 test(s), Total: 3 test(s)
Name: TestObjCXX
Failed: 0 test(s), Passed: 3 test(s), Total: 3 test(s)
Name: TestObjCiVarIMP
Failed: 0 test(s), Passed: 1 test(s), Total: 1 test(s)
Name: TestObjcInference
Failed: 0 test(s), Passed: 3 test(s), Total: 3 test(s)
Name: TestObjcOptimized
Failed: 0 test(s), Passed: 3 test(s), Total: 3 test(s)
Name: TestObjectDescriptionAPI
Failed: 0 test(s), Passed: 3 test(s), Total: 3 test(s)
Name: TestOrderFile
Failed: 0 test(s), Passed: 3 test(s), Total: 3 test(s)
Name: TestOverloadedFunctions
Failed: 0 test(s), Passed: 3 test(s), Total: 3 test(s)
Name: TestPOUnwrapping
Failed: 0 test(s), Passed: 1 test(s), Total: 1 test(s)
Name: TestPaths
Failed: 0 test(s), Passed: 2 test(s), Total: 3 test(s)
Name: TestPersistObjCPointeeType
Failed: 0 test(s), Passed: 3 test(s), Total: 3 test(s)
Name: TestPersistentPtrUpdate
Failed: 0 test(s), Passed: 3 test(s), Total: 3 test(s)
Name: TestPersistentTypes
Failed: 0 test(s), Passed: 3 test(s), Total: 3 test(s)
Name: TestPersistentVariables
Failed: 0 test(s), Passed: 3 test(s), Total: 3 test(s)
Name: TestPlatformCommand
Failed: 0 test(s), Passed: 7 test(s), Total: 8 test(s)
Name: TestPlatformProcessConnect
Failed: 0 test(s), Passed: 0 test(s), Total: 1 test(s)
Name: TestPlaygrounds
Failed: 0 test(s), Passed: 1 test(s), Total: 3 test(s)
Name: TestPluginCommands
Failed: 0 test(s), Passed: 1 test(s), Total: 1 test(s)
Name: TestPoVerbosity
Failed: 0 test(s), Passed: 3 test(s), Total: 3 test(s)
Name: TestPreRunDylibs
Failed: 0 test(s), Passed: 1 test(s), Total: 1 test(s)
Name: TestPrintArray
Failed: 0 test(s), Passed: 3 test(s), Total: 3 test(s)
Name: TestPrintObj
Failed: 0 test(s), Passed: 3 test(s), Total: 3 test(s)
Name: TestPrintObjectArray
Failed: 0 test(s), Passed: 3 test(s), Total: 3 test(s)
Name: TestPrintStackTraces
Failed: 0 test(s), Passed: 3 test(s), Total: 3 test(s)
Name: TestPrintfAfterUp
Failed: 0 test(s), Passed: 3 test(s), Total: 3 test(s)
Name: TestProcessAPI
Failed: 0 test(s), Passed: 15 test(s), Total: 15 test(s)
Name: TestProcessAttach
Failed: 0 test(s), Passed: 3 test(s), Total: 3 test(s)
Name: TestProcessIO
Failed: 0 test(s), Passed: 15 test(s), Total: 15 test(s)
Name: TestProcessLaunch
Failed: 0 test(s), Passed: 9 test(s), Total: 9 test(s)
Name: TestProcessSaveCore
Failed: 0 test(s), Passed: 0 test(s), Total: 6 test(s)
Name: TestPtrRef2Typedef
Failed: 0 test(s), Passed: 3 test(s), Total: 3 test(s)
Name: TestPtrRefs
Failed: 0 test(s), Passed: 3 test(s), Total: 3 test(s)
Name: TestPtrRefsObjC
Failed: 0 test(s), Passed: 3 test(s), Total: 3 test(s)
Name: TestPtrToArrayFormatting
Failed: 0 test(s), Passed: 3 test(s), Total: 3 test(s)
Name: TestPublicAPIHeaders
Failed: 0 test(s), Passed: 3 test(s), Total: 3 test(s)
Name: TestPyObjSynthProvider
Failed: 0 test(s), Passed: 1 test(s), Total: 1 test(s)
Name: TestPythonOSPlugin
Failed: 0 test(s), Passed: 3 test(s), Total: 3 test(s)
Name: TestQueues
Failed: 0 test(s), Passed: 3 test(s), Total: 3 test(s)
Name: TestQuoting
Failed: 0 test(s), Passed: 11 test(s), Total: 11 test(s)
Name: TestREPLBreakpoints
Failed: 0 test(s), Passed: 1 test(s), Total: 1 test(s)
Name: TestREPLClasses
Failed: 0 test(s), Passed: 1 test(s), Total: 1 test(s)
Name: TestREPLClosure
Failed: 0 test(s), Passed: 1 test(s), Total: 1 test(s)
Name: TestREPLDictionary
Failed: 0 test(s), Passed: 1 test(s), Total: 1 test(s)
Name: TestREPLDynamicType
Failed: 0 test(s), Passed: 1 test(s), Total: 1 test(s)
Name: TestREPLFunctionDefinition
Failed: 0 test(s), Passed: 1 test(s), Total: 1 test(s)
Name: TestREPLIntVars
Failed: 0 test(s), Passed: 1 test(s), Total: 1 test(s)
Name: TestREPLNSString
Failed: 0 test(s), Passed: 1 test(s), Total: 1 test(s)
Name: TestREPLQuickLookObject
Failed: 0 test(s), Passed: 1 test(s), Total: 1 test(s)
Name: TestREPLRecursiveClass
Failed: 0 test(s), Passed: 1 test(s), Total: 1 test(s)
Name: TestREPLStructs
Failed: 0 test(s), Passed: 1 test(s), Total: 1 test(s)
Name: TestREPLTypeLookup
Failed: 0 test(s), Passed: 1 test(s), Total: 1 test(s)
Name: TestRaise
Failed: 0 test(s), Passed: 3 test(s), Total: 4 test(s)
Name: TestRdar10967107
Failed: 0 test(s), Passed: 3 test(s), Total: 3 test(s)
Name: TestRdar11355592
Failed: 0 test(s), Passed: 3 test(s), Total: 3 test(s)
Name: TestRdar12408181
Failed: 0 test(s), Passed: 0 test(s), Total: 3 test(s)
Name: TestRdar12586188
Failed: 0 test(s), Passed: 1 test(s), Total: 1 test(s)
Name: TestRealDefinition
Failed: 0 test(s), Passed: 6 test(s), Total: 6 test(s)
Name: TestRecursiveInferior
Failed: 0 test(s), Passed: 21 test(s), Total: 21 test(s)
Name: TestRecursiveTypes
Failed: 0 test(s), Passed: 6 test(s), Total: 6 test(s)
Name: TestRegexpBreakCommand
Failed: 0 test(s), Passed: 3 test(s), Total: 3 test(s)
Name: TestRegisterVariables
Failed: 0 test(s), Passed: 3 test(s), Total: 3 test(s)
Name: TestRegisters
Failed: 0 test(s), Passed: 7 test(s), Total: 7 test(s)
Name: TestRegistersIterator
Failed: 0 test(s), Passed: 3 test(s), Total: 3 test(s)
Name: TestRepeatedExprs
Failed: 0 test(s), Passed: 0 test(s), Total: 3 test(s)
Name: TestReportData
Failed: 0 test(s), Passed: 3 test(s), Total: 3 test(s)
Name: TestRerun
Failed: 0 test(s), Passed: 3 test(s), Total: 3 test(s)
Name: TestResilience
Failed: 0 test(s), Passed: 3 test(s), Total: 3 test(s)
Name: TestReturnValue
Failed: 0 test(s), Passed: 6 test(s), Total: 6 test(s)
Name: TestRuntimeTypes
Failed: 0 test(s), Passed: 3 test(s), Total: 3 test(s)
Name: TestRvalueReferences
Failed: 0 test(s), Passed: 3 test(s), Total: 3 test(s)
Name: TestSBData
Failed: 0 test(s), Passed: 6 test(s), Total: 6 test(s)
Name: TestSBFrameFindValue
Failed: 0 test(s), Passed: 3 test(s), Total: 3 test(s)
Name: TestSBTypeClassMembers
Failed: 0 test(s), Passed: 3 test(s), Total: 3 test(s)
Name: TestSBValuePersist
Failed: 0 test(s), Passed: 3 test(s), Total: 3 test(s)
Name: TestSBValueUpdates
Failed: 0 test(s), Passed: 3 test(s), Total: 3 test(s)
Name: TestSTL
Failed: 0 test(s), Passed: 6 test(s), Total: 6 test(s)
Name: TestSTTYBeforeAndAfter
Failed: 0 test(s), Passed: 1 test(s), Total: 1 test(s)
Name: TestSafeFuncCalls
Failed: 0 test(s), Passed: 3 test(s), Total: 3 test(s)
Name: TestSampleTest
Failed: 0 test(s), Passed: 1 test(s), Total: 1 test(s)
Name: TestSaveJITObjects
Failed: 0 test(s), Passed: 3 test(s), Total: 3 test(s)
Name: TestSectionAPI
Failed: 0 test(s), Passed: 3 test(s), Total: 3 test(s)
Name: TestSendSignal
Failed: 0 test(s), Passed: 3 test(s), Total: 3 test(s)
Name: TestSequenceFunctions
Failed: 0 test(s), Passed: 3 test(s), Total: 3 test(s)
Name: TestSetData
Failed: 0 test(s), Passed: 3 test(s), Total: 3 test(s)
Name: TestSetValues
Failed: 0 test(s), Passed: 3 test(s), Total: 3 test(s)
Name: TestSetWatchlocation
Failed: 0 test(s), Passed: 3 test(s), Total: 3 test(s)
Name: TestSetWatchpoint
Failed: 0 test(s), Passed: 3 test(s), Total: 3 test(s)
Name: TestSettings
Failed: 0 test(s), Passed: 29 test(s), Total: 29 test(s)
Name: TestSharedLib
Failed: 0 test(s), Passed: 9 test(s), Total: 9 test(s)
Name: TestSharedLibStrippedSymbols
Failed: 0 test(s), Passed: 6 test(s), Total: 6 test(s)
Name: TestSignalsAPI
Failed: 0 test(s), Passed: 3 test(s), Total: 3 test(s)
Name: TestSignedTypes
Failed: 0 test(s), Passed: 3 test(s), Total: 3 test(s)
Name: TestSigtrampUnwind
Failed: 0 test(s), Passed: 3 test(s), Total: 3 test(s)
Name: TestSimpleExpressions
Failed: 0 test(s), Passed: 3 test(s), Total: 3 test(s)
Name: TestSingleQuoteInFilename
Failed: 0 test(s), Passed: 1 test(s), Total: 1 test(s)
Name: TestSourceManager
Failed: 0 test(s), Passed: 5 test(s), Total: 5 test(s)
Name: TestSourceRegexBreakpoints
Failed: 0 test(s), Passed: 6 test(s), Total: 6 test(s)
Name: TestStandardUnwind
Failed: 0 test(s), Passed: 0 test(s), Total: 3 test(s)
Name: TestStartupDelays
Failed: 0 test(s), Passed: 0 test(s), Total: 1 test(s)
Name: TestStaticVariables
Failed: 0 test(s), Passed: 6 test(s), Total: 6 test(s)
Name: TestStdCXXDisassembly
Failed: 0 test(s), Passed: 0 test(s), Total: 3 test(s)
Name: TestStepAndBreakpoints
Failed: 0 test(s), Passed: 3 test(s), Total: 3 test(s)
Name: TestStepNoDebug
Failed: 0 test(s), Passed: 9 test(s), Total: 9 test(s)
Name: TestStepOverBreakpoint
Failed: 0 test(s), Passed: 6 test(s), Total: 6 test(s)
Name: TestStepOverWatchpoint
Failed: 0 test(s), Passed: 3 test(s), Total: 3 test(s)
Name: TestStepTarget
Failed: 0 test(s), Passed: 15 test(s), Total: 15 test(s)
Name: TestStepUntil
Failed: 0 test(s), Passed: 12 test(s), Total: 12 test(s)
Name: TestSteppingSpeed
Failed: 0 test(s), Passed: 0 test(s), Total: 1 test(s)
Name: TestStopHookCmd
Failed: 0 test(s), Passed: 4 test(s), Total: 4 test(s)
Name: TestStopHookMechanism
Failed: 0 test(s), Passed: 3 test(s), Total: 3 test(s)
Name: TestStopHookMultipleThreads
Failed: 0 test(s), Passed: 3 test(s), Total: 3 test(s)
Name: TestStructuredDataAPI
Failed: 0 test(s), Passed: 1 test(s), Total: 1 test(s)
Name: TestStubReverseConnect
Failed: 0 test(s), Passed: 1 test(s), Total: 2 test(s)
Name: TestStubSetSID
Failed: 0 test(s), Passed: 3 test(s), Total: 6 test(s)
Name: TestSubmoduleImport
Failed: 0 test(s), Passed: 3 test(s), Total: 3 test(s)
Name: TestSwiftAddressOf
Failed: 0 test(s), Passed: 1 test(s), Total: 1 test(s)
Name: TestSwiftAnyObjectType
Failed: 0 test(s), Passed: 3 test(s), Total: 3 test(s)
Name: TestSwiftAnyType
Failed: 0 test(s), Passed: 3 test(s), Total: 3 test(s)
Name: TestSwiftArchetypeResolution
Failed: 0 test(s), Passed: 3 test(s), Total: 3 test(s)
Name: TestSwiftArrayType
Failed: 0 test(s), Passed: 3 test(s), Total: 3 test(s)
Name: TestSwiftAssociatedTypeResolution
Failed: 0 test(s), Passed: 3 test(s), Total: 3 test(s)
Name: TestSwiftAtObjCIvars
Failed: 0 test(s), Passed: 3 test(s), Total: 3 test(s)
Name: TestSwiftBacktracePrinting
Failed: 0 test(s), Passed: 3 test(s), Total: 3 test(s)
Name: TestSwiftBool
Failed: 0 test(s), Passed: 3 test(s), Total: 3 test(s)
Name: TestSwiftBreakByPartialName
Failed: 0 test(s), Passed: 3 test(s), Total: 3 test(s)
Name: TestSwiftBridgedArray
Failed: 0 test(s), Passed: 3 test(s), Total: 3 test(s)
Name: TestSwiftBridgedMetatype
Failed: 0 test(s), Passed: 3 test(s), Total: 3 test(s)
Name: TestSwiftBridgedStringVariables
Failed: 0 test(s), Passed: 3 test(s), Total: 3 test(s)
Name: TestSwiftClassTypes
Failed: 0 test(s), Passed: 3 test(s), Total: 3 test(s)
Name: TestSwiftClosures
Failed: 0 test(s), Passed: 4 test(s), Total: 4 test(s)
Name: TestSwiftConditionalBreakpoint
Failed: 0 test(s), Passed: 3 test(s), Total: 3 test(s)
Name: TestSwiftCrossModuleExtension
Failed: 0 test(s), Passed: 3 test(s), Total: 3 test(s)
Name: TestSwiftDictionaryNSObjectAnyObject
Failed: 0 test(s), Passed: 3 test(s), Total: 3 test(s)
Name: TestSwiftDifferentClangFlags
Failed: 0 test(s), Passed: 1 test(s), Total: 3 test(s)
Name: TestSwiftDynamicValue
Failed: 0 test(s), Passed: 3 test(s), Total: 3 test(s)
Name: TestSwiftExpressionsInClassFunctions
Failed: 0 test(s), Passed: 3 test(s), Total: 3 test(s)
Name: TestSwiftExpressionsInMethodsFromObjc
Failed: 0 test(s), Passed: 3 test(s), Total: 3 test(s)
Name: TestSwiftExpressionsInMethodsPureSwift
Failed: 0 test(s), Passed: 3 test(s), Total: 3 test(s)
Name: TestSwiftFixIts
Failed: 0 test(s), Passed: 3 test(s), Total: 3 test(s)
Name: TestSwiftGenericEnums
Failed: 0 test(s), Passed: 3 test(s), Total: 3 test(s)
Name: TestSwiftGenericExpressions
Failed: 0 test(s), Passed: 6 test(s), Total: 6 test(s)
Name: TestSwiftGenericTupleLabels
Failed: 0 test(s), Passed: 3 test(s), Total: 3 test(s)
Name: TestSwiftGenericTypes
Failed: 0 test(s), Passed: 3 test(s), Total: 3 test(s)
Name: TestSwiftGenericsResolution
Failed: 0 test(s), Passed: 3 test(s), Total: 3 test(s)
Name: TestSwiftGetValueAsUnsigned
Failed: 0 test(s), Passed: 3 test(s), Total: 3 test(s)
Name: TestSwiftGlobals
Failed: 0 test(s), Passed: 3 test(s), Total: 3 test(s)
Name: TestSwiftHideRuntimeSupport
Failed: 0 test(s), Passed: 3 test(s), Total: 3 test(s)
Name: TestSwiftInstancePointerSetSP
Failed: 0 test(s), Passed: 3 test(s), Total: 3 test(s)
Name: TestSwiftLetInt
Failed: 0 test(s), Passed: 3 test(s), Total: 3 test(s)
Name: TestSwiftMetadataSymbols
Failed: 0 test(s), Passed: 3 test(s), Total: 3 test(s)
Name: TestSwiftMetatype
Failed: 0 test(s), Passed: 3 test(s), Total: 3 test(s)
Name: TestSwiftMixAnyObjectType
Failed: 0 test(s), Passed: 3 test(s), Total: 3 test(s)
Name: TestSwiftModuleSearchPaths
Failed: 0 test(s), Passed: 3 test(s), Total: 3 test(s)
Name: TestSwiftMultipayloadEnum
Failed: 0 test(s), Passed: 3 test(s), Total: 3 test(s)
Name: TestSwiftNestedArray
Failed: 0 test(s), Passed: 3 test(s), Total: 3 test(s)
Name: TestSwiftNoProcess
Failed: 0 test(s), Passed: 6 test(s), Total: 6 test(s)
Name: TestSwiftObjCOptionals
Failed: 0 test(s), Passed: 3 test(s), Total: 3 test(s)
Name: TestSwiftOneCaseEnum
Failed: 0 test(s), Passed: 3 test(s), Total: 3 test(s)
Name: TestSwiftOptionals
Failed: 0 test(s), Passed: 3 test(s), Total: 3 test(s)
Name: TestSwiftPathWithColons
Failed: 0 test(s), Passed: 3 test(s), Total: 3 test(s)
Name: TestSwiftPrivateDeclName
Failed: 0 test(s), Passed: 3 test(s), Total: 3 test(s)
Name: TestSwiftPrivateTypeAlias
Failed: 0 test(s), Passed: 3 test(s), Total: 3 test(s)
Name: TestSwiftProtocolTypes
Failed: 0 test(s), Passed: 3 test(s), Total: 3 test(s)
Name: TestSwiftRangeTypes
Failed: 0 test(s), Passed: 3 test(s), Total: 3 test(s)
Name: TestSwiftReferenceStorageTypes
Failed: 0 test(s), Passed: 3 test(s), Total: 3 test(s)
Name: TestSwiftReturns
Failed: 0 test(s), Passed: 1 test(s), Total: 1 test(s)
Name: TestSwiftStaticLinkingMacOS
Failed: 0 test(s), Passed: 0 test(s), Total: 1 test(s)
Name: TestSwiftStaticStringVariables
Failed: 0 test(s), Passed: 3 test(s), Total: 3 test(s)
Name: TestSwiftStdlibDictionary
Failed: 0 test(s), Passed: 3 test(s), Total: 3 test(s)
Name: TestSwiftStdlibSet
Failed: 0 test(s), Passed: 3 test(s), Total: 3 test(s)
Name: TestSwiftStepping
Failed: 3 test(s), Passed: 0 test(s), Total: 3 test(s)
Failed: TestSwiftStepping.TestSwiftStepping.test_swift_stepping_dsym <https://ci.swift.org/job/oss-lldb-incremental-osx/383/testReport/junit/TestSwiftStepping/TestSwiftStepping/test_swift_stepping_dsym>
Failed: TestSwiftStepping.TestSwiftStepping.test_swift_stepping_dwarf <https://ci.swift.org/job/oss-lldb-incremental-osx/383/testReport/junit/TestSwiftStepping/TestSwiftStepping/test_swift_stepping_dwarf>
Failed: TestSwiftStepping.TestSwiftStepping.test_swift_stepping_gmodules <https://ci.swift.org/job/oss-lldb-incremental-osx/383/testReport/junit/TestSwiftStepping/TestSwiftStepping/test_swift_stepping_gmodules>
Name: TestSwiftStringVariables
Failed: 0 test(s), Passed: 3 test(s), Total: 3 test(s)
Name: TestSwiftStructChangeRerun
Failed: 0 test(s), Passed: 1 test(s), Total: 3 test(s)
Name: TestSwiftStructInit
Failed: 0 test(s), Passed: 3 test(s), Total: 3 test(s)
Name: TestSwiftTuple
Failed: 0 test(s), Passed: 3 test(s), Total: 3 test(s)
Name: TestSwiftTupleTypes
Failed: 0 test(s), Passed: 3 test(s), Total: 3 test(s)
Name: TestSwiftTypeAliasFormatters
Failed: 0 test(s), Passed: 3 test(s), Total: 3 test(s)
Name: TestSwiftTypeLookup
Failed: 0 test(s), Passed: 3 test(s), Total: 3 test(s)
Name: TestSwiftTypeMetadata
Failed: 0 test(s), Passed: 3 test(s), Total: 3 test(s)
Name: TestSwiftTypes
Failed: 0 test(s), Passed: 3 test(s), Total: 3 test(s)
Name: TestSwiftValueOfOptionals
Failed: 0 test(s), Passed: 3 test(s), Total: 3 test(s)
Name: TestSwiftVersion
Failed: 0 test(s), Passed: 3 test(s), Total: 3 test(s)
Name: TestSwiftieFormatting
Failed: 0 test(s), Passed: 3 test(s), Total: 3 test(s)
Name: TestSymbolAPI
Failed: 0 test(s), Passed: 3 test(s), Total: 3 test(s)
Name: TestSymbolContext
Failed: 0 test(s), Passed: 3 test(s), Total: 3 test(s)
Name: TestSymbolContextTwoFiles
Failed: 0 test(s), Passed: 6 test(s), Total: 6 test(s)
Name: TestSymbolTable
Failed: 0 test(s), Passed: 3 test(s), Total: 3 test(s)
Name: TestSyntheticCapping
Failed: 0 test(s), Passed: 3 test(s), Total: 3 test(s)
Name: TestSyntheticFilterRecompute
Failed: 0 test(s), Passed: 3 test(s), Total: 3 test(s)
Name: TestTargetAPI
Failed: 0 test(s), Passed: 30 test(s), Total: 30 test(s)
Name: TestTargetCommand
Failed: 0 test(s), Passed: 9 test(s), Total: 9 test(s)
Name: TestTargetWatchAddress
Failed: 0 test(s), Passed: 6 test(s), Total: 6 test(s)
Name: TestTemplateArgs
Failed: 0 test(s), Passed: 6 test(s), Total: 6 test(s)
Name: TestTerminal
Failed: 0 test(s), Passed: 0 test(s), Total: 1 test(s)
Name: TestTestId
Failed: 0 test(s), Passed: 1 test(s), Total: 1 test(s)
Name: TestThreadAPI
Failed: 0 test(s), Passed: 15 test(s), Total: 15 test(s)
Name: TestThreadExit
Failed: 0 test(s), Passed: 3 test(s), Total: 3 test(s)
Name: TestThreadJump
Failed: 0 test(s), Passed: 3 test(s), Total: 3 test(s)
Name: TestThreadSpecificBpPlusCondition
Failed: 0 test(s), Passed: 3 test(s), Total: 3 test(s)
Name: TestThreadSpecificBreakpoint
Failed: 0 test(s), Passed: 3 test(s), Total: 3 test(s)
Name: TestThreadStates
Failed: 0 test(s), Passed: 9 test(s), Total: 15 test(s)
Name: TestThreadStepOut
Failed: 0 test(s), Passed: 9 test(s), Total: 9 test(s)
Name: TestThreadStepping
Failed: 0 test(s), Passed: 3 test(s), Total: 3 test(s)
Name: TestTlsGlobals
Failed: 0 test(s), Passed: 3 test(s), Total: 3 test(s)
Name: TestTopLevelExprs
Failed: 0 test(s), Passed: 2 test(s), Total: 3 test(s)
Name: TestTsanBasic
Failed: 0 test(s), Passed: 3 test(s), Total: 3 test(s)
Name: TestTsanCPPGlobalLocation
Failed: 0 test(s), Passed: 3 test(s), Total: 3 test(s)
Name: TestTsanGlobalLocation
Failed: 0 test(s), Passed: 3 test(s), Total: 3 test(s)
Name: TestTsanMultiple
Failed: 0 test(s), Passed: 3 test(s), Total: 3 test(s)
Name: TestTsanSwift
Failed: 0 test(s), Passed: 3 test(s), Total: 3 test(s)
Name: TestTsanThreadLeak
Failed: 0 test(s), Passed: 3 test(s), Total: 3 test(s)
Name: TestTsanThreadNumbers
Failed: 0 test(s), Passed: 3 test(s), Total: 3 test(s)
Name: TestTypeCompletion
Failed: 0 test(s), Passed: 3 test(s), Total: 3 test(s)
Name: TestTypeList
Failed: 0 test(s), Passed: 3 test(s), Total: 3 test(s)
Name: TestTypeLookup
Failed: 0 test(s), Passed: 3 test(s), Total: 3 test(s)
Name: TestTypeSummaryListArg
Failed: 0 test(s), Passed: 1 test(s), Total: 1 test(s)
Name: TestTypeSummaryListScript
Failed: 0 test(s), Passed: 3 test(s), Total: 3 test(s)
Name: TestUbsanBasic
Failed: 0 test(s), Passed: 0 test(s), Total: 3 test(s)
Name: TestUbsanUserExpression
Failed: 0 test(s), Passed: 0 test(s), Total: 3 test(s)
Name: TestUnicodeLiterals
Failed: 0 test(s), Passed: 9 test(s), Total: 9 test(s)
Name: TestUnionMembers
Failed: 0 test(s), Passed: 3 test(s), Total: 3 test(s)
Name: TestUniqueTypes
Failed: 0 test(s), Passed: 3 test(s), Total: 3 test(s)
Name: TestUnitTests
Failed: 0 test(s), Passed: 1 test(s), Total: 3 test(s)
Name: TestUniversal
Failed: 0 test(s), Passed: 9 test(s), Total: 9 test(s)
Name: TestUnsignedTypes
Failed: 0 test(s), Passed: 3 test(s), Total: 3 test(s)
Name: TestUnwindExpression
Failed: 0 test(s), Passed: 4 test(s), Total: 4 test(s)
Name: TestUserFormatVsSummary
Failed: 0 test(s), Passed: 3 test(s), Total: 3 test(s)
Name: TestValueAPI
Failed: 0 test(s), Passed: 3 test(s), Total: 3 test(s)
Name: TestValueAPIEmptyClass
Failed: 0 test(s), Passed: 3 test(s), Total: 3 test(s)
Name: TestValueAPILinkedList
Failed: 0 test(s), Passed: 3 test(s), Total: 3 test(s)
Name: TestValueMD5Crash
Failed: 0 test(s), Passed: 3 test(s), Total: 3 test(s)
Name: TestValueObjectRecursion
Failed: 0 test(s), Passed: 3 test(s), Total: 3 test(s)
Name: TestValueOfVectorVariable
Failed: 0 test(s), Passed: 3 test(s), Total: 3 test(s)
Name: TestValueVarUpdate
Failed: 0 test(s), Passed: 3 test(s), Total: 3 test(s)
Name: TestVarInAggregateMisuse
Failed: 0 test(s), Passed: 3 test(s), Total: 3 test(s)
Name: TestVectorTypesFormatting
Failed: 0 test(s), Passed: 3 test(s), Total: 3 test(s)
Name: TestVirtual
Failed: 0 test(s), Passed: 3 test(s), Total: 3 test(s)
Name: TestWatchLocation
Failed: 0 test(s), Passed: 0 test(s), Total: 3 test(s)
Name: TestWatchLocationWithWatchSet
Failed: 0 test(s), Passed: 3 test(s), Total: 3 test(s)
Name: TestWatchedVarHitWhenInScope
Failed: 0 test(s), Passed: 3 test(s), Total: 3 test(s)
Name: TestWatchpointCommandLLDB
Failed: 0 test(s), Passed: 6 test(s), Total: 6 test(s)
Name: TestWatchpointCommandPython
Failed: 0 test(s), Passed: 6 test(s), Total: 6 test(s)
Name: TestWatchpointCommands
Failed: 0 test(s), Passed: 15 test(s), Total: 15 test(s)
Name: TestWatchpointConditionAPI
Failed: 0 test(s), Passed: 3 test(s), Total: 3 test(s)
Name: TestWatchpointConditionCmd
Failed: 0 test(s), Passed: 3 test(s), Total: 3 test(s)
Name: TestWatchpointDisable
Failed: 0 test(s), Passed: 6 test(s), Total: 6 test(s)
Name: TestWatchpointEvents
Failed: 0 test(s), Passed: 3 test(s), Total: 3 test(s)
Name: TestWatchpointIgnoreCount
Failed: 0 test(s), Passed: 3 test(s), Total: 3 test(s)
Name: TestWatchpointIter
Failed: 0 test(s), Passed: 3 test(s), Total: 3 test(s)
Name: TestWatchpointMultipleSlots
Failed: 0 test(s), Passed: 0 test(s), Total: 1 test(s)
Name: TestWatchpointMultipleThreads
Failed: 0 test(s), Passed: 6 test(s), Total: 6 test(s)
Name: TestWatchpointSetErrorCases
Failed: 0 test(s), Passed: 3 test(s), Total: 3 test(s)
Name: TestWatchpointSizes
Failed: 0 test(s), Passed: 3 test(s), Total: 3 test(s)
Name: TestWithLimitDebugInfo
Failed: 0 test(s), Passed: 1 test(s), Total: 3 test(s)
Name: TestWithModuleDebugging
Failed: 0 test(s), Passed: 1 test(s), Total: 1 test(s)
Name: TestWow64MiniDump
Failed: 0 test(s), Passed: 3 test(s), Total: 3 test(s)
Name: TestXcode41Vs42GDBDisassembly
Failed: 0 test(s), Passed: 0 test(s), Total: 2 test(s)
Name: TestYMMRegister
Failed: 0 test(s), Passed: 1 test(s), Total: 1 test(s)
Name: Testtypedef
Failed: 0 test(s), Passed: 3 test(s), Total: 3 test(s)
Name: lldbsuite.test.lldbtest
Failed: 0 test(s), Passed: 229 test(s), Total: 232 test(s)

Changes

Commit c01d68c5ccb135465e5c3b81515f1e65ec80aeda by arphaman:
Clarify the error message for unsupported aliases on Darwin

edit: include/clang/Basic/DiagnosticSemaKinds.td
edit: test/Sema/attr-alias.c

Commit a031d276503e8d0a6ff54c2fde97ba0e6db5ba22 by arphaman:
[ObjC++] Don't warn about pessimizing move for __block variables

edit: lib/Sema/SemaInit.cpp
add: test/SemaObjCXX/block-variable-move.mm

Commit bb1e23e23a8a04da7a0895e9db25b8f867d8065f by arphaman:
[ObjC] Boxed strings should use the nullability from

add: test/SemaObjC/transfer-boxed-string-nullability.m
edit: lib/Sema/SemaExprObjC.cpp

Commit c532fbe2e505f69d711feaf7fedfe045d7ed3b90 by arphaman:
[ObjC] Fix function signature handling for blocks literals with

add: test/SemaObjC/block-literal-with-attribute.m
edit: lib/Sema/SemaExpr.cpp

Commit 9b10de6a1212eaaa7b47fba77f4ab18ca078600a by arphaman:
Remove redundant copy-pasted comment in test file from r317736

edit: test/SemaObjC/block-literal-with-attribute.m

Commit 0e747a4dee6381c875134ee2a473ce5469daafd3 by ahmed.bougacha:
[CodeGen] Fix some Clang-tidy modernize-use-using and Include What You

edit: include/llvm/CodeGen/GlobalISel/InstructionSelector.h
edit: lib/CodeGen/GlobalISel/InstructionSelector.cpp

Commit e560a153f86950508820af385ee2b1ca5eafcb1f by ahmed.bougacha:
[Legalizer] Add support for G_OR NarrowScalar.

edit: lib/CodeGen/GlobalISel/LegalizerHelper.cpp
edit: test/CodeGen/AArch64/GlobalISel/legalize-or.mir
edit: lib/CodeGen/GlobalISel/LegalizerInfo.cpp

Commit 5a56b39a6303d0e46578a6b1573ebba4b17aab2e by ahmed.bougacha:
[X86] Fix some Clang-tidy modernize-use-using and Include What You Use

edit: lib/Target/X86/X86CallLowering.cpp
edit: include/llvm/CodeGen/GlobalISel/InstructionSelectorImpl.h
edit: lib/Target/X86/X86InstructionSelector.cpp
edit: lib/Target/X86/X86CallLowering.h

Commit a89b5e8184fbb90369fcd53704d79b0aeb01f51e by ahmed.bougacha:
[ARM] GlobalISel: Mark shifts as legal for s32

edit: lib/Target/ARM/ARMLegalizerInfo.cpp
edit: test/CodeGen/ARM/GlobalISel/arm-legalizer.mir

Commit a9916751b9142f6e6259b97e4c7345c6cfa08954 by ahmed.bougacha:
[ARM] GlobalISel: Map shift operands to GPRs

edit: test/CodeGen/ARM/GlobalISel/arm-regbankselect.mir
edit: lib/Target/ARM/ARMRegisterBankInfo.cpp

Commit d12cabeb6caffac13a60dd19f398ed1c6120ea58 by ahmed.bougacha:
[ARM] GlobalISel: Select shifts

edit: lib/Target/ARM/ARMInstructionSelector.cpp
edit: test/CodeGen/ARM/GlobalISel/arm-instruction-select.mir

Commit ae0ef4c252e1811077df45f6cf5d0b94bc206213 by ahmed.bougacha:
[ARM] GlobalISel: Make tests less strict

edit: test/CodeGen/ARM/GlobalISel/arm-isel-divmod.ll
edit: test/CodeGen/ARM/GlobalISel/arm-isel.ll

Commit fbb9aa5acaea3d45ea724bcdb489c51f060e5dd5 by ahmed.bougacha:
[GlobalISel] Fix legalizer trying to process a deleted instruction.

edit: include/llvm/CodeGen/GlobalISel/LegalizerCombiner.h
add: test/CodeGen/AArch64/GlobalISel/combine-anyext-crash.mir

Commit 3b3706e1e0d8d968ef14ff8f1c280b35c265e1e7 by ahmed.bougacha:
[AArch64][GlobalISel] Make G_PHI of p0 types legal.

edit: lib/Target/AArch64/AArch64LegalizerInfo.cpp
edit: test/CodeGen/AArch64/GlobalISel/legalize-phi.mir

Commit aeed584ba8b3852b9698c4e61c696f66a47c9687 by ahmed.bougacha:
[AArch64][GlobalISel] Add a test case for G_PHI of p0 regbank selection.

edit: test/CodeGen/AArch64/GlobalISel/regbankselect-default.mir

Commit b4911649c27b963567619e151e9542352c55abed by ahmed.bougacha:
[AArch64][GlobalISel] Add a test case for G_PHI of p0 instruction

edit: test/CodeGen/AArch64/GlobalISel/select-phi.mir

Commit dbc8bd8a9f1f36b0e1095642b77b2ec2a2b61e8d by ahmed.bougacha:
[globalisel] Add support for ValueType operands in patterns.

edit: test/TableGen/GlobalISelEmitter.td
edit: utils/TableGen/GlobalISelEmitter.cpp

Commit f5b476958dcf4b0f194eedb45912ca7a2b779e9e by ahmed.bougacha:
Add a helper to build Copy instructions in MachineIRBuilder

edit: include/llvm/CodeGen/GlobalISel/MachineIRBuilder.h

Commit ddb0525ab61769cabeb32666f1b544e37aee768c by ahmed.bougacha:
[GISel]: Fix generation of illegal COPYs during CallLowering

edit: lib/Target/AArch64/AArch64CallLowering.cpp
edit: test/CodeGen/AArch64/GlobalISel/arm64-irtranslator.ll
edit: test/CodeGen/AArch64/GlobalISel/arm64-fallback.ll
edit: test/CodeGen/AArch64/GlobalISel/arm64-callingconv.ll
edit: test/CodeGen/X86/GlobalISel/irtranslator-callingconv.ll
edit: lib/Target/X86/X86CallLowering.cpp
edit: test/CodeGen/AArch64/GlobalISel/call-translator.ll
edit: test/CodeGen/ARM/GlobalISel/arm-irtranslator.ll
edit: lib/CodeGen/GlobalISel/CallLowering.cpp
edit: test/CodeGen/X86/GlobalISel/callingconv.ll
edit: lib/Target/ARM/ARMCallLowering.cpp
edit: test/CodeGen/X86/GlobalISel/ext-x86-64.ll
edit: test/CodeGen/X86/GlobalISel/add-scalar.ll

Commit 853d5efa2e125ba910438f27c2fa97c238720e9e by ahmed.bougacha:
CodeGen: Add MachineInstr::getMF(). NFC

edit: include/llvm/CodeGen/MachineInstr.h
edit: lib/CodeGen/MachineInstr.cpp

Commit 1148b33b4e59810953d8e58962162cb494fe4a69 by ahmed.bougacha:
CodeGen: Minor cleanups to use MachineInstr::getMF. NFC

edit: include/llvm/CodeGen/GlobalISel/InstructionSelectorImpl.h
edit: lib/CodeGen/GlobalISel/RegisterBankInfo.cpp
edit: include/llvm/CodeGen/GlobalISel/MachineIRBuilder.h

Commit c5786348860c07f84a04a40b691efae256b71b43 by ahmed.bougacha:
[aarch64] Support APInt and APFloat in ImmLeaf subclasses and make

edit: include/llvm/Target/TargetSelectionDAG.td
edit: utils/TableGen/GlobalISelEmitter.cpp
edit: utils/TableGen/CodeGenDAGPatterns.cpp
edit: include/llvm/CodeGen/SelectionDAGNodes.h
edit: lib/Target/AArch64/AArch64InstrFormats.td
edit: include/llvm/ADT/APFloat.h
edit: utils/TableGen/CodeGenDAGPatterns.h

Commit 38375b298ed118b1a45bd9acf69d3193a5f583d1 by ahmed.bougacha:
[Legalizer] Only allocate the SetVectors once per function.

edit: lib/CodeGen/GlobalISel/Legalizer.cpp

Commit 60e0f66f494829b5bdaaad6bdfbc2d2451f28578 by ahmed.bougacha:
[LegalizerInfo] Don't evaluate end boundary every time through the loop

edit: lib/CodeGen/GlobalISel/LegalizerInfo.cpp

Commit 7af7dc243d68656258e0fa2412e877e4a269e639 by ahmed.bougacha:
[Legalizer] Use SmallSetVector instead of SetVector.

edit: lib/CodeGen/GlobalISel/Legalizer.cpp

Commit e0ad7ab774f944e3beab17a5f7340b17f349fb3c by ahmed.bougacha:
[RegisterBankInfo] Cache the getMinimalPhysRegClass information

edit: include/llvm/CodeGen/GlobalISel/RegisterBankInfo.h
edit: lib/CodeGen/GlobalISel/RegisterBankInfo.cpp
edit: lib/CodeGen/GlobalISel/RegBankSelect.cpp

Commit 76705509e758f65c8699077103daf3faf02d2ab5 by ahmed.bougacha:
[globalisel][tablegen] Add support for fpimm and import of APInt/APFloat

edit: test/CodeGen/AArch64/GlobalISel/select-constant.mir
edit: utils/TableGen/CodeGenDAGPatterns.cpp
edit: include/llvm/CodeGen/GlobalISel/InstructionSelector.h
edit: utils/TableGen/CodeGenDAGPatterns.h
edit: include/llvm/CodeGen/GlobalISel/InstructionSelectorImpl.h
edit: include/llvm/Target/GlobalISel/SelectionDAGCompat.td
edit: test/TableGen/GlobalISelEmitter.td
edit: utils/TableGen/GlobalISelEmitter.cpp
edit: lib/Target/AArch64/AArch64InstructionSelector.cpp
edit: lib/Target/X86/X86InstrFPStack.td

Commit 59bd87658a9769fcbe2ce1f9fbdbf5b58ce6f972 by ahmed.bougacha:
[globalisel][tablegen] Fix a use-after free bug that manifests on

edit: utils/TableGen/GlobalISelEmitter.cpp

Commit ced81ed42eed364593df249b9356c2ed66b43e56 by ahmed.bougacha:
[globalisel][tablegen] Simplify named operand/operator lookups and fix a

edit: utils/TableGen/GlobalISelEmitter.cpp
edit: test/TableGen/GlobalISelEmitter.td
edit: include/llvm/CodeGen/GlobalISel/InstructionSelectorImpl.h
edit: include/llvm/CodeGen/GlobalISel/InstructionSelector.h
add: test/CodeGen/X86/GlobalISel/select-blsr.mir

Commit 020ec21c77ca81f02f79e8e9738bc7e39f63ace5 by ahmed.bougacha:
[globalisel][tablegen] Fix undefined references to dump()

edit: include/llvm/CodeGen/GlobalISel/InstructionSelectorImpl.h

Commit 4aeaa403cedb9f3a4913015f14083c36648aa735 by ahmed.bougacha:
[globalisel][tablegen] Fix an unused variable warning caused by a typo

edit: include/llvm/CodeGen/GlobalISel/InstructionSelectorImpl.h

Commit 5094a41c3d625a7aecdd9332cbf163ca1109587d by ahmed.bougacha:
[TableGen] Avoid unnecessary std::string creations

edit: utils/TableGen/CodeGenDAGPatterns.h
edit: utils/TableGen/GlobalISelEmitter.cpp
edit: utils/TableGen/CodeGenDAGPatterns.cpp

Commit 6367eb72a6cf2ffead9f26e411457ab85528bb6d by ahmed.bougacha:
[tablegen] Handle common load/store predicates inside tablegen. NFC.

edit: utils/TableGen/CodeGenDAGPatterns.h
edit: utils/TableGen/GlobalISelEmitter.cpp
edit: utils/TableGen/CodeGenDAGPatterns.cpp
edit: include/llvm/Target/TargetSelectionDAG.td

Commit cfc40f95ec168a3894f14caf97700b9a612cd9a9 by ahmed.bougacha:
[GlobalISel] Update tablegen tests to account for missing r313271.

edit: test/TableGen/GlobalISelEmitter.td

Commit b6505f158283ca5d1ed0409243132b0667d79b7e by ahmed.bougacha:
[X86] Update gisel phi test for copy size changes. NFC.

edit: test/CodeGen/X86/GlobalISel/phi.ll

Commit 99c4cddfcadf6eb13b5024ae81a35ac77f3d0bd1 by huon:
[SILGen] Store conditional conformances in SILWitnessTables.

edit: lib/Serialization/DeserializeSIL.cpp
edit: lib/Serialization/SerializeSIL.cpp
edit: lib/Serialization/Serialization.cpp
edit: include/swift/Serialization/ModuleFormat.h
edit: lib/SILGen/SILGenPoly.cpp
edit: lib/ParseSIL/ParseSIL.cpp
edit: lib/SILOptimizer/IPO/DeadFunctionElimination.cpp
edit: lib/Serialization/SILFormat.h
add: test/SILGen/conditional_conformance.swift
edit: include/swift/SIL/SILWitnessTable.h
edit: lib/SIL/SILPrinter.cpp
edit: lib/SIL/SILWitnessTable.cpp
edit: lib/SILGen/SILGenType.cpp

Commit 51bea6b575e8ce54c96f4a429355b8a2771b8e14 by huon:
[IRGen] Reserve witness table private data space for conditional

edit: lib/IRGen/GenProto.cpp

Commit 4f53475dd96322e4143be6c63afe9a9e88e0668a by huon:
[IRGen] Support fulfilling conformances from conditional requirements.

edit: lib/IRGen/Fulfillment.cpp
edit: lib/IRGen/WitnessIndex.h
edit: lib/IRGen/Fulfillment.h
edit: lib/IRGen/GenProto.cpp
edit: lib/IRGen/MetadataPath.h

Commit b9336c7389371cde3f3da0090442110d7e001472 by huon:
[IRGen] Dynamically fill in conditional conformance wtables.

edit: lib/IRGen/GenDecl.cpp
edit: lib/IRGen/GenProto.cpp
edit: test/IRGen/associated_type_witness.swift
edit: unittests/runtime/Metadata.cpp
edit: include/swift/Runtime/Metadata.h
edit: test/IRGen/partial_apply_forwarder.sil
edit: test/IRGen/witness_method.sil
edit: lib/IRGen/IRGenModule.h
edit: stdlib/public/runtime/ProtocolConformance.cpp
edit: lib/IRGen/IRGenModule.cpp

Commit 306c0dafdddb9c8821804edfb5e184224c64d4df by huon:
fixup! [IRGen] Dynamically fill in conditional conformance wtables.

edit: test/IRGen/partial_apply_forwarder.sil
edit: test/IRGen/witness_method.sil
edit: test/IRGen/associated_type_witness.swift

Commit bdff7aa3f4dcaf783900253758724a64eda13d59 by huon:
[IRGen] Polymorphic convention needs to consider conditional

edit: lib/IRGen/GenProto.cpp

Commit 4743b8ae5c9e8b140ab24c7a59cc02ee587f9c2e by huon:
[IRGen] Pull witness tables out of self witness table in witness_method

edit: lib/IRGen/GenProto.cpp

Commit ae54ac04442aa0fa054573d50e778fb9b1de452f by huon:
[AST] Allow retrieving substitutions from an arbitrary

edit: lib/AST/ProtocolConformance.cpp
edit: include/swift/AST/ProtocolConformance.h
edit: lib/SILOptimizer/Utils/Devirtualize.cpp

Commit 901bd35e5a86f963346a8e88c7ebbb6214c3e2c2 by huon:
[IRGen] Pass witness tables for conditional conformances to witness

edit: lib/AST/ProtocolConformance.cpp
edit: test/IRGen/protocol_resilience.sil
edit: lib/IRGen/GenProto.cpp
add: test/IRGen/conditional_conformance_with_assoc.swift
edit: test/IRGen/associated_type_witness.swift
add: test/IRGen/conditional_conformance_basic_conformances.swift

Commit b3088e2d84c17163b90d1646e83cc70b10fc6489 by aprantl:
Un-XFAIL and update test.

edit: test/DebugInfo/basic.swift

Commit 1372202cfa9b8dcc44a5cb314af968c9370e37ee by huon:
[test] More for conditional conformances; subclasses, devirtualization,

add: test/Inputs/conditional_conformance_subclass.swift
add: test/Interpreter/conditional_conformances_smoke.swift
add: test/Interpreter/conditional_conformances.swift
edit: test/SILGen/conditional_conformance.swift
delete: test/IRGen/conditional_conformance_basic_conformances.swift
add: test/IRGen/conditional_conformances.swift
add: test/Inputs/conditional_conformance_with_assoc.swift
edit: test/Generics/conditional_conformances.swift
add: test/SILOptimizer/devirt_conditional_conformance.swift
add: test/Interpreter/conditional_conformances_modules.swift
delete: test/IRGen/conditional_conformance_with_assoc.swift
add: test/Inputs/conditional_conformance_basic_conformances.swift

Commit 6dd8bec47e4c3e09c01db79e7b86a33b6477dc28 by huon:
[AST] Unify computation of 'has arguments?' for witness table accessors.

edit: lib/IRGen/GenDecl.cpp
edit: lib/IRGen/GenProto.cpp
edit: include/swift/AST/ProtocolConformance.h
edit: lib/AST/ProtocolConformance.cpp

Commit a94df16b629650c008ee9ccb735032ed42ae4cd5 by huon:
[test] Add more tests for inheriting conformances etc from SE0143

add: test/Generics/conditional_conformances_execute_smoke.swift
edit: test/Generics/conditional_conformances.swift

Commit 67c9fa3daeb4c24fba388b8119f6668be014f5fd by huon:
[test] Add test for parsing @convention(witness_method: ) in

add: test/SIL/Parser/witness_method.sil

Commit b993c113e58a77985959437632f91b1e13d9eb06 by anemet:
Test debug output of Generic Specializer pass

add: test/SILOptimizer/partial_specialization_debug.sil

Commit e74367f2b377ed7ef09861c256287639ecc94aba by gottesmm:
[pred-memopt] Only promote destroy_addr if we know that otherwise the

edit: test/DebugInfo/linetable-cleanups.swift
edit: test/SILOptimizer/definite_init_failable_initializers_objc.swift
edit: test/SILOptimizer/predictable_memopt.sil
edit: test/IRGen/superclass_constraint.swift
edit: lib/SILOptimizer/Mandatory/PredictableMemOpt.cpp
edit: test/SILOptimizer/definite_init_failable_initializers.swift
edit: test/DebugInfo/return.swift
edit: test/SILOptimizer/definite_init_protocol_init.swift

Commit 578fca1ee3fd21592f34613d662c351e60323ebd by aprantl:
Move the logic for ignoring the debug locations for closure setup code

edit: lib/SIL/SILLocation.cpp
edit: test/SILGen/objc_thunks.swift
edit: lib/SILGen/SILGenExpr.cpp
edit: lib/IRGen/IRGenDebugInfo.cpp

Commit b998c103fc224f47a743f889712d0e8fcea5d9e6 by aprantl:
Debug Info: Associate a function call with the beginning of the

edit: test/DebugInfo/patternmatching.swift
edit: test/DebugInfo/inlinedAt.swift
edit: lib/SIL/SILLocation.cpp
edit: lib/SILGen/SILGenApply.cpp
edit: test/DebugInfo/linetable.swift
edit: test/DebugInfo/callexpr.swift

Commit a71a03986eb81e07968e79171ef44673f5333640 by github:
libSyntax: Start parsing simple identifier expression. (#12862)

edit: test/Syntax/Outputs/round_trip_parse_gen.swift.withkinds
edit: utils/gyb_syntax_support/ExprNodes.py
edit: lib/Parse/ParseExpr.cpp
edit: lib/Syntax/SyntaxParsingContext.cpp

Commit f552f559697a3b520ba18fced8ee7d322d8bcb7f by xi_ge:
Update SwiftSyntax's expectations now that -emit-syntax is emitting a

edit: tools/SwiftSyntax/SwiftSyntax.swift

Commit dcef91680c4f4a2b84d869f38c647065640b859c by eeckstein:
cmpcodesize: replace the Ounchecked with the Osize benchmark shortcut.

edit: utils/cmpcodesize/cmpcodesize/main.py

Commit 773e6bff56efcd96881f411c8312c6dc49ef68b6 by spestov:
SIL: Add SILFunction::getResilienceExpansion()

edit: include/swift/SIL/SILFunction.h

Commit 0b895bbf44f271ff432df374372b78e7000f50d5 by spestov:
SILGen: Use resilience expansion when deciding if we need to use

edit: test/SILGen/struct_resilience.swift
edit: lib/SILGen/SILGenLValue.cpp

Commit 9de7a21e8e26b3bc0c90ea189e0966e4b08f28f5 by spestov:
SILGen: Use SILFunction's resilience expansion when evaluating enum

edit: test/SILGen/enum_resilience.swift
edit: lib/SILGen/SILGenPattern.cpp

Commit 697b19570b2a91480e926706034f5e6dfadb79d4 by github:
Update Xcode version to Xcode 9.1 GM

edit: README.md

The error is: False is not True : Stepped to line 208 instead of expected 222 with pattern 'doSomethingWithFunction(cd_maker, 10)'.

···

On Nov 10, 2017, at 10:49 PM, Pavel Yaskevich <pyaskevich@apple.com> wrote:

Adrian, could this be caused by your changes?

On Nov 10, 2017, at 10:48 PM, no-reply@swift.org <mailto:no-reply@swift.org> wrote:

[FAILURE] oss-lldb-incremental-osx [#383]

Build URL: https://ci.swift.org/job/oss-lldb-incremental-osx/383/
Project: oss-lldb-incremental-osx
Date of build: Fri, 10 Nov 2017 22:40:18 -0600
Build duration: 2 hr 7 min
Identified problems:

Assertion failure: This build failed because of an assertion failure. Below is a list of all errors in the build log:
Indication 1 <https://ci.swift.org//job/oss-lldb-incremental-osx/383/consoleFull#1256565552ef3c3c00-f496-40b9-85a7-0eb69d0f491b>
Regression test failed: This build failed because a regression test in the test suite FAILed. Below is a list of all errors:
Indication 1 <https://ci.swift.org//job/oss-lldb-incremental-osx/383/consoleFull#527207262ba62d58e-7248-467b-91e0-c7508d5cf947>
Tests:

Name: Test-rdar-12481949
Failed: 0 test(s), Passed: 3 test(s), Total: 3 test(s)
Name: Test-rdar-9974002
Failed: 0 test(s), Passed: 3 test(s), Total: 3 test(s)
Name: Test11588
Failed: 0 test(s), Passed: 3 test(s), Total: 3 test(s)
Name: Test8638051
Failed: 0 test(s), Passed: 3 test(s), Total: 3 test(s)
Name: TestABIv2
Failed: 0 test(s), Passed: 3 test(s), Total: 3 test(s)
Name: TestAbbreviations
Failed: 0 test(s), Passed: 1 test(s), Total: 1 test(s)
Name: TestAddDsymCommand
Failed: 0 test(s), Passed: 3 test(s), Total: 3 test(s)
Name: TestAddDsymMidExecutionCommand
Failed: 0 test(s), Passed: 1 test(s), Total: 1 test(s)
Name: TestAddressBreakpoints
Failed: 0 test(s), Passed: 1 test(s), Total: 1 test(s)
Name: TestAnonymous
Failed: 0 test(s), Passed: 21 test(s), Total: 21 test(s)
Name: TestAppleTypesIsProduced
Failed: 0 test(s), Passed: 0 test(s), Total: 3 test(s)
Name: TestApropos
Failed: 0 test(s), Passed: 1 test(s), Total: 1 test(s)
Name: TestAproposWithProcess
Failed: 0 test(s), Passed: 3 test(s), Total: 3 test(s)
Name: TestArray
Failed: 0 test(s), Passed: 0 test(s), Total: 3 test(s)
Name: TestArrayTypes
Failed: 0 test(s), Passed: 6 test(s), Total: 6 test(s)
Name: TestAsanSwift
Failed: 0 test(s), Passed: 3 test(s), Total: 3 test(s)
Name: TestAttachDenied
Failed: 0 test(s), Passed: 3 test(s), Total: 3 test(s)
Name: TestAttachResume
Failed: 0 test(s), Passed: 3 test(s), Total: 3 test(s)
Name: TestAvoidBreakpointInDelaySlot
Failed: 0 test(s), Passed: 0 test(s), Total: 3 test(s)
Name: TestBSDArchives
Failed: 0 test(s), Passed: 3 test(s), Total: 3 test(s)
Name: TestBackticksWithoutATarget
Failed: 0 test(s), Passed: 1 test(s), Total: 1 test(s)
Name: TestBacktraceAll
Failed: 0 test(s), Passed: 3 test(s), Total: 3 test(s)
Name: TestBadAddressBreakpoints
Failed: 0 test(s), Passed: 1 test(s), Total: 1 test(s)
Name: TestBadReference
Failed: 0 test(s), Passed: 0 test(s), Total: 3 test(s)
Name: TestBatchMode
Failed: 0 test(s), Passed: 9 test(s), Total: 9 test(s)
Name: TestBenchmarkContinue
Failed: 0 test(s), Passed: 0 test(s), Total: 3 test(s)
Name: TestBenchmarkLibcxxList
Failed: 0 test(s), Passed: 0 test(s), Total: 3 test(s)
Name: TestBenchmarkLibcxxMap
Failed: 0 test(s), Passed: 0 test(s), Total: 3 test(s)
Name: TestBenchmarkSwiftDictionary
Failed: 0 test(s), Passed: 0 test(s), Total: 3 test(s)
Name: TestBitfields
Failed: 0 test(s), Passed: 6 test(s), Total: 6 test(s)
Name: TestBlocks
Failed: 0 test(s), Passed: 6 test(s), Total: 6 test(s)
Name: TestBoundViolation
Failed: 0 test(s), Passed: 0 test(s), Total: 3 test(s)
Name: TestBreakAfterJoin
Failed: 0 test(s), Passed: 3 test(s), Total: 3 test(s)
Name: TestBreakpointAPI
Failed: 0 test(s), Passed: 2 test(s), Total: 2 test(s)
Name: TestBreakpointAutoContinue
Failed: 0 test(s), Passed: 3 test(s), Total: 3 test(s)
Name: TestBreakpointCaseSensitivity
Failed: 0 test(s), Passed: 3 test(s), Total: 6 test(s)
Name: TestBreakpointCommand
Failed: 0 test(s), Passed: 9 test(s), Total: 9 test(s)
Name: TestBreakpointCommandsFromPython
Failed: 0 test(s), Passed: 3 test(s), Total: 3 test(s)
Name: TestBreakpointConditions
Failed: 0 test(s), Passed: 12 test(s), Total: 12 test(s)
Name: TestBreakpointHitCount
Failed: 0 test(s), Passed: 1 test(s), Total: 1 test(s)
Name: TestBreakpointIDs
Failed: 0 test(s), Passed: 3 test(s), Total: 3 test(s)
Name: TestBreakpointIgnoreCount
Failed: 0 test(s), Passed: 6 test(s), Total: 6 test(s)
Name: TestBreakpointLanguage
Failed: 0 test(s), Passed: 6 test(s), Total: 6 test(s)
Name: TestBreakpointLocations
Failed: 0 test(s), Passed: 9 test(s), Total: 9 test(s)
Name: TestBreakpointNames
Failed: 0 test(s), Passed: 6 test(s), Total: 6 test(s)
Name: TestBreakpointOptions
Failed: 0 test(s), Passed: 3 test(s), Total: 3 test(s)
Name: TestBreakpointSerialization
Failed: 0 test(s), Passed: 15 test(s), Total: 15 test(s)
Name: TestBreakpointSetRestart
Failed: 0 test(s), Passed: 3 test(s), Total: 3 test(s)
Name: TestBreakpointsWithNoTargets
Failed: 0 test(s), Passed: 3 test(s), Total: 3 test(s)
Name: TestBuiltinTrap
Failed: 0 test(s), Passed: 3 test(s), Total: 3 test(s)
Name: TestBulkyEnumsVariables
Failed: 0 test(s), Passed: 3 test(s), Total: 3 test(s)
Name: TestBundleWithDotInFilename
Failed: 0 test(s), Passed: 3 test(s), Total: 3 test(s)
Name: TestCGImportedTypes
Failed: 0 test(s), Passed: 3 test(s), Total: 3 test(s)
Name: TestCGTypes
Failed: 0 test(s), Passed: 3 test(s), Total: 3 test(s)
Name: TestCInlines
Failed: 0 test(s), Passed: 3 test(s), Total: 3 test(s)
Name: TestCModules
Failed: 0 test(s), Passed: 3 test(s), Total: 3 test(s)
Name: TestCPP11EnumTypes
Failed: 0 test(s), Passed: 24 test(s), Total: 24 test(s)
Name: TestCPPAuto
Failed: 0 test(s), Passed: 3 test(s), Total: 3 test(s)
Name: TestCPPBool
Failed: 0 test(s), Passed: 3 test(s), Total: 3 test(s)
Name: TestCPPBreakpointCommands
Failed: 0 test(s), Passed: 3 test(s), Total: 3 test(s)
Name: TestCPPBreakpointLocations
Failed: 0 test(s), Passed: 6 test(s), Total: 6 test(s)
Name: TestCPPExceptionBreakpoint
Failed: 0 test(s), Passed: 3 test(s), Total: 3 test(s)
Name: TestCPPExceptionBreakpoints
Failed: 0 test(s), Passed: 3 test(s), Total: 3 test(s)
Name: TestCPPStaticMembers
Failed: 0 test(s), Passed: 3 test(s), Total: 3 test(s)
Name: TestCPPStaticMethods
Failed: 0 test(s), Passed: 3 test(s), Total: 3 test(s)
Name: TestCPPThis
Failed: 0 test(s), Passed: 3 test(s), Total: 3 test(s)
Name: TestCStrings
Failed: 0 test(s), Passed: 3 test(s), Total: 3 test(s)
Name: TestCalculatorMode
Failed: 0 test(s), Passed: 3 test(s), Total: 3 test(s)
Name: TestCallCPPFunction
Failed: 0 test(s), Passed: 3 test(s), Total: 3 test(s)
Name: TestCallStdStringFunction
Failed: 0 test(s), Passed: 3 test(s), Total: 3 test(s)
Name: TestCallStopAndContinue
Failed: 0 test(s), Passed: 3 test(s), Total: 3 test(s)
Name: TestCallThatRestarts
Failed: 0 test(s), Passed: 0 test(s), Total: 1 test(s)
Name: TestCallThatThrows
Failed: 0 test(s), Passed: 3 test(s), Total: 3 test(s)
Name: TestCallUserAnonTypedef
Failed: 0 test(s), Passed: 3 test(s), Total: 3 test(s)
Name: TestCallUserDefinedFunction
Failed: 0 test(s), Passed: 3 test(s), Total: 3 test(s)
Name: TestCallWithTimeout
Failed: 0 test(s), Passed: 3 test(s), Total: 3 test(s)
Name: TestChangeProcessGroup
Failed: 0 test(s), Passed: 1 test(s), Total: 1 test(s)
Name: TestChangeValueAPI
Failed: 0 test(s), Passed: 3 test(s), Total: 3 test(s)
Name: TestChar1632T
Failed: 0 test(s), Passed: 3 test(s), Total: 3 test(s)
Name: TestClassConstrainedProtocol
Failed: 0 test(s), Passed: 4 test(s), Total: 4 test(s)
Name: TestClassTypes
Failed: 0 test(s), Passed: 12 test(s), Total: 12 test(s)
Name: TestClassTypesDisassembly
Failed: 0 test(s), Passed: 6 test(s), Total: 6 test(s)
Name: TestCommandHistory
Failed: 0 test(s), Passed: 1 test(s), Total: 1 test(s)
Name: TestCommandInterpreterAPI
Failed: 0 test(s), Passed: 3 test(s), Total: 3 test(s)
Name: TestCommandRegex
Failed: 0 test(s), Passed: 1 test(s), Total: 1 test(s)
Name: TestCommandScript
Failed: 0 test(s), Passed: 3 test(s), Total: 3 test(s)
Name: TestCommandScriptAlias
Failed: 0 test(s), Passed: 3 test(s), Total: 3 test(s)
Name: TestCommandScriptImmediateOutput
Failed: 0 test(s), Passed: 2 test(s), Total: 2 test(s)
Name: TestCommandSource
Failed: 0 test(s), Passed: 1 test(s), Total: 1 test(s)
Name: TestCommonShortSpellings
Failed: 0 test(s), Passed: 1 test(s), Total: 1 test(s)
Name: TestCompDirSymLink
Failed: 0 test(s), Passed: 6 test(s), Total: 9 test(s)
Name: TestCompactVectors
Failed: 0 test(s), Passed: 3 test(s), Total: 3 test(s)
Name: TestCompileRunToBreakpointTurnaround
Failed: 0 test(s), Passed: 0 test(s), Total: 1 test(s)
Name: TestCompletion
Failed: 0 test(s), Passed: 34 test(s), Total: 34 test(s)
Name: TestComplicatedExpression
Failed: 0 test(s), Passed: 0 test(s), Total: 3 test(s)
Name: TestConcurrentBreakpointDelayBreakpointOneSignal
Failed: 0 test(s), Passed: 1 test(s), Total: 1 test(s)
Name: TestConcurrentBreakpointOneDelayBreakpointThreads
Failed: 0 test(s), Passed: 1 test(s), Total: 1 test(s)
Name: TestConcurrentBreakpointsDelayedBreakpointOneWatchpoint
Failed: 0 test(s), Passed: 1 test(s), Total: 1 test(s)
Name: TestConcurrentCrashWithBreak
Failed: 0 test(s), Passed: 1 test(s), Total: 1 test(s)
Name: TestConcurrentCrashWithSignal
Failed: 0 test(s), Passed: 1 test(s), Total: 1 test(s)
Name: TestConcurrentCrashWithWatchpoint
Failed: 0 test(s), Passed: 1 test(s), Total: 1 test(s)
Name: TestConcurrentCrashWithWatchpointBreakpointSignal
Failed: 0 test(s), Passed: 1 test(s), Total: 1 test(s)
Name: TestConcurrentDelaySignalBreak
Failed: 0 test(s), Passed: 1 test(s), Total: 1 test(s)
Name: TestConcurrentDelaySignalWatch
Failed: 0 test(s), Passed: 1 test(s), Total: 1 test(s)
Name: TestConcurrentDelayWatchBreak
Failed: 0 test(s), Passed: 1 test(s), Total: 1 test(s)
Name: TestConcurrentDelayedCrashWithBreakpointSignal
Failed: 0 test(s), Passed: 1 test(s), Total: 1 test(s)
Name: TestConcurrentDelayedCrashWithBreakpointWatchpoint
Failed: 0 test(s), Passed: 1 test(s), Total: 1 test(s)
Name: TestConcurrentManyBreakpoints
Failed: 0 test(s), Passed: 0 test(s), Total: 1 test(s)
Name: TestConcurrentManyCrash
Failed: 0 test(s), Passed: 0 test(s), Total: 1 test(s)
Name: TestConcurrentManySignals
Failed: 0 test(s), Passed: 0 test(s), Total: 1 test(s)
Name: TestConcurrentManyWatchpoints
Failed: 0 test(s), Passed: 0 test(s), Total: 1 test(s)
Name: TestConcurrentNWatchNBreak
Failed: 0 test(s), Passed: 1 test(s), Total: 1 test(s)
Name: TestConcurrentSignalBreak
Failed: 0 test(s), Passed: 1 test(s), Total: 1 test(s)
Name: TestConcurrentSignalDelayBreak
Failed: 0 test(s), Passed: 1 test(s), Total: 1 test(s)
Name: TestConcurrentSignalDelayWatch
Failed: 0 test(s), Passed: 1 test(s), Total: 1 test(s)
Name: TestConcurrentSignalNWatchNBreak
Failed: 0 test(s), Passed: 1 test(s), Total: 1 test(s)
Name: TestConcurrentSignalWatch
Failed: 0 test(s), Passed: 1 test(s), Total: 1 test(s)
Name: TestConcurrentSignalWatchBreak
Failed: 0 test(s), Passed: 1 test(s), Total: 1 test(s)
Name: TestConcurrentTwoBreakpointThreads
Failed: 0 test(s), Passed: 1 test(s), Total: 1 test(s)
Name: TestConcurrentTwoBreakpointsOneDelaySignal
Failed: 0 test(s), Passed: 1 test(s), Total: 1 test(s)
Name: TestConcurrentTwoBreakpointsOneSignal
Failed: 0 test(s), Passed: 1 test(s), Total: 1 test(s)
Name: TestConcurrentTwoBreakpointsOneWatchpoint
Failed: 0 test(s), Passed: 1 test(s), Total: 1 test(s)
Name: TestConcurrentTwoWatchpointThreads
Failed: 0 test(s), Passed: 1 test(s), Total: 1 test(s)
Name: TestConcurrentTwoWatchpointsOneBreakpoint
Failed: 0 test(s), Passed: 1 test(s), Total: 1 test(s)
Name: TestConcurrentTwoWatchpointsOneDelayBreakpoint
Failed: 0 test(s), Passed: 1 test(s), Total: 1 test(s)
Name: TestConcurrentTwoWatchpointsOneSignal
Failed: 0 test(s), Passed: 1 test(s), Total: 1 test(s)
Name: TestConcurrentWatchBreak
Failed: 0 test(s), Passed: 1 test(s), Total: 1 test(s)
Name: TestConcurrentWatchBreakDelay
Failed: 0 test(s), Passed: 1 test(s), Total: 1 test(s)
Name: TestConcurrentWatchpointDelayWatchpointOneBreakpoint
Failed: 0 test(s), Passed: 1 test(s), Total: 1 test(s)
Name: TestConcurrentWatchpointWithDelayWatchpointThreads
Failed: 0 test(s), Passed: 1 test(s), Total: 1 test(s)
Name: TestConditionalBreak
Failed: 0 test(s), Passed: 6 test(s), Total: 6 test(s)
Name: TestConflictingDefinition
Failed: 0 test(s), Passed: 3 test(s), Total: 3 test(s)
Name: TestConflictingSymbol
Failed: 0 test(s), Passed: 1 test(s), Total: 1 test(s)
Name: TestConsecutiveBreakpoints
Failed: 0 test(s), Passed: 3 test(s), Total: 3 test(s)
Name: TestConstStrings
Failed: 0 test(s), Passed: 3 test(s), Total: 3 test(s)
Name: TestConstVariables
Failed: 0 test(s), Passed: 3 test(s), Total: 3 test(s)
Name: TestConvenienceVariables
Failed: 0 test(s), Passed: 3 test(s), Total: 3 test(s)
Name: TestCppChainedCalls
Failed: 0 test(s), Passed: 3 test(s), Total: 3 test(s)
Name: TestCppGlobalOperators
Failed: 0 test(s), Passed: 6 test(s), Total: 6 test(s)
Name: TestCppIncompleteTypes
Failed: 0 test(s), Passed: 6 test(s), Total: 6 test(s)
Name: TestCppNsImport
Failed: 0 test(s), Passed: 3 test(s), Total: 3 test(s)
Name: TestCppScope
Failed: 0 test(s), Passed: 6 test(s), Total: 6 test(s)
Name: TestCppValueCast
Failed: 0 test(s), Passed: 6 test(s), Total: 6 test(s)
Name: TestCrashDuringStep
Failed: 0 test(s), Passed: 3 test(s), Total: 3 test(s)
Name: TestCreateAfterAttach
Failed: 0 test(s), Passed: 6 test(s), Total: 6 test(s)
Name: TestCreateDuringInstructionStep
Failed: 0 test(s), Passed: 0 test(s), Total: 1 test(s)
Name: TestCreateDuringStep
Failed: 0 test(s), Passed: 9 test(s), Total: 9 test(s)
Name: TestCxxWCharT
Failed: 0 test(s), Passed: 3 test(s), Total: 3 test(s)
Name: TestDarwinLogBasic
Failed: 0 test(s), Passed: 0 test(s), Total: 1 test(s)
Name: TestDarwinLogFilterMatchActivity
Failed: 0 test(s), Passed: 0 test(s), Total: 4 test(s)
Name: TestDarwinLogFilterMatchActivityChain
Failed: 0 test(s), Passed: 0 test(s), Total: 4 test(s)
Name: TestDarwinLogFilterMatchCategory
Failed: 0 test(s), Passed: 0 test(s), Total: 4 test(s)
Name: TestDarwinLogFilterMatchMessage
Failed: 0 test(s), Passed: 0 test(s), Total: 4 test(s)
Name: TestDarwinLogFilterMatchSubsystem
Failed: 0 test(s), Passed: 0 test(s), Total: 4 test(s)
Name: TestDarwinLogFilterRegexActivity
Failed: 0 test(s), Passed: 0 test(s), Total: 5 test(s)
Name: TestDarwinLogFilterRegexActivityChain
Failed: 0 test(s), Passed: 0 test(s), Total: 5 test(s)
Name: TestDarwinLogFilterRegexCategory
Failed: 0 test(s), Passed: 0 test(s), Total: 5 test(s)
Name: TestDarwinLogFilterRegexMessage
Failed: 0 test(s), Passed: 0 test(s), Total: 5 test(s)
Name: TestDarwinLogFilterRegexSubsystem
Failed: 0 test(s), Passed: 0 test(s), Total: 6 test(s)
Name: TestDarwinLogMessageFormat
Failed: 0 test(s), Passed: 0 test(s), Total: 6 test(s)
Name: TestDarwinLogSourceDebug
Failed: 0 test(s), Passed: 0 test(s), Total: 2 test(s)
Name: TestDarwinLogSourceInfo
Failed: 0 test(s), Passed: 0 test(s), Total: 2 test(s)
Name: TestDarwinNSLogOutput
Failed: 0 test(s), Passed: 2 test(s), Total: 2 test(s)
Name: TestDataFormatterAdv
Failed: 0 test(s), Passed: 3 test(s), Total: 3 test(s)
Name: TestDataFormatterCategories
Failed: 0 test(s), Passed: 3 test(s), Total: 3 test(s)
Name: TestDataFormatterCpp
Failed: 0 test(s), Passed: 3 test(s), Total: 3 test(s)
Name: TestDataFormatterDisabling
Failed: 0 test(s), Passed: 3 test(s), Total: 3 test(s)
Name: TestDataFormatterEnumFormat
Failed: 0 test(s), Passed: 3 test(s), Total: 3 test(s)
Name: TestDataFormatterGlobals
Failed: 0 test(s), Passed: 3 test(s), Total: 3 test(s)
Name: TestDataFormatterHexCaps
Failed: 0 test(s), Passed: 3 test(s), Total: 3 test(s)
Name: TestDataFormatterLanguageCategoryUpdates
Failed: 0 test(s), Passed: 3 test(s), Total: 3 test(s)
Name: TestDataFormatterLibccIterator
Failed: 0 test(s), Passed: 3 test(s), Total: 3 test(s)
Name: TestDataFormatterLibccMap
Failed: 0 test(s), Passed: 3 test(s), Total: 3 test(s)
Name: TestDataFormatterLibccMultiMap
Failed: 0 test(s), Passed: 3 test(s), Total: 3 test(s)
Name: TestDataFormatterLibcxxList
Failed: 0 test(s), Passed: 3 test(s), Total: 3 test(s)
Name: TestDataFormatterLibcxxListLoop
Failed: 0 test(s), Passed: 0 test(s), Total: 3 test(s)
Name: TestDataFormatterLibcxxMultiSet
Failed: 0 test(s), Passed: 3 test(s), Total: 3 test(s)
Name: TestDataFormatterLibcxxSet
Failed: 0 test(s), Passed: 3 test(s), Total: 3 test(s)
Name: TestDataFormatterLibcxxString
Failed: 0 test(s), Passed: 3 test(s), Total: 3 test(s)
Name: TestDataFormatterLibcxxVBool
Failed: 0 test(s), Passed: 3 test(s), Total: 3 test(s)
Name: TestDataFormatterLibcxxVector
Failed: 0 test(s), Passed: 3 test(s), Total: 3 test(s)
Name: TestDataFormatterNSIndexPath
Failed: 0 test(s), Passed: 3 test(s), Total: 3 test(s)
Name: TestDataFormatterNSString
Failed: 0 test(s), Passed: 9 test(s), Total: 9 test(s)
Name: TestDataFormatterNamedSummaries
Failed: 0 test(s), Passed: 3 test(s), Total: 3 test(s)
Name: TestDataFormatterObjC
Failed: 0 test(s), Passed: 36 test(s), Total: 36 test(s)
Name: TestDataFormatterPythonSynth
Failed: 0 test(s), Passed: 6 test(s), Total: 6 test(s)
Name: TestDataFormatterRefPtrRecursion
Failed: 0 test(s), Passed: 3 test(s), Total: 3 test(s)
Name: TestDataFormatterScript
Failed: 0 test(s), Passed: 3 test(s), Total: 3 test(s)
Name: TestDataFormatterSkipSummary
Failed: 0 test(s), Passed: 3 test(s), Total: 3 test(s)
Name: TestDataFormatterSmartArray
Failed: 0 test(s), Passed: 3 test(s), Total: 3 test(s)
Name: TestDataFormatterStdIterator
Failed: 0 test(s), Passed: 3 test(s), Total: 3 test(s)
Name: TestDataFormatterStdList
Failed: 0 test(s), Passed: 3 test(s), Total: 3 test(s)
Name: TestDataFormatterStdMap
Failed: 0 test(s), Passed: 3 test(s), Total: 3 test(s)
Name: TestDataFormatterStdSmartPtr
Failed: 0 test(s), Passed: 0 test(s), Total: 3 test(s)
Name: TestDataFormatterStdString
Failed: 0 test(s), Passed: 3 test(s), Total: 3 test(s)
Name: TestDataFormatterStdTuple
Failed: 0 test(s), Passed: 0 test(s), Total: 3 test(s)
Name: TestDataFormatterStdUniquePtr
Failed: 0 test(s), Passed: 0 test(s), Total: 6 test(s)
Name: TestDataFormatterStdVBool
Failed: 0 test(s), Passed: 0 test(s), Total: 3 test(s)
Name: TestDataFormatterStdVector
Failed: 0 test(s), Passed: 3 test(s), Total: 3 test(s)
Name: TestDataFormatterSynth
Failed: 0 test(s), Passed: 3 test(s), Total: 3 test(s)
Name: TestDataFormatterSynthType
Failed: 0 test(s), Passed: 3 test(s), Total: 3 test(s)
Name: TestDataFormatterSynthVal
Failed: 0 test(s), Passed: 3 test(s), Total: 3 test(s)
Name: TestDataFormatterUnordered
Failed: 0 test(s), Passed: 3 test(s), Total: 3 test(s)
Name: TestDataFormatterVarScriptFormatting
Failed: 0 test(s), Passed: 3 test(s), Total: 3 test(s)
Name: TestDeadStrip
Failed: 0 test(s), Passed: 3 test(s), Total: 3 test(s)
Name: TestDebugBreak
Failed: 0 test(s), Passed: 1 test(s), Total: 1 test(s)
Name: TestDebuggerAPI
Failed: 0 test(s), Passed: 4 test(s), Total: 4 test(s)
Name: TestDeepBundle
Failed: 0 test(s), Passed: 3 test(s), Total: 3 test(s)
Name: TestDefaultCacheLineSize
Failed: 0 test(s), Passed: 0 test(s), Total: 3 test(s)
Name: TestDefaultConstructorForAPIObjects
Failed: 0 test(s), Passed: 36 test(s), Total: 36 test(s)
Name: TestDefiningOverloadedFunctions
Failed: 0 test(s), Passed: 3 test(s), Total: 3 test(s)
Name: TestDiagnoseDereferenceArgument
Failed: 0 test(s), Passed: 0 test(s), Total: 3 test(s)
Name: TestDiagnoseDereferenceFunctionReturn
Failed: 0 test(s), Passed: 0 test(s), Total: 3 test(s)
Name: TestDiagnoseDereferenceThis
Failed: 0 test(s), Passed: 0 test(s), Total: 3 test(s)
Name: TestDiagnoseDereferenceVirtualMethodCall
Failed: 0 test(s), Passed: 0 test(s), Total: 3 test(s)
Name: TestDiagnoseInheritance
Failed: 0 test(s), Passed: 0 test(s), Total: 3 test(s)
Name: TestDiamond
Failed: 0 test(s), Passed: 3 test(s), Total: 3 test(s)
Name: TestDisasmAPI
Failed: 0 test(s), Passed: 3 test(s), Total: 3 test(s)
Name: TestDisassembleBreakpoint
Failed: 0 test(s), Passed: 3 test(s), Total: 3 test(s)
Name: TestDisassembleRawData
Failed: 0 test(s), Passed: 1 test(s), Total: 1 test(s)
Name: TestDisassemble_VST1_64
Failed: 0 test(s), Passed: 0 test(s), Total: 1 test(s)
Name: TestDisassembly
Failed: 0 test(s), Passed: 0 test(s), Total: 2 test(s)
Name: TestDoAttachThenDisassembly
Failed: 0 test(s), Passed: 0 test(s), Total: 1 test(s)
Name: TestDynamicValue
Failed: 0 test(s), Passed: 3 test(s), Total: 3 test(s)
Name: TestDynamicValueChildCount
Failed: 0 test(s), Passed: 3 test(s), Total: 3 test(s)
Name: TestEhFrameUnwind
Failed: 0 test(s), Passed: 0 test(s), Total: 3 test(s)
Name: TestEmulations
Failed: 0 test(s), Passed: 2 test(s), Total: 2 test(s)
Name: TestEnumTypes
Failed: 0 test(s), Passed: 3 test(s), Total: 3 test(s)
Name: TestEnumVariables
Failed: 0 test(s), Passed: 3 test(s), Total: 3 test(s)
Name: TestEqualityOperators
Failed: 0 test(s), Passed: 9 test(s), Total: 9 test(s)
Name: TestEvents
Failed: 0 test(s), Passed: 9 test(s), Total: 9 test(s)
Name: TestExclusivitySuppression
Failed: 0 test(s), Passed: 6 test(s), Total: 6 test(s)
Name: TestExclusivityViolation
Failed: 0 test(s), Passed: 3 test(s), Total: 3 test(s)
Name: TestExec
Failed: 0 test(s), Passed: 3 test(s), Total: 3 test(s)
Name: TestExitDuringBreak
Failed: 0 test(s), Passed: 3 test(s), Total: 3 test(s)
Name: TestExitDuringStep
Failed: 0 test(s), Passed: 9 test(s), Total: 9 test(s)
Name: TestExprDoesntBlock
Failed: 0 test(s), Passed: 3 test(s), Total: 3 test(s)
Name: TestExprHelpExamples
Failed: 0 test(s), Passed: 3 test(s), Total: 3 test(s)
Name: TestExprInProtocolExtension
Failed: 0 test(s), Passed: 3 test(s), Total: 3 test(s)
Name: TestExprOptions
Failed: 0 test(s), Passed: 3 test(s), Total: 3 test(s)
Name: TestExpressionAccessControl
Failed: 0 test(s), Passed: 3 test(s), Total: 3 test(s)
Name: TestExpressionCmd
Failed: 0 test(s), Passed: 0 test(s), Total: 3 test(s)
Name: TestExpressionErrorBreakpoint
Failed: 0 test(s), Passed: 12 test(s), Total: 12 test(s)
Name: TestExpressionErrors
Failed: 0 test(s), Passed: 6 test(s), Total: 6 test(s)
Name: TestExpressionInSyscall
Failed: 0 test(s), Passed: 3 test(s), Total: 3 test(s)
Name: TestExpressionScopes
Failed: 0 test(s), Passed: 3 test(s), Total: 3 test(s)
Name: TestExpressions
Failed: 0 test(s), Passed: 0 test(s), Total: 3 test(s)
Name: TestExprs
Failed: 0 test(s), Passed: 12 test(s), Total: 12 test(s)
Name: TestExprs2
Failed: 0 test(s), Passed: 3 test(s), Total: 3 test(s)
Name: TestExprsChar
Failed: 0 test(s), Passed: 9 test(s), Total: 9 test(s)
Name: TestFatArchives
Failed: 0 test(s), Passed: 1 test(s), Total: 1 test(s)
Name: TestFdLeak
Failed: 0 test(s), Passed: 3 test(s), Total: 3 test(s)
Name: TestFilePrivate
Failed: 0 test(s), Passed: 3 test(s), Total: 3 test(s)
Name: TestFindStructTypes
Failed: 0 test(s), Passed: 1 test(s), Total: 1 test(s)
Name: TestFixIts
Failed: 0 test(s), Passed: 6 test(s), Total: 6 test(s)
Name: TestFloatTypes
Failed: 0 test(s), Passed: 12 test(s), Total: 12 test(s)
Name: TestFloatTypesExpr
Failed: 0 test(s), Passed: 12 test(s), Total: 12 test(s)
Name: TestFormatPropagation
Failed: 0 test(s), Passed: 3 test(s), Total: 3 test(s)
Name: TestFormats
Failed: 0 test(s), Passed: 3 test(s), Total: 3 test(s)
Name: TestFormatters
Failed: 0 test(s), Passed: 3 test(s), Total: 3 test(s)
Name: TestFormattersBoolRefPtr
Failed: 0 test(s), Passed: 3 test(s), Total: 3 test(s)
Name: TestFormattersOneIsSingular
Failed: 0 test(s), Passed: 3 test(s), Total: 3 test(s)
Name: TestFormattersOsType
Failed: 0 test(s), Passed: 3 test(s), Total: 3 test(s)
Name: TestFormattersSBAPI
Failed: 0 test(s), Passed: 6 test(s), Total: 6 test(s)
Name: TestForwardDecl
Failed: 0 test(s), Passed: 3 test(s), Total: 3 test(s)
Name: TestForwardDeclaration
Failed: 0 test(s), Passed: 3 test(s), Total: 3 test(s)
Name: TestFoundationDisassembly
Failed: 0 test(s), Passed: 3 test(s), Total: 6 test(s)
Name: TestFrameDisassemble
Failed: 0 test(s), Passed: 1 test(s), Total: 1 test(s)
Name: TestFrameFormatSmallStruct
Failed: 0 test(s), Passed: 3 test(s), Total: 3 test(s)
Name: TestFrameUtils
Failed: 0 test(s), Passed: 3 test(s), Total: 3 test(s)
Name: TestFrameVar
Failed: 0 test(s), Passed: 1 test(s), Total: 1 test(s)
Name: TestFrameVariableAnonymousUnions
Failed: 0 test(s), Passed: 3 test(s), Total: 3 test(s)
Name: TestFrameVariableResponse
Failed: 0 test(s), Passed: 0 test(s), Total: 1 test(s)
Name: TestFrames
Failed: 0 test(s), Passed: 9 test(s), Total: 9 test(s)
Name: TestFunctionTypes
Failed: 0 test(s), Passed: 6 test(s), Total: 6 test(s)
Name: TestFunctionVariables
Failed: 0 test(s), Passed: 3 test(s), Total: 3 test(s)
Name: TestGCore
Failed: 0 test(s), Passed: 2 test(s), Total: 2 test(s)
Name: TestGdbRemoteAbort
Failed: 0 test(s), Passed: 1 test(s), Total: 2 test(s)
Name: TestGdbRemoteAttach
Failed: 0 test(s), Passed: 1 test(s), Total: 2 test(s)
Name: TestGdbRemoteAuxvSupport
Failed: 0 test(s), Passed: 0 test(s), Total: 7 test(s)
Name: TestGdbRemoteExitCode
Failed: 0 test(s), Passed: 3 test(s), Total: 6 test(s)
Name: TestGdbRemoteExpeditedRegisters
Failed: 0 test(s), Passed: 5 test(s), Total: 10 test(s)
Name: TestGdbRemoteHostInfo
Failed: 0 test(s), Passed: 2 test(s), Total: 4 test(s)
Name: TestGdbRemoteKill
Failed: 0 test(s), Passed: 1 test(s), Total: 2 test(s)
Name: TestGdbRemoteModuleInfo
Failed: 0 test(s), Passed: 0 test(s), Total: 1 test(s)
Name: TestGdbRemoteProcessInfo
Failed: 0 test(s), Passed: 5 test(s), Total: 12 test(s)
Name: TestGdbRemoteRegisterState
Failed: 0 test(s), Passed: 2 test(s), Total: 4 test(s)
Name: TestGdbRemoteSegFault
Failed: 0 test(s), Passed: 1 test(s), Total: 2 test(s)
Name: TestGdbRemoteSingleStep
Failed: 0 test(s), Passed: 1 test(s), Total: 2 test(s)
Name: TestGdbRemoteThreadName
Failed: 0 test(s), Passed: 0 test(s), Total: 1 test(s)
Name: TestGdbRemoteThreadsInStopReply
Failed: 0 test(s), Passed: 5 test(s), Total: 10 test(s)
Name: TestGdbRemote_QPassSignals
Failed: 0 test(s), Passed: 0 test(s), Total: 4 test(s)
Name: TestGdbRemote_qThreadStopInfo
Failed: 0 test(s), Passed: 2 test(s), Total: 6 test(s)
Name: TestGdbRemote_vCont
Failed: 0 test(s), Passed: 6 test(s), Total: 12 test(s)
Name: TestGetVariables
Failed: 0 test(s), Passed: 3 test(s), Total: 3 test(s)
Name: TestGlobalObjects
Failed: 0 test(s), Passed: 3 test(s), Total: 3 test(s)
Name: TestGlobalVariables
Failed: 0 test(s), Passed: 3 test(s), Total: 3 test(s)
Name: TestGoASTContext
Failed: 0 test(s), Passed: 0 test(s), Total: 1 test(s)
Name: TestGoFormatters
Failed: 0 test(s), Passed: 0 test(s), Total: 1 test(s)
Name: TestGoroutines
Failed: 0 test(s), Passed: 0 test(s), Total: 1 test(s)
Name: TestGuessLanguage
Failed: 0 test(s), Passed: 1 test(s), Total: 1 test(s)
Name: TestHWBreakMultiThread
Failed: 0 test(s), Passed: 0 test(s), Total: 2 test(s)
Name: TestHandleSegv
Failed: 0 test(s), Passed: 0 test(s), Total: 3 test(s)
Name: TestHelloWorld
Failed: 0 test(s), Passed: 9 test(s), Total: 9 test(s)
Name: TestHelp
Failed: 0 test(s), Passed: 18 test(s), Total: 18 test(s)
Name: TestHiddenIvars
Failed: 0 test(s), Passed: 11 test(s), Total: 15 test(s)
Name: TestHistoryRecall
Failed: 0 test(s), Passed: 1 test(s), Total: 1 test(s)
Name: TestIRInterpreter
Failed: 0 test(s), Passed: 3 test(s), Total: 3 test(s)
Name: TestIRInterpreterPHINodes
Failed: 0 test(s), Passed: 3 test(s), Total: 3 test(s)
Name: TestImageListMultiArchitecture
Failed: 0 test(s), Passed: 1 test(s), Total: 1 test(s)
Name: TestImport
Failed: 0 test(s), Passed: 1 test(s), Total: 1 test(s)
Name: TestInOutVariables
Failed: 0 test(s), Passed: 3 test(s), Total: 3 test(s)
Name: TestIncompleteModules
Failed: 0 test(s), Passed: 3 test(s), Total: 3 test(s)
Name: TestIndexVariable
Failed: 0 test(s), Passed: 3 test(s), Total: 3 test(s)
Name: TestIndirectEnumVariables
Failed: 0 test(s), Passed: 6 test(s), Total: 6 test(s)
Name: TestIndirectSymbols
Failed: 0 test(s), Passed: 3 test(s), Total: 3 test(s)
Name: TestInferiorAssert
Failed: 0 test(s), Passed: 18 test(s), Total: 18 test(s)
Name: TestInferiorChanged
Failed: 0 test(s), Passed: 1 test(s), Total: 1 test(s)
Name: TestInferiorCrashing
Failed: 0 test(s), Passed: 21 test(s), Total: 21 test(s)
Name: TestInitializerList
Failed: 0 test(s), Passed: 3 test(s), Total: 3 test(s)
Name: TestInlineStepping
Failed: 0 test(s), Passed: 9 test(s), Total: 9 test(s)
Name: TestInlinedBreakpoints
Failed: 0 test(s), Passed: 3 test(s), Total: 3 test(s)
Name: TestInlinedFrame
Failed: 0 test(s), Passed: 3 test(s), Total: 3 test(s)
Name: TestInlines
Failed: 0 test(s), Passed: 3 test(s), Total: 3 test(s)
Name: TestIntegerTypes
Failed: 0 test(s), Passed: 60 test(s), Total: 60 test(s)
Name: TestIntegerTypesExpr
Failed: 0 test(s), Passed: 60 test(s), Total: 60 test(s)
Name: TestInterruptThreadNames
Failed: 0 test(s), Passed: 3 test(s), Total: 3 test(s)
Name: TestJITLoaderGDB
Failed: 0 test(s), Passed: 0 test(s), Total: 3 test(s)
Name: TestLLDBIterator
Failed: 0 test(s), Passed: 9 test(s), Total: 9 test(s)
Name: TestLaunchWithShellExpand
Failed: 0 test(s), Passed: 3 test(s), Total: 3 test(s)
Name: TestLazyReverse
Failed: 0 test(s), Passed: 1 test(s), Total: 1 test(s)
Name: TestLibCxxAtomic
Failed: 0 test(s), Passed: 3 test(s), Total: 3 test(s)
Name: TestLibCxxFunction
Failed: 0 test(s), Passed: 3 test(s), Total: 3 test(s)
Name: TestLinuxCore
Failed: 0 test(s), Passed: 9 test(s), Total: 9 test(s)
Name: TestLinuxCoreThreads
Failed: 0 test(s), Passed: 2 test(s), Total: 2 test(s)
Name: TestListener
Failed: 0 test(s), Passed: 3 test(s), Total: 3 test(s)
Name: TestLldbGdbServer
Failed: 0 test(s), Passed: 32 test(s), Total: 65 test(s)
Name: TestLoadUnload
Failed: 0 test(s), Passed: 18 test(s), Total: 18 test(s)
Name: TestLocalVariable
Failed: 0 test(s), Passed: 0 test(s), Total: 3 test(s)
Name: TestLogging
Failed: 0 test(s), Passed: 5 test(s), Total: 5 test(s)
Name: TestLongjmp
Failed: 0 test(s), Passed: 0 test(s), Total: 9 test(s)
Name: TestMPXRegisters
Failed: 0 test(s), Passed: 0 test(s), Total: 3 test(s)
Name: TestMTCSimple
Failed: 0 test(s), Passed: 3 test(s), Total: 3 test(s)
Name: TestMTCSwift
Failed: 0 test(s), Passed: 3 test(s), Total: 3 test(s)
Name: TestMTCSwiftProperty
Failed: 0 test(s), Passed: 3 test(s), Total: 3 test(s)
Name: TestMacros
Failed: 0 test(s), Passed: 3 test(s), Total: 3 test(s)
Name: TestMembersAndLocalsWithSameName
Failed: 0 test(s), Passed: 6 test(s), Total: 6 test(s)
Name: TestMemoryCache
Failed: 0 test(s), Passed: 3 test(s), Total: 3 test(s)
Name: TestMemoryFind
Failed: 0 test(s), Passed: 3 test(s), Total: 3 test(s)
Name: TestMemoryHistory
Failed: 0 test(s), Passed: 3 test(s), Total: 3 test(s)
Name: TestMemoryRead
Failed: 0 test(s), Passed: 3 test(s), Total: 3 test(s)
Name: TestMiBreak
Failed: 0 test(s), Passed: 7 test(s), Total: 7 test(s)
Name: TestMiCliSupport
Failed: 0 test(s), Passed: 8 test(s), Total: 8 test(s)
Name: TestMiData
Failed: 0 test(s), Passed: 6 test(s), Total: 7 test(s)
Name: TestMiEnvironmentCd
Failed: 0 test(s), Passed: 0 test(s), Total: 1 test(s)
Name: TestMiExec
Failed: 0 test(s), Passed: 9 test(s), Total: 9 test(s)
Name: TestMiExit
Failed: 0 test(s), Passed: 3 test(s), Total: 3 test(s)
Name: TestMiFile
Failed: 0 test(s), Passed: 4 test(s), Total: 4 test(s)
Name: TestMiGdbSetShow
Failed: 0 test(s), Passed: 9 test(s), Total: 9 test(s)
Name: TestMiGdbSetShowPrint
Failed: 0 test(s), Passed: 3 test(s), Total: 3 test(s)
Name: TestMiInterpreterExec
Failed: 0 test(s), Passed: 8 test(s), Total: 8 test(s)
Name: TestMiLexicalScope
Failed: 0 test(s), Passed: 1 test(s), Total: 1 test(s)
Name: TestMiLibraryLoaded
Failed: 0 test(s), Passed: 1 test(s), Total: 1 test(s)
Name: TestMiPrompt
Failed: 0 test(s), Passed: 1 test(s), Total: 1 test(s)
Name: TestMiSignal
Failed: 0 test(s), Passed: 5 test(s), Total: 5 test(s)
Name: TestMiStack
Failed: 0 test(s), Passed: 7 test(s), Total: 7 test(s)
Name: TestMiStartupOptions
Failed: 0 test(s), Passed: 10 test(s), Total: 10 test(s)
Name: TestMiSymbol
Failed: 0 test(s), Passed: 1 test(s), Total: 1 test(s)
Name: TestMiSyntax
Failed: 0 test(s), Passed: 4 test(s), Total: 4 test(s)
Name: TestMiTarget
Failed: 0 test(s), Passed: 3 test(s), Total: 3 test(s)
Name: TestMiThreadInfo
Failed: 0 test(s), Passed: 1 test(s), Total: 1 test(s)
Name: TestMiVar
Failed: 0 test(s), Passed: 5 test(s), Total: 6 test(s)
Name: TestMiniDump
Failed: 0 test(s), Passed: 3 test(s), Total: 5 test(s)
Name: TestMiniDumpNew
Failed: 0 test(s), Passed: 8 test(s), Total: 8 test(s)
Name: TestMixedLanguages
Failed: 0 test(s), Passed: 3 test(s), Total: 3 test(s)
Name: TestModuleAndSection
Failed: 0 test(s), Passed: 9 test(s), Total: 9 test(s)
Name: TestModulesAutoImport
Failed: 0 test(s), Passed: 3 test(s), Total: 3 test(s)
Name: TestModulesInlineFunctions
Failed: 0 test(s), Passed: 3 test(s), Total: 3 test(s)
Name: TestMoveNearest
Failed: 0 test(s), Passed: 1 test(s), Total: 1 test(s)
Name: TestMultilangFormatterCategories
Failed: 0 test(s), Passed: 3 test(s), Total: 3 test(s)
Name: TestMultilevelArrays
Failed: 0 test(s), Passed: 1 test(s), Total: 1 test(s)
Name: TestMultilineExpressions
Failed: 0 test(s), Passed: 2 test(s), Total: 2 test(s)
Name: TestMultipleBreakpoints
Failed: 0 test(s), Passed: 3 test(s), Total: 3 test(s)
Name: TestMultipleDebuggers
Failed: 0 test(s), Passed: 3 test(s), Total: 3 test(s)
Name: TestMultipleDebuggersCommands
Failed: 0 test(s), Passed: 1 test(s), Total: 1 test(s)
Name: TestMultipleHits
Failed: 0 test(s), Passed: 1 test(s), Total: 1 test(s)
Name: TestMultipleTargets
Failed: 0 test(s), Passed: 1 test(s), Total: 1 test(s)
Name: TestMultithreaded
Failed: 0 test(s), Passed: 0 test(s), Total: 12 test(s)
Name: TestMyFirstWatchpoint
Failed: 0 test(s), Passed: 3 test(s), Total: 3 test(s)
Name: TestNSArraySynthetic
Failed: 0 test(s), Passed: 3 test(s), Total: 3 test(s)
Name: TestNSDictionarySynthetic
Failed: 0 test(s), Passed: 3 test(s), Total: 3 test(s)
Name: TestNSError
Failed: 0 test(s), Passed: 3 test(s), Total: 3 test(s)
Name: TestNSObjectSubclass
Failed: 0 test(s), Passed: 1 test(s), Total: 1 test(s)
Name: TestNSSetSynthetic
Failed: 0 test(s), Passed: 3 test(s), Total: 3 test(s)
Name: TestNameLookup
Failed: 0 test(s), Passed: 3 test(s), Total: 3 test(s)
Name: TestNamespace
Failed: 0 test(s), Passed: 12 test(s), Total: 12 test(s)
Name: TestNamespaceDefinitions
Failed: 0 test(s), Passed: 3 test(s), Total: 3 test(s)
Name: TestNamespaceLookup
Failed: 0 test(s), Passed: 24 test(s), Total: 24 test(s)
Name: TestNestedAlias
Failed: 0 test(s), Passed: 3 test(s), Total: 3 test(s)
Name: TestNestedPersistentTypes
Failed: 0 test(s), Passed: 3 test(s), Total: 3 test(s)
Name: TestNoReturnModuleEnd
Failed: 0 test(s), Passed: 1 test(s), Total: 1 test(s)
Name: TestNoSuchArch
Failed: 0 test(s), Passed: 3 test(s), Total: 3 test(s)
Name: TestNoreturnUnwind
Failed: 0 test(s), Passed: 3 test(s), Total: 3 test(s)
Name: TestNumThreads
Failed: 0 test(s), Passed: 0 test(s), Total: 6 test(s)
Name: TestObjCBaseClassSBType
Failed: 0 test(s), Passed: 3 test(s), Total: 3 test(s)
Name: TestObjCBreakpoints
Failed: 0 test(s), Passed: 3 test(s), Total: 3 test(s)
Name: TestObjCBuiltinTypes
Failed: 0 test(s), Passed: 3 test(s), Total: 3 test(s)
Name: TestObjCCheckers
Failed: 0 test(s), Passed: 3 test(s), Total: 3 test(s)
Name: TestObjCClassMethod
Failed: 0 test(s), Passed: 3 test(s), Total: 3 test(s)
Name: TestObjCDynamicSBType
Failed: 0 test(s), Passed: 3 test(s), Total: 3 test(s)
Name: TestObjCDynamicValue
Failed: 0 test(s), Passed: 3 test(s), Total: 3 test(s)
Name: TestObjCImportedTypes
Failed: 0 test(s), Passed: 3 test(s), Total: 3 test(s)
Name: TestObjCIvarDiscovery
Failed: 0 test(s), Passed: 4 test(s), Total: 4 test(s)
Name: TestObjCIvarOffsets
Failed: 0 test(s), Passed: 3 test(s), Total: 3 test(s)
Name: TestObjCIvarStripped
Failed: 0 test(s), Passed: 1 test(s), Total: 3 test(s)
Name: TestObjCIvarsInBlocks
Failed: 0 test(s), Passed: 3 test(s), Total: 3 test(s)
Name: TestObjCMethodReturningBOOL
Failed: 0 test(s), Passed: 3 test(s), Total: 3 test(s)
Name: TestObjCMethods
Failed: 0 test(s), Passed: 12 test(s), Total: 12 test(s)
Name: TestObjCMethods2
Failed: 0 test(s), Passed: 18 test(s), Total: 18 test(s)
Name: TestObjCModules
Failed: 0 test(s), Passed: 3 test(s), Total: 3 test(s)
Name: TestObjCNewSyntax
Failed: 0 test(s), Passed: 30 test(s), Total: 30 test(s)
Name: TestObjCProperty
Failed: 0 test(s), Passed: 3 test(s), Total: 3 test(s)
Name: TestObjCSelf
Failed: 0 test(s), Passed: 3 test(s), Total: 3 test(s)
Name: TestObjCSingleEntryDictionary
Failed: 0 test(s), Passed: 3 test(s), Total: 3 test(s)
Name: TestObjCStaticMethod
Failed: 0 test(s), Passed: 3 test(s), Total: 3 test(s)
Name: TestObjCStaticMethodStripped
Failed: 0 test(s), Passed: 1 test(s), Total: 3 test(s)
Name: TestObjCStepping
Failed: 0 test(s), Passed: 3 test(s), Total: 3 test(s)
Name: TestObjCStructArgument
Failed: 0 test(s), Passed: 3 test(s), Total: 3 test(s)
Name: TestObjCStructReturn
Failed: 0 test(s), Passed: 3 test(s), Total: 3 test(s)
Name: TestObjCSuper
Failed: 0 test(s), Passed: 3 test(s), Total: 3 test(s)
Name: TestObjCType
Failed: 0 test(s), Passed: 3 test(s), Total: 3 test(s)
Name: TestObjCTypeQueryFromOtherCompileUnit
Failed: 0 test(s), Passed: 3 test(s), Total: 3 test(s)
Name: TestObjCXX
Failed: 0 test(s), Passed: 3 test(s), Total: 3 test(s)
Name: TestObjCiVarIMP
Failed: 0 test(s), Passed: 1 test(s), Total: 1 test(s)
Name: TestObjcInference
Failed: 0 test(s), Passed: 3 test(s), Total: 3 test(s)
Name: TestObjcOptimized
Failed: 0 test(s), Passed: 3 test(s), Total: 3 test(s)
Name: TestObjectDescriptionAPI
Failed: 0 test(s), Passed: 3 test(s), Total: 3 test(s)
Name: TestOrderFile
Failed: 0 test(s), Passed: 3 test(s), Total: 3 test(s)
Name: TestOverloadedFunctions
Failed: 0 test(s), Passed: 3 test(s), Total: 3 test(s)
Name: TestPOUnwrapping
Failed: 0 test(s), Passed: 1 test(s), Total: 1 test(s)
Name: TestPaths
Failed: 0 test(s), Passed: 2 test(s), Total: 3 test(s)
Name: TestPersistObjCPointeeType
Failed: 0 test(s), Passed: 3 test(s), Total: 3 test(s)
Name: TestPersistentPtrUpdate
Failed: 0 test(s), Passed: 3 test(s), Total: 3 test(s)
Name: TestPersistentTypes
Failed: 0 test(s), Passed: 3 test(s), Total: 3 test(s)
Name: TestPersistentVariables
Failed: 0 test(s), Passed: 3 test(s), Total: 3 test(s)
Name: TestPlatformCommand
Failed: 0 test(s), Passed: 7 test(s), Total: 8 test(s)
Name: TestPlatformProcessConnect
Failed: 0 test(s), Passed: 0 test(s), Total: 1 test(s)
Name: TestPlaygrounds
Failed: 0 test(s), Passed: 1 test(s), Total: 3 test(s)
Name: TestPluginCommands
Failed: 0 test(s), Passed: 1 test(s), Total: 1 test(s)
Name: TestPoVerbosity
Failed: 0 test(s), Passed: 3 test(s), Total: 3 test(s)
Name: TestPreRunDylibs
Failed: 0 test(s), Passed: 1 test(s), Total: 1 test(s)
Name: TestPrintArray
Failed: 0 test(s), Passed: 3 test(s), Total: 3 test(s)
Name: TestPrintObj
Failed: 0 test(s), Passed: 3 test(s), Total: 3 test(s)
Name: TestPrintObjectArray
Failed: 0 test(s), Passed: 3 test(s), Total: 3 test(s)
Name: TestPrintStackTraces
Failed: 0 test(s), Passed: 3 test(s), Total: 3 test(s)
Name: TestPrintfAfterUp
Failed: 0 test(s), Passed: 3 test(s), Total: 3 test(s)
Name: TestProcessAPI
Failed: 0 test(s), Passed: 15 test(s), Total: 15 test(s)
Name: TestProcessAttach
Failed: 0 test(s), Passed: 3 test(s), Total: 3 test(s)
Name: TestProcessIO
Failed: 0 test(s), Passed: 15 test(s), Total: 15 test(s)
Name: TestProcessLaunch
Failed: 0 test(s), Passed: 9 test(s), Total: 9 test(s)
Name: TestProcessSaveCore
Failed: 0 test(s), Passed: 0 test(s), Total: 6 test(s)
Name: TestPtrRef2Typedef
Failed: 0 test(s), Passed: 3 test(s), Total: 3 test(s)
Name: TestPtrRefs
Failed: 0 test(s), Passed: 3 test(s), Total: 3 test(s)
Name: TestPtrRefsObjC
Failed: 0 test(s), Passed: 3 test(s), Total: 3 test(s)
Name: TestPtrToArrayFormatting
Failed: 0 test(s), Passed: 3 test(s), Total: 3 test(s)
Name: TestPublicAPIHeaders
Failed: 0 test(s), Passed: 3 test(s), Total: 3 test(s)
Name: TestPyObjSynthProvider
Failed: 0 test(s), Passed: 1 test(s), Total: 1 test(s)
Name: TestPythonOSPlugin
Failed: 0 test(s), Passed: 3 test(s), Total: 3 test(s)
Name: TestQueues
Failed: 0 test(s), Passed: 3 test(s), Total: 3 test(s)
Name: TestQuoting
Failed: 0 test(s), Passed: 11 test(s), Total: 11 test(s)
Name: TestREPLBreakpoints
Failed: 0 test(s), Passed: 1 test(s), Total: 1 test(s)
Name: TestREPLClasses
Failed: 0 test(s), Passed: 1 test(s), Total: 1 test(s)
Name: TestREPLClosure
Failed: 0 test(s), Passed: 1 test(s), Total: 1 test(s)
Name: TestREPLDictionary
Failed: 0 test(s), Passed: 1 test(s), Total: 1 test(s)
Name: TestREPLDynamicType
Failed: 0 test(s), Passed: 1 test(s), Total: 1 test(s)
Name: TestREPLFunctionDefinition
Failed: 0 test(s), Passed: 1 test(s), Total: 1 test(s)
Name: TestREPLIntVars
Failed: 0 test(s), Passed: 1 test(s), Total: 1 test(s)
Name: TestREPLNSString
Failed: 0 test(s), Passed: 1 test(s), Total: 1 test(s)
Name: TestREPLQuickLookObject
Failed: 0 test(s), Passed: 1 test(s), Total: 1 test(s)
Name: TestREPLRecursiveClass
Failed: 0 test(s), Passed: 1 test(s), Total: 1 test(s)
Name: TestREPLStructs
Failed: 0 test(s), Passed: 1 test(s), Total: 1 test(s)
Name: TestREPLTypeLookup
Failed: 0 test(s), Passed: 1 test(s), Total: 1 test(s)
Name: TestRaise
Failed: 0 test(s), Passed: 3 test(s), Total: 4 test(s)
Name: TestRdar10967107
Failed: 0 test(s), Passed: 3 test(s), Total: 3 test(s)
Name: TestRdar11355592
Failed: 0 test(s), Passed: 3 test(s), Total: 3 test(s)
Name: TestRdar12408181
Failed: 0 test(s), Passed: 0 test(s), Total: 3 test(s)
Name: TestRdar12586188
Failed: 0 test(s), Passed: 1 test(s), Total: 1 test(s)
Name: TestRealDefinition
Failed: 0 test(s), Passed: 6 test(s), Total: 6 test(s)
Name: TestRecursiveInferior
Failed: 0 test(s), Passed: 21 test(s), Total: 21 test(s)
Name: TestRecursiveTypes
Failed: 0 test(s), Passed: 6 test(s), Total: 6 test(s)
Name: TestRegexpBreakCommand
Failed: 0 test(s), Passed: 3 test(s), Total: 3 test(s)
Name: TestRegisterVariables
Failed: 0 test(s), Passed: 3 test(s), Total: 3 test(s)
Name: TestRegisters
Failed: 0 test(s), Passed: 7 test(s), Total: 7 test(s)
Name: TestRegistersIterator
Failed: 0 test(s), Passed: 3 test(s), Total: 3 test(s)
Name: TestRepeatedExprs
Failed: 0 test(s), Passed: 0 test(s), Total: 3 test(s)
Name: TestReportData
Failed: 0 test(s), Passed: 3 test(s), Total: 3 test(s)
Name: TestRerun
Failed: 0 test(s), Passed: 3 test(s), Total: 3 test(s)
Name: TestResilience
Failed: 0 test(s), Passed: 3 test(s), Total: 3 test(s)
Name: TestReturnValue
Failed: 0 test(s), Passed: 6 test(s), Total: 6 test(s)
Name: TestRuntimeTypes
Failed: 0 test(s), Passed: 3 test(s), Total: 3 test(s)
Name: TestRvalueReferences
Failed: 0 test(s), Passed: 3 test(s), Total: 3 test(s)
Name: TestSBData
Failed: 0 test(s), Passed: 6 test(s), Total: 6 test(s)
Name: TestSBFrameFindValue
Failed: 0 test(s), Passed: 3 test(s), Total: 3 test(s)
Name: TestSBTypeClassMembers
Failed: 0 test(s), Passed: 3 test(s), Total: 3 test(s)
Name: TestSBValuePersist
Failed: 0 test(s), Passed: 3 test(s), Total: 3 test(s)
Name: TestSBValueUpdates
Failed: 0 test(s), Passed: 3 test(s), Total: 3 test(s)
Name: TestSTL
Failed: 0 test(s), Passed: 6 test(s), Total: 6 test(s)
Name: TestSTTYBeforeAndAfter
Failed: 0 test(s), Passed: 1 test(s), Total: 1 test(s)
Name: TestSafeFuncCalls
Failed: 0 test(s), Passed: 3 test(s), Total: 3 test(s)
Name: TestSampleTest
Failed: 0 test(s), Passed: 1 test(s), Total: 1 test(s)
Name: TestSaveJITObjects
Failed: 0 test(s), Passed: 3 test(s), Total: 3 test(s)
Name: TestSectionAPI
Failed: 0 test(s), Passed: 3 test(s), Total: 3 test(s)
Name: TestSendSignal
Failed: 0 test(s), Passed: 3 test(s), Total: 3 test(s)
Name: TestSequenceFunctions
Failed: 0 test(s), Passed: 3 test(s), Total: 3 test(s)
Name: TestSetData
Failed: 0 test(s), Passed: 3 test(s), Total: 3 test(s)
Name: TestSetValues
Failed: 0 test(s), Passed: 3 test(s), Total: 3 test(s)
Name: TestSetWatchlocation
Failed: 0 test(s), Passed: 3 test(s), Total: 3 test(s)
Name: TestSetWatchpoint
Failed: 0 test(s), Passed: 3 test(s), Total: 3 test(s)
Name: TestSettings
Failed: 0 test(s), Passed: 29 test(s), Total: 29 test(s)
Name: TestSharedLib
Failed: 0 test(s), Passed: 9 test(s), Total: 9 test(s)
Name: TestSharedLibStrippedSymbols
Failed: 0 test(s), Passed: 6 test(s), Total: 6 test(s)
Name: TestSignalsAPI
Failed: 0 test(s), Passed: 3 test(s), Total: 3 test(s)
Name: TestSignedTypes
Failed: 0 test(s), Passed: 3 test(s), Total: 3 test(s)
Name: TestSigtrampUnwind
Failed: 0 test(s), Passed: 3 test(s), Total: 3 test(s)
Name: TestSimpleExpressions
Failed: 0 test(s), Passed: 3 test(s), Total: 3 test(s)
Name: TestSingleQuoteInFilename
Failed: 0 test(s), Passed: 1 test(s), Total: 1 test(s)
Name: TestSourceManager
Failed: 0 test(s), Passed: 5 test(s), Total: 5 test(s)
Name: TestSourceRegexBreakpoints
Failed: 0 test(s), Passed: 6 test(s), Total: 6 test(s)
Name: TestStandardUnwind
Failed: 0 test(s), Passed: 0 test(s), Total: 3 test(s)
Name: TestStartupDelays
Failed: 0 test(s), Passed: 0 test(s), Total: 1 test(s)
Name: TestStaticVariables
Failed: 0 test(s), Passed: 6 test(s), Total: 6 test(s)
Name: TestStdCXXDisassembly
Failed: 0 test(s), Passed: 0 test(s), Total: 3 test(s)
Name: TestStepAndBreakpoints
Failed: 0 test(s), Passed: 3 test(s), Total: 3 test(s)
Name: TestStepNoDebug
Failed: 0 test(s), Passed: 9 test(s), Total: 9 test(s)
Name: TestStepOverBreakpoint
Failed: 0 test(s), Passed: 6 test(s), Total: 6 test(s)
Name: TestStepOverWatchpoint
Failed: 0 test(s), Passed: 3 test(s), Total: 3 test(s)
Name: TestStepTarget
Failed: 0 test(s), Passed: 15 test(s), Total: 15 test(s)
Name: TestStepUntil
Failed: 0 test(s), Passed: 12 test(s), Total: 12 test(s)
Name: TestSteppingSpeed
Failed: 0 test(s), Passed: 0 test(s), Total: 1 test(s)
Name: TestStopHookCmd
Failed: 0 test(s), Passed: 4 test(s), Total: 4 test(s)
Name: TestStopHookMechanism
Failed: 0 test(s), Passed: 3 test(s), Total: 3 test(s)
Name: TestStopHookMultipleThreads
Failed: 0 test(s), Passed: 3 test(s), Total: 3 test(s)
Name: TestStructuredDataAPI
Failed: 0 test(s), Passed: 1 test(s), Total: 1 test(s)
Name: TestStubReverseConnect
Failed: 0 test(s), Passed: 1 test(s), Total: 2 test(s)
Name: TestStubSetSID
Failed: 0 test(s), Passed: 3 test(s), Total: 6 test(s)
Name: TestSubmoduleImport
Failed: 0 test(s), Passed: 3 test(s), Total: 3 test(s)
Name: TestSwiftAddressOf
Failed: 0 test(s), Passed: 1 test(s), Total: 1 test(s)
Name: TestSwiftAnyObjectType
Failed: 0 test(s), Passed: 3 test(s), Total: 3 test(s)
Name: TestSwiftAnyType
Failed: 0 test(s), Passed: 3 test(s), Total: 3 test(s)
Name: TestSwiftArchetypeResolution
Failed: 0 test(s), Passed: 3 test(s), Total: 3 test(s)
Name: TestSwiftArrayType
Failed: 0 test(s), Passed: 3 test(s), Total: 3 test(s)
Name: TestSwiftAssociatedTypeResolution
Failed: 0 test(s), Passed: 3 test(s), Total: 3 test(s)
Name: TestSwiftAtObjCIvars
Failed: 0 test(s), Passed: 3 test(s), Total: 3 test(s)
Name: TestSwiftBacktracePrinting
Failed: 0 test(s), Passed: 3 test(s), Total: 3 test(s)
Name: TestSwiftBool
Failed: 0 test(s), Passed: 3 test(s), Total: 3 test(s)
Name: TestSwiftBreakByPartialName
Failed: 0 test(s), Passed: 3 test(s), Total: 3 test(s)
Name: TestSwiftBridgedArray
Failed: 0 test(s), Passed: 3 test(s), Total: 3 test(s)
Name: TestSwiftBridgedMetatype
Failed: 0 test(s), Passed: 3 test(s), Total: 3 test(s)
Name: TestSwiftBridgedStringVariables
Failed: 0 test(s), Passed: 3 test(s), Total: 3 test(s)
Name: TestSwiftClassTypes
Failed: 0 test(s), Passed: 3 test(s), Total: 3 test(s)
Name: TestSwiftClosures
Failed: 0 test(s), Passed: 4 test(s), Total: 4 test(s)
Name: TestSwiftConditionalBreakpoint
Failed: 0 test(s), Passed: 3 test(s), Total: 3 test(s)
Name: TestSwiftCrossModuleExtension
Failed: 0 test(s), Passed: 3 test(s), Total: 3 test(s)
Name: TestSwiftDictionaryNSObjectAnyObject
Failed: 0 test(s), Passed: 3 test(s), Total: 3 test(s)
Name: TestSwiftDifferentClangFlags
Failed: 0 test(s), Passed: 1 test(s), Total: 3 test(s)
Name: TestSwiftDynamicValue
Failed: 0 test(s), Passed: 3 test(s), Total: 3 test(s)
Name: TestSwiftExpressionsInClassFunctions
Failed: 0 test(s), Passed: 3 test(s), Total: 3 test(s)
Name: TestSwiftExpressionsInMethodsFromObjc
Failed: 0 test(s), Passed: 3 test(s), Total: 3 test(s)
Name: TestSwiftExpressionsInMethodsPureSwift
Failed: 0 test(s), Passed: 3 test(s), Total: 3 test(s)
Name: TestSwiftFixIts
Failed: 0 test(s), Passed: 3 test(s), Total: 3 test(s)
Name: TestSwiftGenericEnums
Failed: 0 test(s), Passed: 3 test(s), Total: 3 test(s)
Name: TestSwiftGenericExpressions
Failed: 0 test(s), Passed: 6 test(s), Total: 6 test(s)
Name: TestSwiftGenericTupleLabels
Failed: 0 test(s), Passed: 3 test(s), Total: 3 test(s)
Name: TestSwiftGenericTypes
Failed: 0 test(s), Passed: 3 test(s), Total: 3 test(s)
Name: TestSwiftGenericsResolution
Failed: 0 test(s), Passed: 3 test(s), Total: 3 test(s)
Name: TestSwiftGetValueAsUnsigned
Failed: 0 test(s), Passed: 3 test(s), Total: 3 test(s)
Name: TestSwiftGlobals
Failed: 0 test(s), Passed: 3 test(s), Total: 3 test(s)
Name: TestSwiftHideRuntimeSupport
Failed: 0 test(s), Passed: 3 test(s), Total: 3 test(s)
Name: TestSwiftInstancePointerSetSP
Failed: 0 test(s), Passed: 3 test(s), Total: 3 test(s)
Name: TestSwiftLetInt
Failed: 0 test(s), Passed: 3 test(s), Total: 3 test(s)
Name: TestSwiftMetadataSymbols
Failed: 0 test(s), Passed: 3 test(s), Total: 3 test(s)
Name: TestSwiftMetatype
Failed: 0 test(s), Passed: 3 test(s), Total: 3 test(s)
Name: TestSwiftMixAnyObjectType
Failed: 0 test(s), Passed: 3 test(s), Total: 3 test(s)
Name: TestSwiftModuleSearchPaths
Failed: 0 test(s), Passed: 3 test(s), Total: 3 test(s)
Name: TestSwiftMultipayloadEnum
Failed: 0 test(s), Passed: 3 test(s), Total: 3 test(s)
Name: TestSwiftNestedArray
Failed: 0 test(s), Passed: 3 test(s), Total: 3 test(s)
Name: TestSwiftNoProcess
Failed: 0 test(s), Passed: 6 test(s), Total: 6 test(s)
Name: TestSwiftObjCOptionals
Failed: 0 test(s), Passed: 3 test(s), Total: 3 test(s)
Name: TestSwiftOneCaseEnum
Failed: 0 test(s), Passed: 3 test(s), Total: 3 test(s)
Name: TestSwiftOptionals
Failed: 0 test(s), Passed: 3 test(s), Total: 3 test(s)
Name: TestSwiftPathWithColons
Failed: 0 test(s), Passed: 3 test(s), Total: 3 test(s)
Name: TestSwiftPrivateDeclName
Failed: 0 test(s), Passed: 3 test(s), Total: 3 test(s)
Name: TestSwiftPrivateTypeAlias
Failed: 0 test(s), Passed: 3 test(s), Total: 3 test(s)
Name: TestSwiftProtocolTypes
Failed: 0 test(s), Passed: 3 test(s), Total: 3 test(s)
Name: TestSwiftRangeTypes
Failed: 0 test(s), Passed: 3 test(s), Total: 3 test(s)
Name: TestSwiftReferenceStorageTypes
Failed: 0 test(s), Passed: 3 test(s), Total: 3 test(s)
Name: TestSwiftReturns
Failed: 0 test(s), Passed: 1 test(s), Total: 1 test(s)
Name: TestSwiftStaticLinkingMacOS
Failed: 0 test(s), Passed: 0 test(s), Total: 1 test(s)
Name: TestSwiftStaticStringVariables
Failed: 0 test(s), Passed: 3 test(s), Total: 3 test(s)
Name: TestSwiftStdlibDictionary
Failed: 0 test(s), Passed: 3 test(s), Total: 3 test(s)
Name: TestSwiftStdlibSet
Failed: 0 test(s), Passed: 3 test(s), Total: 3 test(s)
Name: TestSwiftStepping
Failed: 3 test(s), Passed: 0 test(s), Total: 3 test(s)
Failed: TestSwiftStepping.TestSwiftStepping.test_swift_stepping_dsym <https://ci.swift.org/job/oss-lldb-incremental-osx/383/testReport/junit/TestSwiftStepping/TestSwiftStepping/test_swift_stepping_dsym>
Failed: TestSwiftStepping.TestSwiftStepping.test_swift_stepping_dwarf <https://ci.swift.org/job/oss-lldb-incremental-osx/383/testReport/junit/TestSwiftStepping/TestSwiftStepping/test_swift_stepping_dwarf>
Failed: TestSwiftStepping.TestSwiftStepping.test_swift_stepping_gmodules <https://ci.swift.org/job/oss-lldb-incremental-osx/383/testReport/junit/TestSwiftStepping/TestSwiftStepping/test_swift_stepping_gmodules>
Name: TestSwiftStringVariables
Failed: 0 test(s), Passed: 3 test(s), Total: 3 test(s)
Name: TestSwiftStructChangeRerun
Failed: 0 test(s), Passed: 1 test(s), Total: 3 test(s)
Name: TestSwiftStructInit
Failed: 0 test(s), Passed: 3 test(s), Total: 3 test(s)
Name: TestSwiftTuple
Failed: 0 test(s), Passed: 3 test(s), Total: 3 test(s)
Name: TestSwiftTupleTypes
Failed: 0 test(s), Passed: 3 test(s), Total: 3 test(s)
Name: TestSwiftTypeAliasFormatters
Failed: 0 test(s), Passed: 3 test(s), Total: 3 test(s)
Name: TestSwiftTypeLookup
Failed: 0 test(s), Passed: 3 test(s), Total: 3 test(s)
Name: TestSwiftTypeMetadata
Failed: 0 test(s), Passed: 3 test(s), Total: 3 test(s)
Name: TestSwiftTypes
Failed: 0 test(s), Passed: 3 test(s), Total: 3 test(s)
Name: TestSwiftValueOfOptionals
Failed: 0 test(s), Passed: 3 test(s), Total: 3 test(s)
Name: TestSwiftVersion
Failed: 0 test(s), Passed: 3 test(s), Total: 3 test(s)
Name: TestSwiftieFormatting
Failed: 0 test(s), Passed: 3 test(s), Total: 3 test(s)
Name: TestSymbolAPI
Failed: 0 test(s), Passed: 3 test(s), Total: 3 test(s)
Name: TestSymbolContext
Failed: 0 test(s), Passed: 3 test(s), Total: 3 test(s)
Name: TestSymbolContextTwoFiles
Failed: 0 test(s), Passed: 6 test(s), Total: 6 test(s)
Name: TestSymbolTable
Failed: 0 test(s), Passed: 3 test(s), Total: 3 test(s)
Name: TestSyntheticCapping
Failed: 0 test(s), Passed: 3 test(s), Total: 3 test(s)
Name: TestSyntheticFilterRecompute
Failed: 0 test(s), Passed: 3 test(s), Total: 3 test(s)
Name: TestTargetAPI
Failed: 0 test(s), Passed: 30 test(s), Total: 30 test(s)
Name: TestTargetCommand
Failed: 0 test(s), Passed: 9 test(s), Total: 9 test(s)
Name: TestTargetWatchAddress
Failed: 0 test(s), Passed: 6 test(s), Total: 6 test(s)
Name: TestTemplateArgs
Failed: 0 test(s), Passed: 6 test(s), Total: 6 test(s)
Name: TestTerminal
Failed: 0 test(s), Passed: 0 test(s), Total: 1 test(s)
Name: TestTestId
Failed: 0 test(s), Passed: 1 test(s), Total: 1 test(s)
Name: TestThreadAPI
Failed: 0 test(s), Passed: 15 test(s), Total: 15 test(s)
Name: TestThreadExit
Failed: 0 test(s), Passed: 3 test(s), Total: 3 test(s)
Name: TestThreadJump
Failed: 0 test(s), Passed: 3 test(s), Total: 3 test(s)
Name: TestThreadSpecificBpPlusCondition
Failed: 0 test(s), Passed: 3 test(s), Total: 3 test(s)
Name: TestThreadSpecificBreakpoint
Failed: 0 test(s), Passed: 3 test(s), Total: 3 test(s)
Name: TestThreadStates
Failed: 0 test(s), Passed: 9 test(s), Total: 15 test(s)
Name: TestThreadStepOut
Failed: 0 test(s), Passed: 9 test(s), Total: 9 test(s)
Name: TestThreadStepping
Failed: 0 test(s), Passed: 3 test(s), Total: 3 test(s)
Name: TestTlsGlobals
Failed: 0 test(s), Passed: 3 test(s), Total: 3 test(s)
Name: TestTopLevelExprs
Failed: 0 test(s), Passed: 2 test(s), Total: 3 test(s)
Name: TestTsanBasic
Failed: 0 test(s), Passed: 3 test(s), Total: 3 test(s)
Name: TestTsanCPPGlobalLocation
Failed: 0 test(s), Passed: 3 test(s), Total: 3 test(s)
Name: TestTsanGlobalLocation
Failed: 0 test(s), Passed: 3 test(s), Total: 3 test(s)
Name: TestTsanMultiple
Failed: 0 test(s), Passed: 3 test(s), Total: 3 test(s)
Name: TestTsanSwift
Failed: 0 test(s), Passed: 3 test(s), Total: 3 test(s)
Name: TestTsanThreadLeak
Failed: 0 test(s), Passed: 3 test(s), Total: 3 test(s)
Name: TestTsanThreadNumbers
Failed: 0 test(s), Passed: 3 test(s), Total: 3 test(s)
Name: TestTypeCompletion
Failed: 0 test(s), Passed: 3 test(s), Total: 3 test(s)
Name: TestTypeList
Failed: 0 test(s), Passed: 3 test(s), Total: 3 test(s)
Name: TestTypeLookup
Failed: 0 test(s), Passed: 3 test(s), Total: 3 test(s)
Name: TestTypeSummaryListArg
Failed: 0 test(s), Passed: 1 test(s), Total: 1 test(s)
Name: TestTypeSummaryListScript
Failed: 0 test(s), Passed: 3 test(s), Total: 3 test(s)
Name: TestUbsanBasic
Failed: 0 test(s), Passed: 0 test(s), Total: 3 test(s)
Name: TestUbsanUserExpression
Failed: 0 test(s), Passed: 0 test(s), Total: 3 test(s)
Name: TestUnicodeLiterals
Failed: 0 test(s), Passed: 9 test(s), Total: 9 test(s)
Name: TestUnionMembers
Failed: 0 test(s), Passed: 3 test(s), Total: 3 test(s)
Name: TestUniqueTypes
Failed: 0 test(s), Passed: 3 test(s), Total: 3 test(s)
Name: TestUnitTests
Failed: 0 test(s), Passed: 1 test(s), Total: 3 test(s)
Name: TestUniversal
Failed: 0 test(s), Passed: 9 test(s), Total: 9 test(s)
Name: TestUnsignedTypes
Failed: 0 test(s), Passed: 3 test(s), Total: 3 test(s)
Name: TestUnwindExpression
Failed: 0 test(s), Passed: 4 test(s), Total: 4 test(s)
Name: TestUserFormatVsSummary
Failed: 0 test(s), Passed: 3 test(s), Total: 3 test(s)
Name: TestValueAPI
Failed: 0 test(s), Passed: 3 test(s), Total: 3 test(s)
Name: TestValueAPIEmptyClass
Failed: 0 test(s), Passed: 3 test(s), Total: 3 test(s)
Name: TestValueAPILinkedList
Failed: 0 test(s), Passed: 3 test(s), Total: 3 test(s)
Name: TestValueMD5Crash
Failed: 0 test(s), Passed: 3 test(s), Total: 3 test(s)
Name: TestValueObjectRecursion
Failed: 0 test(s), Passed: 3 test(s), Total: 3 test(s)
Name: TestValueOfVectorVariable
Failed: 0 test(s), Passed: 3 test(s), Total: 3 test(s)
Name: TestValueVarUpdate
Failed: 0 test(s), Passed: 3 test(s), Total: 3 test(s)
Name: TestVarInAggregateMisuse
Failed: 0 test(s), Passed: 3 test(s), Total: 3 test(s)
Name: TestVectorTypesFormatting
Failed: 0 test(s), Passed: 3 test(s), Total: 3 test(s)
Name: TestVirtual
Failed: 0 test(s), Passed: 3 test(s), Total: 3 test(s)
Name: TestWatchLocation
Failed: 0 test(s), Passed: 0 test(s), Total: 3 test(s)
Name: TestWatchLocationWithWatchSet
Failed: 0 test(s), Passed: 3 test(s), Total: 3 test(s)
Name: TestWatchedVarHitWhenInScope
Failed: 0 test(s), Passed: 3 test(s), Total: 3 test(s)
Name: TestWatchpointCommandLLDB
Failed: 0 test(s), Passed: 6 test(s), Total: 6 test(s)
Name: TestWatchpointCommandPython
Failed: 0 test(s), Passed: 6 test(s), Total: 6 test(s)
Name: TestWatchpointCommands
Failed: 0 test(s), Passed: 15 test(s), Total: 15 test(s)
Name: TestWatchpointConditionAPI
Failed: 0 test(s), Passed: 3 test(s), Total: 3 test(s)
Name: TestWatchpointConditionCmd
Failed: 0 test(s), Passed: 3 test(s), Total: 3 test(s)
Name: TestWatchpointDisable
Failed: 0 test(s), Passed: 6 test(s), Total: 6 test(s)
Name: TestWatchpointEvents
Failed: 0 test(s), Passed: 3 test(s), Total: 3 test(s)
Name: TestWatchpointIgnoreCount
Failed: 0 test(s), Passed: 3 test(s), Total: 3 test(s)
Name: TestWatchpointIter
Failed: 0 test(s), Passed: 3 test(s), Total: 3 test(s)
Name: TestWatchpointMultipleSlots
Failed: 0 test(s), Passed: 0 test(s), Total: 1 test(s)
Name: TestWatchpointMultipleThreads
Failed: 0 test(s), Passed: 6 test(s), Total: 6 test(s)
Name: TestWatchpointSetErrorCases
Failed: 0 test(s), Passed: 3 test(s), Total: 3 test(s)
Name: TestWatchpointSizes
Failed: 0 test(s), Passed: 3 test(s), Total: 3 test(s)
Name: TestWithLimitDebugInfo
Failed: 0 test(s), Passed: 1 test(s), Total: 3 test(s)
Name: TestWithModuleDebugging
Failed: 0 test(s), Passed: 1 test(s), Total: 1 test(s)
Name: TestWow64MiniDump
Failed: 0 test(s), Passed: 3 test(s), Total: 3 test(s)
Name: TestXcode41Vs42GDBDisassembly
Failed: 0 test(s), Passed: 0 test(s), Total: 2 test(s)
Name: TestYMMRegister
Failed: 0 test(s), Passed: 1 test(s), Total: 1 test(s)
Name: Testtypedef
Failed: 0 test(s), Passed: 3 test(s), Total: 3 test(s)
Name: lldbsuite.test.lldbtest
Failed: 0 test(s), Passed: 229 test(s), Total: 232 test(s)

Changes

Commit c01d68c5ccb135465e5c3b81515f1e65ec80aeda by arphaman:
Clarify the error message for unsupported aliases on Darwin

edit: include/clang/Basic/DiagnosticSemaKinds.td
edit: test/Sema/attr-alias.c

Commit a031d276503e8d0a6ff54c2fde97ba0e6db5ba22 by arphaman:
[ObjC++] Don't warn about pessimizing move for __block variables

edit: lib/Sema/SemaInit.cpp
add: test/SemaObjCXX/block-variable-move.mm

Commit bb1e23e23a8a04da7a0895e9db25b8f867d8065f by arphaman:
[ObjC] Boxed strings should use the nullability from

add: test/SemaObjC/transfer-boxed-string-nullability.m
edit: lib/Sema/SemaExprObjC.cpp

Commit c532fbe2e505f69d711feaf7fedfe045d7ed3b90 by arphaman:
[ObjC] Fix function signature handling for blocks literals with

add: test/SemaObjC/block-literal-with-attribute.m
edit: lib/Sema/SemaExpr.cpp

Commit 9b10de6a1212eaaa7b47fba77f4ab18ca078600a by arphaman:
Remove redundant copy-pasted comment in test file from r317736

edit: test/SemaObjC/block-literal-with-attribute.m

Commit 0e747a4dee6381c875134ee2a473ce5469daafd3 by ahmed.bougacha:
[CodeGen] Fix some Clang-tidy modernize-use-using and Include What You

edit: include/llvm/CodeGen/GlobalISel/InstructionSelector.h
edit: lib/CodeGen/GlobalISel/InstructionSelector.cpp

Commit e560a153f86950508820af385ee2b1ca5eafcb1f by ahmed.bougacha:
[Legalizer] Add support for G_OR NarrowScalar.

edit: lib/CodeGen/GlobalISel/LegalizerHelper.cpp
edit: test/CodeGen/AArch64/GlobalISel/legalize-or.mir
edit: lib/CodeGen/GlobalISel/LegalizerInfo.cpp

Commit 5a56b39a6303d0e46578a6b1573ebba4b17aab2e by ahmed.bougacha:
[X86] Fix some Clang-tidy modernize-use-using and Include What You Use

edit: lib/Target/X86/X86CallLowering.cpp
edit: include/llvm/CodeGen/GlobalISel/InstructionSelectorImpl.h
edit: lib/Target/X86/X86InstructionSelector.cpp
edit: lib/Target/X86/X86CallLowering.h

Commit a89b5e8184fbb90369fcd53704d79b0aeb01f51e by ahmed.bougacha:
[ARM] GlobalISel: Mark shifts as legal for s32

edit: lib/Target/ARM/ARMLegalizerInfo.cpp
edit: test/CodeGen/ARM/GlobalISel/arm-legalizer.mir

Commit a9916751b9142f6e6259b97e4c7345c6cfa08954 by ahmed.bougacha:
[ARM] GlobalISel: Map shift operands to GPRs

edit: test/CodeGen/ARM/GlobalISel/arm-regbankselect.mir
edit: lib/Target/ARM/ARMRegisterBankInfo.cpp

Commit d12cabeb6caffac13a60dd19f398ed1c6120ea58 by ahmed.bougacha:
[ARM] GlobalISel: Select shifts

edit: lib/Target/ARM/ARMInstructionSelector.cpp
edit: test/CodeGen/ARM/GlobalISel/arm-instruction-select.mir

Commit ae0ef4c252e1811077df45f6cf5d0b94bc206213 by ahmed.bougacha:
[ARM] GlobalISel: Make tests less strict

edit: test/CodeGen/ARM/GlobalISel/arm-isel-divmod.ll
edit: test/CodeGen/ARM/GlobalISel/arm-isel.ll

Commit fbb9aa5acaea3d45ea724bcdb489c51f060e5dd5 by ahmed.bougacha:
[GlobalISel] Fix legalizer trying to process a deleted instruction.

edit: include/llvm/CodeGen/GlobalISel/LegalizerCombiner.h
add: test/CodeGen/AArch64/GlobalISel/combine-anyext-crash.mir

Commit 3b3706e1e0d8d968ef14ff8f1c280b35c265e1e7 by ahmed.bougacha:
[AArch64][GlobalISel] Make G_PHI of p0 types legal.

edit: lib/Target/AArch64/AArch64LegalizerInfo.cpp
edit: test/CodeGen/AArch64/GlobalISel/legalize-phi.mir

Commit aeed584ba8b3852b9698c4e61c696f66a47c9687 by ahmed.bougacha:
[AArch64][GlobalISel] Add a test case for G_PHI of p0 regbank selection.

edit: test/CodeGen/AArch64/GlobalISel/regbankselect-default.mir

Commit b4911649c27b963567619e151e9542352c55abed by ahmed.bougacha:
[AArch64][GlobalISel] Add a test case for G_PHI of p0 instruction

edit: test/CodeGen/AArch64/GlobalISel/select-phi.mir

Commit dbc8bd8a9f1f36b0e1095642b77b2ec2a2b61e8d by ahmed.bougacha:
[globalisel] Add support for ValueType operands in patterns.

edit: test/TableGen/GlobalISelEmitter.td
edit: utils/TableGen/GlobalISelEmitter.cpp

Commit f5b476958dcf4b0f194eedb45912ca7a2b779e9e by ahmed.bougacha:
Add a helper to build Copy instructions in MachineIRBuilder

edit: include/llvm/CodeGen/GlobalISel/MachineIRBuilder.h

Commit ddb0525ab61769cabeb32666f1b544e37aee768c by ahmed.bougacha:
[GISel]: Fix generation of illegal COPYs during CallLowering

edit: lib/Target/AArch64/AArch64CallLowering.cpp
edit: test/CodeGen/AArch64/GlobalISel/arm64-irtranslator.ll
edit: test/CodeGen/AArch64/GlobalISel/arm64-fallback.ll
edit: test/CodeGen/AArch64/GlobalISel/arm64-callingconv.ll
edit: test/CodeGen/X86/GlobalISel/irtranslator-callingconv.ll
edit: lib/Target/X86/X86CallLowering.cpp
edit: test/CodeGen/AArch64/GlobalISel/call-translator.ll
edit: test/CodeGen/ARM/GlobalISel/arm-irtranslator.ll
edit: lib/CodeGen/GlobalISel/CallLowering.cpp
edit: test/CodeGen/X86/GlobalISel/callingconv.ll
edit: lib/Target/ARM/ARMCallLowering.cpp
edit: test/CodeGen/X86/GlobalISel/ext-x86-64.ll
edit: test/CodeGen/X86/GlobalISel/add-scalar.ll

Commit 853d5efa2e125ba910438f27c2fa97c238720e9e by ahmed.bougacha:
CodeGen: Add MachineInstr::getMF(). NFC

edit: include/llvm/CodeGen/MachineInstr.h
edit: lib/CodeGen/MachineInstr.cpp

Commit 1148b33b4e59810953d8e58962162cb494fe4a69 by ahmed.bougacha:
CodeGen: Minor cleanups to use MachineInstr::getMF. NFC

edit: include/llvm/CodeGen/GlobalISel/InstructionSelectorImpl.h
edit: lib/CodeGen/GlobalISel/RegisterBankInfo.cpp
edit: include/llvm/CodeGen/GlobalISel/MachineIRBuilder.h

Commit c5786348860c07f84a04a40b691efae256b71b43 by ahmed.bougacha:
[aarch64] Support APInt and APFloat in ImmLeaf subclasses and make

edit: include/llvm/Target/TargetSelectionDAG.td
edit: utils/TableGen/GlobalISelEmitter.cpp
edit: utils/TableGen/CodeGenDAGPatterns.cpp
edit: include/llvm/CodeGen/SelectionDAGNodes.h
edit: lib/Target/AArch64/AArch64InstrFormats.td
edit: include/llvm/ADT/APFloat.h
edit: utils/TableGen/CodeGenDAGPatterns.h

Commit 38375b298ed118b1a45bd9acf69d3193a5f583d1 by ahmed.bougacha:
[Legalizer] Only allocate the SetVectors once per function.

edit: lib/CodeGen/GlobalISel/Legalizer.cpp

Commit 60e0f66f494829b5bdaaad6bdfbc2d2451f28578 by ahmed.bougacha:
[LegalizerInfo] Don't evaluate end boundary every time through the loop

edit: lib/CodeGen/GlobalISel/LegalizerInfo.cpp

Commit 7af7dc243d68656258e0fa2412e877e4a269e639 by ahmed.bougacha:
[Legalizer] Use SmallSetVector instead of SetVector.

edit: lib/CodeGen/GlobalISel/Legalizer.cpp

Commit e0ad7ab774f944e3beab17a5f7340b17f349fb3c by ahmed.bougacha:
[RegisterBankInfo] Cache the getMinimalPhysRegClass information

edit: include/llvm/CodeGen/GlobalISel/RegisterBankInfo.h
edit: lib/CodeGen/GlobalISel/RegisterBankInfo.cpp
edit: lib/CodeGen/GlobalISel/RegBankSelect.cpp

Commit 76705509e758f65c8699077103daf3faf02d2ab5 by ahmed.bougacha:
[globalisel][tablegen] Add support for fpimm and import of APInt/APFloat

edit: test/CodeGen/AArch64/GlobalISel/select-constant.mir
edit: utils/TableGen/CodeGenDAGPatterns.cpp
edit: include/llvm/CodeGen/GlobalISel/InstructionSelector.h
edit: utils/TableGen/CodeGenDAGPatterns.h
edit: include/llvm/CodeGen/GlobalISel/InstructionSelectorImpl.h
edit: include/llvm/Target/GlobalISel/SelectionDAGCompat.td
edit: test/TableGen/GlobalISelEmitter.td
edit: utils/TableGen/GlobalISelEmitter.cpp
edit: lib/Target/AArch64/AArch64InstructionSelector.cpp
edit: lib/Target/X86/X86InstrFPStack.td

Commit 59bd87658a9769fcbe2ce1f9fbdbf5b58ce6f972 by ahmed.bougacha:
[globalisel][tablegen] Fix a use-after free bug that manifests on

edit: utils/TableGen/GlobalISelEmitter.cpp

Commit ced81ed42eed364593df249b9356c2ed66b43e56 by ahmed.bougacha:
[globalisel][tablegen] Simplify named operand/operator lookups and fix a

edit: utils/TableGen/GlobalISelEmitter.cpp
edit: test/TableGen/GlobalISelEmitter.td
edit: include/llvm/CodeGen/GlobalISel/InstructionSelectorImpl.h
edit: include/llvm/CodeGen/GlobalISel/InstructionSelector.h
add: test/CodeGen/X86/GlobalISel/select-blsr.mir

Commit 020ec21c77ca81f02f79e8e9738bc7e39f63ace5 by ahmed.bougacha:
[globalisel][tablegen] Fix undefined references to dump()

edit: include/llvm/CodeGen/GlobalISel/InstructionSelectorImpl.h

Commit 4aeaa403cedb9f3a4913015f14083c36648aa735 by ahmed.bougacha:
[globalisel][tablegen] Fix an unused variable warning caused by a typo

edit: include/llvm/CodeGen/GlobalISel/InstructionSelectorImpl.h

Commit 5094a41c3d625a7aecdd9332cbf163ca1109587d by ahmed.bougacha:
[TableGen] Avoid unnecessary std::string creations

edit: utils/TableGen/CodeGenDAGPatterns.h
edit: utils/TableGen/GlobalISelEmitter.cpp
edit: utils/TableGen/CodeGenDAGPatterns.cpp

Commit 6367eb72a6cf2ffead9f26e411457ab85528bb6d by ahmed.bougacha:
[tablegen] Handle common load/store predicates inside tablegen. NFC.

edit: utils/TableGen/CodeGenDAGPatterns.h
edit: utils/TableGen/GlobalISelEmitter.cpp
edit: utils/TableGen/CodeGenDAGPatterns.cpp
edit: include/llvm/Target/TargetSelectionDAG.td

Commit cfc40f95ec168a3894f14caf97700b9a612cd9a9 by ahmed.bougacha:
[GlobalISel] Update tablegen tests to account for missing r313271.

edit: test/TableGen/GlobalISelEmitter.td

Commit b6505f158283ca5d1ed0409243132b0667d79b7e by ahmed.bougacha:
[X86] Update gisel phi test for copy size changes. NFC.

edit: test/CodeGen/X86/GlobalISel/phi.ll

Commit 99c4cddfcadf6eb13b5024ae81a35ac77f3d0bd1 by huon:
[SILGen] Store conditional conformances in SILWitnessTables.

edit: lib/Serialization/DeserializeSIL.cpp
edit: lib/Serialization/SerializeSIL.cpp
edit: lib/Serialization/Serialization.cpp
edit: include/swift/Serialization/ModuleFormat.h
edit: lib/SILGen/SILGenPoly.cpp
edit: lib/ParseSIL/ParseSIL.cpp
edit: lib/SILOptimizer/IPO/DeadFunctionElimination.cpp
edit: lib/Serialization/SILFormat.h
add: test/SILGen/conditional_conformance.swift
edit: include/swift/SIL/SILWitnessTable.h
edit: lib/SIL/SILPrinter.cpp
edit: lib/SIL/SILWitnessTable.cpp
edit: lib/SILGen/SILGenType.cpp

Commit 51bea6b575e8ce54c96f4a429355b8a2771b8e14 by huon:
[IRGen] Reserve witness table private data space for conditional

edit: lib/IRGen/GenProto.cpp

Commit 4f53475dd96322e4143be6c63afe9a9e88e0668a by huon:
[IRGen] Support fulfilling conformances from conditional requirements.

edit: lib/IRGen/Fulfillment.cpp
edit: lib/IRGen/WitnessIndex.h
edit: lib/IRGen/Fulfillment.h
edit: lib/IRGen/GenProto.cpp
edit: lib/IRGen/MetadataPath.h

Commit b9336c7389371cde3f3da0090442110d7e001472 by huon:
[IRGen] Dynamically fill in conditional conformance wtables.

edit: lib/IRGen/GenDecl.cpp
edit: lib/IRGen/GenProto.cpp
edit: test/IRGen/associated_type_witness.swift
edit: unittests/runtime/Metadata.cpp
edit: include/swift/Runtime/Metadata.h
edit: test/IRGen/partial_apply_forwarder.sil
edit: test/IRGen/witness_method.sil
edit: lib/IRGen/IRGenModule.h
edit: stdlib/public/runtime/ProtocolConformance.cpp
edit: lib/IRGen/IRGenModule.cpp

Commit 306c0dafdddb9c8821804edfb5e184224c64d4df by huon:
fixup! [IRGen] Dynamically fill in conditional conformance wtables.

edit: test/IRGen/partial_apply_forwarder.sil
edit: test/IRGen/witness_method.sil
edit: test/IRGen/associated_type_witness.swift

Commit bdff7aa3f4dcaf783900253758724a64eda13d59 by huon:
[IRGen] Polymorphic convention needs to consider conditional

edit: lib/IRGen/GenProto.cpp

Commit 4743b8ae5c9e8b140ab24c7a59cc02ee587f9c2e by huon:
[IRGen] Pull witness tables out of self witness table in witness_method

edit: lib/IRGen/GenProto.cpp

Commit ae54ac04442aa0fa054573d50e778fb9b1de452f by huon:
[AST] Allow retrieving substitutions from an arbitrary

edit: lib/AST/ProtocolConformance.cpp
edit: include/swift/AST/ProtocolConformance.h
edit: lib/SILOptimizer/Utils/Devirtualize.cpp

Commit 901bd35e5a86f963346a8e88c7ebbb6214c3e2c2 by huon:
[IRGen] Pass witness tables for conditional conformances to witness

edit: lib/AST/ProtocolConformance.cpp
edit: test/IRGen/protocol_resilience.sil
edit: lib/IRGen/GenProto.cpp
add: test/IRGen/conditional_conformance_with_assoc.swift
edit: test/IRGen/associated_type_witness.swift
add: test/IRGen/conditional_conformance_basic_conformances.swift

Commit b3088e2d84c17163b90d1646e83cc70b10fc6489 by aprantl:
Un-XFAIL and update test.

edit: test/DebugInfo/basic.swift

Commit 1372202cfa9b8dcc44a5cb314af968c9370e37ee by huon:
[test] More for conditional conformances; subclasses, devirtualization,

add: test/Inputs/conditional_conformance_subclass.swift
add: test/Interpreter/conditional_conformances_smoke.swift
add: test/Interpreter/conditional_conformances.swift
edit: test/SILGen/conditional_conformance.swift
delete: test/IRGen/conditional_conformance_basic_conformances.swift
add: test/IRGen/conditional_conformances.swift
add: test/Inputs/conditional_conformance_with_assoc.swift
edit: test/Generics/conditional_conformances.swift
add: test/SILOptimizer/devirt_conditional_conformance.swift
add: test/Interpreter/conditional_conformances_modules.swift
delete: test/IRGen/conditional_conformance_with_assoc.swift
add: test/Inputs/conditional_conformance_basic_conformances.swift

Commit 6dd8bec47e4c3e09c01db79e7b86a33b6477dc28 by huon:
[AST] Unify computation of 'has arguments?' for witness table accessors.

edit: lib/IRGen/GenDecl.cpp
edit: lib/IRGen/GenProto.cpp
edit: include/swift/AST/ProtocolConformance.h
edit: lib/AST/ProtocolConformance.cpp

Commit a94df16b629650c008ee9ccb735032ed42ae4cd5 by huon:
[test] Add more tests for inheriting conformances etc from SE0143

add: test/Generics/conditional_conformances_execute_smoke.swift
edit: test/Generics/conditional_conformances.swift

Commit 67c9fa3daeb4c24fba388b8119f6668be014f5fd by huon:
[test] Add test for parsing @convention(witness_method: ) in

add: test/SIL/Parser/witness_method.sil

Commit b993c113e58a77985959437632f91b1e13d9eb06 by anemet:
Test debug output of Generic Specializer pass

add: test/SILOptimizer/partial_specialization_debug.sil

Commit e74367f2b377ed7ef09861c256287639ecc94aba by gottesmm:
[pred-memopt] Only promote destroy_addr if we know that otherwise the

edit: test/DebugInfo/linetable-cleanups.swift
edit: test/SILOptimizer/definite_init_failable_initializers_objc.swift
edit: test/SILOptimizer/predictable_memopt.sil
edit: test/IRGen/superclass_constraint.swift
edit: lib/SILOptimizer/Mandatory/PredictableMemOpt.cpp
edit: test/SILOptimizer/definite_init_failable_initializers.swift
edit: test/DebugInfo/return.swift
edit: test/SILOptimizer/definite_init_protocol_init.swift

Commit 578fca1ee3fd21592f34613d662c351e60323ebd by aprantl:
Move the logic for ignoring the debug locations for closure setup code

edit: lib/SIL/SILLocation.cpp
edit: test/SILGen/objc_thunks.swift
edit: lib/SILGen/SILGenExpr.cpp
edit: lib/IRGen/IRGenDebugInfo.cpp

Commit b998c103fc224f47a743f889712d0e8fcea5d9e6 by aprantl:
Debug Info: Associate a function call with the beginning of the

edit: test/DebugInfo/patternmatching.swift
edit: test/DebugInfo/inlinedAt.swift
edit: lib/SIL/SILLocation.cpp
edit: lib/SILGen/SILGenApply.cpp
edit: test/DebugInfo/linetable.swift
edit: test/DebugInfo/callexpr.swift

Commit a71a03986eb81e07968e79171ef44673f5333640 by github:
libSyntax: Start parsing simple identifier expression. (#12862)

edit: test/Syntax/Outputs/round_trip_parse_gen.swift.withkinds
edit: utils/gyb_syntax_support/ExprNodes.py
edit: lib/Parse/ParseExpr.cpp
edit: lib/Syntax/SyntaxParsingContext.cpp

Commit f552f559697a3b520ba18fced8ee7d322d8bcb7f by xi_ge:
Update SwiftSyntax's expectations now that -emit-syntax is emitting a

edit: tools/SwiftSyntax/SwiftSyntax.swift

Commit dcef91680c4f4a2b84d869f38c647065640b859c by eeckstein:
cmpcodesize: replace the Ounchecked with the Osize benchmark shortcut.

edit: utils/cmpcodesize/cmpcodesize/main.py

Commit 773e6bff56efcd96881f411c8312c6dc49ef68b6 by spestov:
SIL: Add SILFunction::getResilienceExpansion()

edit: include/swift/SIL/SILFunction.h

Commit 0b895bbf44f271ff432df374372b78e7000f50d5 by spestov:
SILGen: Use resilience expansion when deciding if we need to use

edit: test/SILGen/struct_resilience.swift
edit: lib/SILGen/SILGenLValue.cpp

Commit 9de7a21e8e26b3bc0c90ea189e0966e4b08f28f5 by spestov:
SILGen: Use SILFunction's resilience expansion when evaluating enum

edit: test/SILGen/enum_resilience.swift
edit: lib/SILGen/SILGenPattern.cpp

Commit 697b19570b2a91480e926706034f5e6dfadb79d4 by github:
Update Xcode version to Xcode 9.1 GM

edit: README.md

Yes, that was definitely my change. I'm working on updating the LLDB tests.

-- adrian

···

On Nov 10, 2017, at 10:50 PM, Pavel Yaskevich <pyaskevich@apple.com> wrote:

The error is: False is not True : Stepped to line 208 instead of expected 222 with pattern 'doSomethingWithFunction(cd_maker, 10)'.

On Nov 10, 2017, at 10:49 PM, Pavel Yaskevich <pyaskevich@apple.com <mailto:pyaskevich@apple.com>> wrote:

Adrian, could this be caused by your changes?

On Nov 10, 2017, at 10:48 PM, no-reply@swift.org <mailto:no-reply@swift.org> wrote:

[FAILURE] oss-lldb-incremental-osx [#383]

Build URL: https://ci.swift.org/job/oss-lldb-incremental-osx/383/
Project: oss-lldb-incremental-osx
Date of build: Fri, 10 Nov 2017 22:40:18 -0600
Build duration: 2 hr 7 min
Identified problems:

Assertion failure: This build failed because of an assertion failure. Below is a list of all errors in the build log:
Indication 1 <https://ci.swift.org//job/oss-lldb-incremental-osx/383/consoleFull#1256565552ef3c3c00-f496-40b9-85a7-0eb69d0f491b>
Regression test failed: This build failed because a regression test in the test suite FAILed. Below is a list of all errors:
Indication 1 <https://ci.swift.org//job/oss-lldb-incremental-osx/383/consoleFull#527207262ba62d58e-7248-467b-91e0-c7508d5cf947>
Tests:

Name: Test-rdar-12481949
Failed: 0 test(s), Passed: 3 test(s), Total: 3 test(s)
Name: Test-rdar-9974002
Failed: 0 test(s), Passed: 3 test(s), Total: 3 test(s)
Name: Test11588
Failed: 0 test(s), Passed: 3 test(s), Total: 3 test(s)
Name: Test8638051
Failed: 0 test(s), Passed: 3 test(s), Total: 3 test(s)
Name: TestABIv2
Failed: 0 test(s), Passed: 3 test(s), Total: 3 test(s)
Name: TestAbbreviations
Failed: 0 test(s), Passed: 1 test(s), Total: 1 test(s)
Name: TestAddDsymCommand
Failed: 0 test(s), Passed: 3 test(s), Total: 3 test(s)
Name: TestAddDsymMidExecutionCommand
Failed: 0 test(s), Passed: 1 test(s), Total: 1 test(s)
Name: TestAddressBreakpoints
Failed: 0 test(s), Passed: 1 test(s), Total: 1 test(s)
Name: TestAnonymous
Failed: 0 test(s), Passed: 21 test(s), Total: 21 test(s)
Name: TestAppleTypesIsProduced
Failed: 0 test(s), Passed: 0 test(s), Total: 3 test(s)
Name: TestApropos
Failed: 0 test(s), Passed: 1 test(s), Total: 1 test(s)
Name: TestAproposWithProcess
Failed: 0 test(s), Passed: 3 test(s), Total: 3 test(s)
Name: TestArray
Failed: 0 test(s), Passed: 0 test(s), Total: 3 test(s)
Name: TestArrayTypes
Failed: 0 test(s), Passed: 6 test(s), Total: 6 test(s)
Name: TestAsanSwift
Failed: 0 test(s), Passed: 3 test(s), Total: 3 test(s)
Name: TestAttachDenied
Failed: 0 test(s), Passed: 3 test(s), Total: 3 test(s)
Name: TestAttachResume
Failed: 0 test(s), Passed: 3 test(s), Total: 3 test(s)
Name: TestAvoidBreakpointInDelaySlot
Failed: 0 test(s), Passed: 0 test(s), Total: 3 test(s)
Name: TestBSDArchives
Failed: 0 test(s), Passed: 3 test(s), Total: 3 test(s)
Name: TestBackticksWithoutATarget
Failed: 0 test(s), Passed: 1 test(s), Total: 1 test(s)
Name: TestBacktraceAll
Failed: 0 test(s), Passed: 3 test(s), Total: 3 test(s)
Name: TestBadAddressBreakpoints
Failed: 0 test(s), Passed: 1 test(s), Total: 1 test(s)
Name: TestBadReference
Failed: 0 test(s), Passed: 0 test(s), Total: 3 test(s)
Name: TestBatchMode
Failed: 0 test(s), Passed: 9 test(s), Total: 9 test(s)
Name: TestBenchmarkContinue
Failed: 0 test(s), Passed: 0 test(s), Total: 3 test(s)
Name: TestBenchmarkLibcxxList
Failed: 0 test(s), Passed: 0 test(s), Total: 3 test(s)
Name: TestBenchmarkLibcxxMap
Failed: 0 test(s), Passed: 0 test(s), Total: 3 test(s)
Name: TestBenchmarkSwiftDictionary
Failed: 0 test(s), Passed: 0 test(s), Total: 3 test(s)
Name: TestBitfields
Failed: 0 test(s), Passed: 6 test(s), Total: 6 test(s)
Name: TestBlocks
Failed: 0 test(s), Passed: 6 test(s), Total: 6 test(s)
Name: TestBoundViolation
Failed: 0 test(s), Passed: 0 test(s), Total: 3 test(s)
Name: TestBreakAfterJoin
Failed: 0 test(s), Passed: 3 test(s), Total: 3 test(s)
Name: TestBreakpointAPI
Failed: 0 test(s), Passed: 2 test(s), Total: 2 test(s)
Name: TestBreakpointAutoContinue
Failed: 0 test(s), Passed: 3 test(s), Total: 3 test(s)
Name: TestBreakpointCaseSensitivity
Failed: 0 test(s), Passed: 3 test(s), Total: 6 test(s)
Name: TestBreakpointCommand
Failed: 0 test(s), Passed: 9 test(s), Total: 9 test(s)
Name: TestBreakpointCommandsFromPython
Failed: 0 test(s), Passed: 3 test(s), Total: 3 test(s)
Name: TestBreakpointConditions
Failed: 0 test(s), Passed: 12 test(s), Total: 12 test(s)
Name: TestBreakpointHitCount
Failed: 0 test(s), Passed: 1 test(s), Total: 1 test(s)
Name: TestBreakpointIDs
Failed: 0 test(s), Passed: 3 test(s), Total: 3 test(s)
Name: TestBreakpointIgnoreCount
Failed: 0 test(s), Passed: 6 test(s), Total: 6 test(s)
Name: TestBreakpointLanguage
Failed: 0 test(s), Passed: 6 test(s), Total: 6 test(s)
Name: TestBreakpointLocations
Failed: 0 test(s), Passed: 9 test(s), Total: 9 test(s)
Name: TestBreakpointNames
Failed: 0 test(s), Passed: 6 test(s), Total: 6 test(s)
Name: TestBreakpointOptions
Failed: 0 test(s), Passed: 3 test(s), Total: 3 test(s)
Name: TestBreakpointSerialization
Failed: 0 test(s), Passed: 15 test(s), Total: 15 test(s)
Name: TestBreakpointSetRestart
Failed: 0 test(s), Passed: 3 test(s), Total: 3 test(s)
Name: TestBreakpointsWithNoTargets
Failed: 0 test(s), Passed: 3 test(s), Total: 3 test(s)
Name: TestBuiltinTrap
Failed: 0 test(s), Passed: 3 test(s), Total: 3 test(s)
Name: TestBulkyEnumsVariables
Failed: 0 test(s), Passed: 3 test(s), Total: 3 test(s)
Name: TestBundleWithDotInFilename
Failed: 0 test(s), Passed: 3 test(s), Total: 3 test(s)
Name: TestCGImportedTypes
Failed: 0 test(s), Passed: 3 test(s), Total: 3 test(s)
Name: TestCGTypes
Failed: 0 test(s), Passed: 3 test(s), Total: 3 test(s)
Name: TestCInlines
Failed: 0 test(s), Passed: 3 test(s), Total: 3 test(s)
Name: TestCModules
Failed: 0 test(s), Passed: 3 test(s), Total: 3 test(s)
Name: TestCPP11EnumTypes
Failed: 0 test(s), Passed: 24 test(s), Total: 24 test(s)
Name: TestCPPAuto
Failed: 0 test(s), Passed: 3 test(s), Total: 3 test(s)
Name: TestCPPBool
Failed: 0 test(s), Passed: 3 test(s), Total: 3 test(s)
Name: TestCPPBreakpointCommands
Failed: 0 test(s), Passed: 3 test(s), Total: 3 test(s)
Name: TestCPPBreakpointLocations
Failed: 0 test(s), Passed: 6 test(s), Total: 6 test(s)
Name: TestCPPExceptionBreakpoint
Failed: 0 test(s), Passed: 3 test(s), Total: 3 test(s)
Name: TestCPPExceptionBreakpoints
Failed: 0 test(s), Passed: 3 test(s), Total: 3 test(s)
Name: TestCPPStaticMembers
Failed: 0 test(s), Passed: 3 test(s), Total: 3 test(s)
Name: TestCPPStaticMethods
Failed: 0 test(s), Passed: 3 test(s), Total: 3 test(s)
Name: TestCPPThis
Failed: 0 test(s), Passed: 3 test(s), Total: 3 test(s)
Name: TestCStrings
Failed: 0 test(s), Passed: 3 test(s), Total: 3 test(s)
Name: TestCalculatorMode
Failed: 0 test(s), Passed: 3 test(s), Total: 3 test(s)
Name: TestCallCPPFunction
Failed: 0 test(s), Passed: 3 test(s), Total: 3 test(s)
Name: TestCallStdStringFunction
Failed: 0 test(s), Passed: 3 test(s), Total: 3 test(s)
Name: TestCallStopAndContinue
Failed: 0 test(s), Passed: 3 test(s), Total: 3 test(s)
Name: TestCallThatRestarts
Failed: 0 test(s), Passed: 0 test(s), Total: 1 test(s)
Name: TestCallThatThrows
Failed: 0 test(s), Passed: 3 test(s), Total: 3 test(s)
Name: TestCallUserAnonTypedef
Failed: 0 test(s), Passed: 3 test(s), Total: 3 test(s)
Name: TestCallUserDefinedFunction
Failed: 0 test(s), Passed: 3 test(s), Total: 3 test(s)
Name: TestCallWithTimeout
Failed: 0 test(s), Passed: 3 test(s), Total: 3 test(s)
Name: TestChangeProcessGroup
Failed: 0 test(s), Passed: 1 test(s), Total: 1 test(s)
Name: TestChangeValueAPI
Failed: 0 test(s), Passed: 3 test(s), Total: 3 test(s)
Name: TestChar1632T
Failed: 0 test(s), Passed: 3 test(s), Total: 3 test(s)
Name: TestClassConstrainedProtocol
Failed: 0 test(s), Passed: 4 test(s), Total: 4 test(s)
Name: TestClassTypes
Failed: 0 test(s), Passed: 12 test(s), Total: 12 test(s)
Name: TestClassTypesDisassembly
Failed: 0 test(s), Passed: 6 test(s), Total: 6 test(s)
Name: TestCommandHistory
Failed: 0 test(s), Passed: 1 test(s), Total: 1 test(s)
Name: TestCommandInterpreterAPI
Failed: 0 test(s), Passed: 3 test(s), Total: 3 test(s)
Name: TestCommandRegex
Failed: 0 test(s), Passed: 1 test(s), Total: 1 test(s)
Name: TestCommandScript
Failed: 0 test(s), Passed: 3 test(s), Total: 3 test(s)
Name: TestCommandScriptAlias
Failed: 0 test(s), Passed: 3 test(s), Total: 3 test(s)
Name: TestCommandScriptImmediateOutput
Failed: 0 test(s), Passed: 2 test(s), Total: 2 test(s)
Name: TestCommandSource
Failed: 0 test(s), Passed: 1 test(s), Total: 1 test(s)
Name: TestCommonShortSpellings
Failed: 0 test(s), Passed: 1 test(s), Total: 1 test(s)
Name: TestCompDirSymLink
Failed: 0 test(s), Passed: 6 test(s), Total: 9 test(s)
Name: TestCompactVectors
Failed: 0 test(s), Passed: 3 test(s), Total: 3 test(s)
Name: TestCompileRunToBreakpointTurnaround
Failed: 0 test(s), Passed: 0 test(s), Total: 1 test(s)
Name: TestCompletion
Failed: 0 test(s), Passed: 34 test(s), Total: 34 test(s)
Name: TestComplicatedExpression
Failed: 0 test(s), Passed: 0 test(s), Total: 3 test(s)
Name: TestConcurrentBreakpointDelayBreakpointOneSignal
Failed: 0 test(s), Passed: 1 test(s), Total: 1 test(s)
Name: TestConcurrentBreakpointOneDelayBreakpointThreads
Failed: 0 test(s), Passed: 1 test(s), Total: 1 test(s)
Name: TestConcurrentBreakpointsDelayedBreakpointOneWatchpoint
Failed: 0 test(s), Passed: 1 test(s), Total: 1 test(s)
Name: TestConcurrentCrashWithBreak
Failed: 0 test(s), Passed: 1 test(s), Total: 1 test(s)
Name: TestConcurrentCrashWithSignal
Failed: 0 test(s), Passed: 1 test(s), Total: 1 test(s)
Name: TestConcurrentCrashWithWatchpoint
Failed: 0 test(s), Passed: 1 test(s), Total: 1 test(s)
Name: TestConcurrentCrashWithWatchpointBreakpointSignal
Failed: 0 test(s), Passed: 1 test(s), Total: 1 test(s)
Name: TestConcurrentDelaySignalBreak
Failed: 0 test(s), Passed: 1 test(s), Total: 1 test(s)
Name: TestConcurrentDelaySignalWatch
Failed: 0 test(s), Passed: 1 test(s), Total: 1 test(s)
Name: TestConcurrentDelayWatchBreak
Failed: 0 test(s), Passed: 1 test(s), Total: 1 test(s)
Name: TestConcurrentDelayedCrashWithBreakpointSignal
Failed: 0 test(s), Passed: 1 test(s), Total: 1 test(s)
Name: TestConcurrentDelayedCrashWithBreakpointWatchpoint
Failed: 0 test(s), Passed: 1 test(s), Total: 1 test(s)
Name: TestConcurrentManyBreakpoints
Failed: 0 test(s), Passed: 0 test(s), Total: 1 test(s)
Name: TestConcurrentManyCrash
Failed: 0 test(s), Passed: 0 test(s), Total: 1 test(s)
Name: TestConcurrentManySignals
Failed: 0 test(s), Passed: 0 test(s), Total: 1 test(s)
Name: TestConcurrentManyWatchpoints
Failed: 0 test(s), Passed: 0 test(s), Total: 1 test(s)
Name: TestConcurrentNWatchNBreak
Failed: 0 test(s), Passed: 1 test(s), Total: 1 test(s)
Name: TestConcurrentSignalBreak
Failed: 0 test(s), Passed: 1 test(s), Total: 1 test(s)
Name: TestConcurrentSignalDelayBreak
Failed: 0 test(s), Passed: 1 test(s), Total: 1 test(s)
Name: TestConcurrentSignalDelayWatch
Failed: 0 test(s), Passed: 1 test(s), Total: 1 test(s)
Name: TestConcurrentSignalNWatchNBreak
Failed: 0 test(s), Passed: 1 test(s), Total: 1 test(s)
Name: TestConcurrentSignalWatch
Failed: 0 test(s), Passed: 1 test(s), Total: 1 test(s)
Name: TestConcurrentSignalWatchBreak
Failed: 0 test(s), Passed: 1 test(s), Total: 1 test(s)
Name: TestConcurrentTwoBreakpointThreads
Failed: 0 test(s), Passed: 1 test(s), Total: 1 test(s)
Name: TestConcurrentTwoBreakpointsOneDelaySignal
Failed: 0 test(s), Passed: 1 test(s), Total: 1 test(s)
Name: TestConcurrentTwoBreakpointsOneSignal
Failed: 0 test(s), Passed: 1 test(s), Total: 1 test(s)
Name: TestConcurrentTwoBreakpointsOneWatchpoint
Failed: 0 test(s), Passed: 1 test(s), Total: 1 test(s)
Name: TestConcurrentTwoWatchpointThreads
Failed: 0 test(s), Passed: 1 test(s), Total: 1 test(s)
Name: TestConcurrentTwoWatchpointsOneBreakpoint
Failed: 0 test(s), Passed: 1 test(s), Total: 1 test(s)
Name: TestConcurrentTwoWatchpointsOneDelayBreakpoint
Failed: 0 test(s), Passed: 1 test(s), Total: 1 test(s)
Name: TestConcurrentTwoWatchpointsOneSignal
Failed: 0 test(s), Passed: 1 test(s), Total: 1 test(s)
Name: TestConcurrentWatchBreak
Failed: 0 test(s), Passed: 1 test(s), Total: 1 test(s)
Name: TestConcurrentWatchBreakDelay
Failed: 0 test(s), Passed: 1 test(s), Total: 1 test(s)
Name: TestConcurrentWatchpointDelayWatchpointOneBreakpoint
Failed: 0 test(s), Passed: 1 test(s), Total: 1 test(s)
Name: TestConcurrentWatchpointWithDelayWatchpointThreads
Failed: 0 test(s), Passed: 1 test(s), Total: 1 test(s)
Name: TestConditionalBreak
Failed: 0 test(s), Passed: 6 test(s), Total: 6 test(s)
Name: TestConflictingDefinition
Failed: 0 test(s), Passed: 3 test(s), Total: 3 test(s)
Name: TestConflictingSymbol
Failed: 0 test(s), Passed: 1 test(s), Total: 1 test(s)
Name: TestConsecutiveBreakpoints
Failed: 0 test(s), Passed: 3 test(s), Total: 3 test(s)
Name: TestConstStrings
Failed: 0 test(s), Passed: 3 test(s), Total: 3 test(s)
Name: TestConstVariables
Failed: 0 test(s), Passed: 3 test(s), Total: 3 test(s)
Name: TestConvenienceVariables
Failed: 0 test(s), Passed: 3 test(s), Total: 3 test(s)
Name: TestCppChainedCalls
Failed: 0 test(s), Passed: 3 test(s), Total: 3 test(s)
Name: TestCppGlobalOperators
Failed: 0 test(s), Passed: 6 test(s), Total: 6 test(s)
Name: TestCppIncompleteTypes
Failed: 0 test(s), Passed: 6 test(s), Total: 6 test(s)
Name: TestCppNsImport
Failed: 0 test(s), Passed: 3 test(s), Total: 3 test(s)
Name: TestCppScope
Failed: 0 test(s), Passed: 6 test(s), Total: 6 test(s)
Name: TestCppValueCast
Failed: 0 test(s), Passed: 6 test(s), Total: 6 test(s)
Name: TestCrashDuringStep
Failed: 0 test(s), Passed: 3 test(s), Total: 3 test(s)
Name: TestCreateAfterAttach
Failed: 0 test(s), Passed: 6 test(s), Total: 6 test(s)
Name: TestCreateDuringInstructionStep
Failed: 0 test(s), Passed: 0 test(s), Total: 1 test(s)
Name: TestCreateDuringStep
Failed: 0 test(s), Passed: 9 test(s), Total: 9 test(s)
Name: TestCxxWCharT
Failed: 0 test(s), Passed: 3 test(s), Total: 3 test(s)
Name: TestDarwinLogBasic
Failed: 0 test(s), Passed: 0 test(s), Total: 1 test(s)
Name: TestDarwinLogFilterMatchActivity
Failed: 0 test(s), Passed: 0 test(s), Total: 4 test(s)
Name: TestDarwinLogFilterMatchActivityChain
Failed: 0 test(s), Passed: 0 test(s), Total: 4 test(s)
Name: TestDarwinLogFilterMatchCategory
Failed: 0 test(s), Passed: 0 test(s), Total: 4 test(s)
Name: TestDarwinLogFilterMatchMessage
Failed: 0 test(s), Passed: 0 test(s), Total: 4 test(s)
Name: TestDarwinLogFilterMatchSubsystem
Failed: 0 test(s), Passed: 0 test(s), Total: 4 test(s)
Name: TestDarwinLogFilterRegexActivity
Failed: 0 test(s), Passed: 0 test(s), Total: 5 test(s)
Name: TestDarwinLogFilterRegexActivityChain
Failed: 0 test(s), Passed: 0 test(s), Total: 5 test(s)
Name: TestDarwinLogFilterRegexCategory
Failed: 0 test(s), Passed: 0 test(s), Total: 5 test(s)
Name: TestDarwinLogFilterRegexMessage
Failed: 0 test(s), Passed: 0 test(s), Total: 5 test(s)
Name: TestDarwinLogFilterRegexSubsystem
Failed: 0 test(s), Passed: 0 test(s), Total: 6 test(s)
Name: TestDarwinLogMessageFormat
Failed: 0 test(s), Passed: 0 test(s), Total: 6 test(s)
Name: TestDarwinLogSourceDebug
Failed: 0 test(s), Passed: 0 test(s), Total: 2 test(s)
Name: TestDarwinLogSourceInfo
Failed: 0 test(s), Passed: 0 test(s), Total: 2 test(s)
Name: TestDarwinNSLogOutput
Failed: 0 test(s), Passed: 2 test(s), Total: 2 test(s)
Name: TestDataFormatterAdv
Failed: 0 test(s), Passed: 3 test(s), Total: 3 test(s)
Name: TestDataFormatterCategories
Failed: 0 test(s), Passed: 3 test(s), Total: 3 test(s)
Name: TestDataFormatterCpp
Failed: 0 test(s), Passed: 3 test(s), Total: 3 test(s)
Name: TestDataFormatterDisabling
Failed: 0 test(s), Passed: 3 test(s), Total: 3 test(s)
Name: TestDataFormatterEnumFormat
Failed: 0 test(s), Passed: 3 test(s), Total: 3 test(s)
Name: TestDataFormatterGlobals
Failed: 0 test(s), Passed: 3 test(s), Total: 3 test(s)
Name: TestDataFormatterHexCaps
Failed: 0 test(s), Passed: 3 test(s), Total: 3 test(s)
Name: TestDataFormatterLanguageCategoryUpdates
Failed: 0 test(s), Passed: 3 test(s), Total: 3 test(s)
Name: TestDataFormatterLibccIterator
Failed: 0 test(s), Passed: 3 test(s), Total: 3 test(s)
Name: TestDataFormatterLibccMap
Failed: 0 test(s), Passed: 3 test(s), Total: 3 test(s)
Name: TestDataFormatterLibccMultiMap
Failed: 0 test(s), Passed: 3 test(s), Total: 3 test(s)
Name: TestDataFormatterLibcxxList
Failed: 0 test(s), Passed: 3 test(s), Total: 3 test(s)
Name: TestDataFormatterLibcxxListLoop
Failed: 0 test(s), Passed: 0 test(s), Total: 3 test(s)
Name: TestDataFormatterLibcxxMultiSet
Failed: 0 test(s), Passed: 3 test(s), Total: 3 test(s)
Name: TestDataFormatterLibcxxSet
Failed: 0 test(s), Passed: 3 test(s), Total: 3 test(s)
Name: TestDataFormatterLibcxxString
Failed: 0 test(s), Passed: 3 test(s), Total: 3 test(s)
Name: TestDataFormatterLibcxxVBool
Failed: 0 test(s), Passed: 3 test(s), Total: 3 test(s)
Name: TestDataFormatterLibcxxVector
Failed: 0 test(s), Passed: 3 test(s), Total: 3 test(s)
Name: TestDataFormatterNSIndexPath
Failed: 0 test(s), Passed: 3 test(s), Total: 3 test(s)
Name: TestDataFormatterNSString
Failed: 0 test(s), Passed: 9 test(s), Total: 9 test(s)
Name: TestDataFormatterNamedSummaries
Failed: 0 test(s), Passed: 3 test(s), Total: 3 test(s)
Name: TestDataFormatterObjC
Failed: 0 test(s), Passed: 36 test(s), Total: 36 test(s)
Name: TestDataFormatterPythonSynth
Failed: 0 test(s), Passed: 6 test(s), Total: 6 test(s)
Name: TestDataFormatterRefPtrRecursion
Failed: 0 test(s), Passed: 3 test(s), Total: 3 test(s)
Name: TestDataFormatterScript
Failed: 0 test(s), Passed: 3 test(s), Total: 3 test(s)
Name: TestDataFormatterSkipSummary
Failed: 0 test(s), Passed: 3 test(s), Total: 3 test(s)
Name: TestDataFormatterSmartArray
Failed: 0 test(s), Passed: 3 test(s), Total: 3 test(s)
Name: TestDataFormatterStdIterator
Failed: 0 test(s), Passed: 3 test(s), Total: 3 test(s)
Name: TestDataFormatterStdList
Failed: 0 test(s), Passed: 3 test(s), Total: 3 test(s)
Name: TestDataFormatterStdMap
Failed: 0 test(s), Passed: 3 test(s), Total: 3 test(s)
Name: TestDataFormatterStdSmartPtr
Failed: 0 test(s), Passed: 0 test(s), Total: 3 test(s)
Name: TestDataFormatterStdString
Failed: 0 test(s), Passed: 3 test(s), Total: 3 test(s)
Name: TestDataFormatterStdTuple
Failed: 0 test(s), Passed: 0 test(s), Total: 3 test(s)
Name: TestDataFormatterStdUniquePtr
Failed: 0 test(s), Passed: 0 test(s), Total: 6 test(s)
Name: TestDataFormatterStdVBool
Failed: 0 test(s), Passed: 0 test(s), Total: 3 test(s)
Name: TestDataFormatterStdVector
Failed: 0 test(s), Passed: 3 test(s), Total: 3 test(s)
Name: TestDataFormatterSynth
Failed: 0 test(s), Passed: 3 test(s), Total: 3 test(s)
Name: TestDataFormatterSynthType
Failed: 0 test(s), Passed: 3 test(s), Total: 3 test(s)
Name: TestDataFormatterSynthVal
Failed: 0 test(s), Passed: 3 test(s), Total: 3 test(s)
Name: TestDataFormatterUnordered
Failed: 0 test(s), Passed: 3 test(s), Total: 3 test(s)
Name: TestDataFormatterVarScriptFormatting
Failed: 0 test(s), Passed: 3 test(s), Total: 3 test(s)
Name: TestDeadStrip
Failed: 0 test(s), Passed: 3 test(s), Total: 3 test(s)
Name: TestDebugBreak
Failed: 0 test(s), Passed: 1 test(s), Total: 1 test(s)
Name: TestDebuggerAPI
Failed: 0 test(s), Passed: 4 test(s), Total: 4 test(s)
Name: TestDeepBundle
Failed: 0 test(s), Passed: 3 test(s), Total: 3 test(s)
Name: TestDefaultCacheLineSize
Failed: 0 test(s), Passed: 0 test(s), Total: 3 test(s)
Name: TestDefaultConstructorForAPIObjects
Failed: 0 test(s), Passed: 36 test(s), Total: 36 test(s)
Name: TestDefiningOverloadedFunctions
Failed: 0 test(s), Passed: 3 test(s), Total: 3 test(s)
Name: TestDiagnoseDereferenceArgument
Failed: 0 test(s), Passed: 0 test(s), Total: 3 test(s)
Name: TestDiagnoseDereferenceFunctionReturn
Failed: 0 test(s), Passed: 0 test(s), Total: 3 test(s)
Name: TestDiagnoseDereferenceThis
Failed: 0 test(s), Passed: 0 test(s), Total: 3 test(s)
Name: TestDiagnoseDereferenceVirtualMethodCall
Failed: 0 test(s), Passed: 0 test(s), Total: 3 test(s)
Name: TestDiagnoseInheritance
Failed: 0 test(s), Passed: 0 test(s), Total: 3 test(s)
Name: TestDiamond
Failed: 0 test(s), Passed: 3 test(s), Total: 3 test(s)
Name: TestDisasmAPI
Failed: 0 test(s), Passed: 3 test(s), Total: 3 test(s)
Name: TestDisassembleBreakpoint
Failed: 0 test(s), Passed: 3 test(s), Total: 3 test(s)
Name: TestDisassembleRawData
Failed: 0 test(s), Passed: 1 test(s), Total: 1 test(s)
Name: TestDisassemble_VST1_64
Failed: 0 test(s), Passed: 0 test(s), Total: 1 test(s)
Name: TestDisassembly
Failed: 0 test(s), Passed: 0 test(s), Total: 2 test(s)
Name: TestDoAttachThenDisassembly
Failed: 0 test(s), Passed: 0 test(s), Total: 1 test(s)
Name: TestDynamicValue
Failed: 0 test(s), Passed: 3 test(s), Total: 3 test(s)
Name: TestDynamicValueChildCount
Failed: 0 test(s), Passed: 3 test(s), Total: 3 test(s)
Name: TestEhFrameUnwind
Failed: 0 test(s), Passed: 0 test(s), Total: 3 test(s)
Name: TestEmulations
Failed: 0 test(s), Passed: 2 test(s), Total: 2 test(s)
Name: TestEnumTypes
Failed: 0 test(s), Passed: 3 test(s), Total: 3 test(s)
Name: TestEnumVariables
Failed: 0 test(s), Passed: 3 test(s), Total: 3 test(s)
Name: TestEqualityOperators
Failed: 0 test(s), Passed: 9 test(s), Total: 9 test(s)
Name: TestEvents
Failed: 0 test(s), Passed: 9 test(s), Total: 9 test(s)
Name: TestExclusivitySuppression
Failed: 0 test(s), Passed: 6 test(s), Total: 6 test(s)
Name: TestExclusivityViolation
Failed: 0 test(s), Passed: 3 test(s), Total: 3 test(s)
Name: TestExec
Failed: 0 test(s), Passed: 3 test(s), Total: 3 test(s)
Name: TestExitDuringBreak
Failed: 0 test(s), Passed: 3 test(s), Total: 3 test(s)
Name: TestExitDuringStep
Failed: 0 test(s), Passed: 9 test(s), Total: 9 test(s)
Name: TestExprDoesntBlock
Failed: 0 test(s), Passed: 3 test(s), Total: 3 test(s)
Name: TestExprHelpExamples
Failed: 0 test(s), Passed: 3 test(s), Total: 3 test(s)
Name: TestExprInProtocolExtension
Failed: 0 test(s), Passed: 3 test(s), Total: 3 test(s)
Name: TestExprOptions
Failed: 0 test(s), Passed: 3 test(s), Total: 3 test(s)
Name: TestExpressionAccessControl
Failed: 0 test(s), Passed: 3 test(s), Total: 3 test(s)
Name: TestExpressionCmd
Failed: 0 test(s), Passed: 0 test(s), Total: 3 test(s)
Name: TestExpressionErrorBreakpoint
Failed: 0 test(s), Passed: 12 test(s), Total: 12 test(s)
Name: TestExpressionErrors
Failed: 0 test(s), Passed: 6 test(s), Total: 6 test(s)
Name: TestExpressionInSyscall
Failed: 0 test(s), Passed: 3 test(s), Total: 3 test(s)
Name: TestExpressionScopes
Failed: 0 test(s), Passed: 3 test(s), Total: 3 test(s)
Name: TestExpressions
Failed: 0 test(s), Passed: 0 test(s), Total: 3 test(s)
Name: TestExprs
Failed: 0 test(s), Passed: 12 test(s), Total: 12 test(s)
Name: TestExprs2
Failed: 0 test(s), Passed: 3 test(s), Total: 3 test(s)
Name: TestExprsChar
Failed: 0 test(s), Passed: 9 test(s), Total: 9 test(s)
Name: TestFatArchives
Failed: 0 test(s), Passed: 1 test(s), Total: 1 test(s)
Name: TestFdLeak
Failed: 0 test(s), Passed: 3 test(s), Total: 3 test(s)
Name: TestFilePrivate
Failed: 0 test(s), Passed: 3 test(s), Total: 3 test(s)
Name: TestFindStructTypes
Failed: 0 test(s), Passed: 1 test(s), Total: 1 test(s)
Name: TestFixIts
Failed: 0 test(s), Passed: 6 test(s), Total: 6 test(s)
Name: TestFloatTypes
Failed: 0 test(s), Passed: 12 test(s), Total: 12 test(s)
Name: TestFloatTypesExpr
Failed: 0 test(s), Passed: 12 test(s), Total: 12 test(s)
Name: TestFormatPropagation
Failed: 0 test(s), Passed: 3 test(s), Total: 3 test(s)
Name: TestFormats
Failed: 0 test(s), Passed: 3 test(s), Total: 3 test(s)
Name: TestFormatters
Failed: 0 test(s), Passed: 3 test(s), Total: 3 test(s)
Name: TestFormattersBoolRefPtr
Failed: 0 test(s), Passed: 3 test(s), Total: 3 test(s)
Name: TestFormattersOneIsSingular
Failed: 0 test(s), Passed: 3 test(s), Total: 3 test(s)
Name: TestFormattersOsType
Failed: 0 test(s), Passed: 3 test(s), Total: 3 test(s)
Name: TestFormattersSBAPI
Failed: 0 test(s), Passed: 6 test(s), Total: 6 test(s)
Name: TestForwardDecl
Failed: 0 test(s), Passed: 3 test(s), Total: 3 test(s)
Name: TestForwardDeclaration
Failed: 0 test(s), Passed: 3 test(s), Total: 3 test(s)
Name: TestFoundationDisassembly
Failed: 0 test(s), Passed: 3 test(s), Total: 6 test(s)
Name: TestFrameDisassemble
Failed: 0 test(s), Passed: 1 test(s), Total: 1 test(s)
Name: TestFrameFormatSmallStruct
Failed: 0 test(s), Passed: 3 test(s), Total: 3 test(s)
Name: TestFrameUtils
Failed: 0 test(s), Passed: 3 test(s), Total: 3 test(s)
Name: TestFrameVar
Failed: 0 test(s), Passed: 1 test(s), Total: 1 test(s)
Name: TestFrameVariableAnonymousUnions
Failed: 0 test(s), Passed: 3 test(s), Total: 3 test(s)
Name: TestFrameVariableResponse
Failed: 0 test(s), Passed: 0 test(s), Total: 1 test(s)
Name: TestFrames
Failed: 0 test(s), Passed: 9 test(s), Total: 9 test(s)
Name: TestFunctionTypes
Failed: 0 test(s), Passed: 6 test(s), Total: 6 test(s)
Name: TestFunctionVariables
Failed: 0 test(s), Passed: 3 test(s), Total: 3 test(s)
Name: TestGCore
Failed: 0 test(s), Passed: 2 test(s), Total: 2 test(s)
Name: TestGdbRemoteAbort
Failed: 0 test(s), Passed: 1 test(s), Total: 2 test(s)
Name: TestGdbRemoteAttach
Failed: 0 test(s), Passed: 1 test(s), Total: 2 test(s)
Name: TestGdbRemoteAuxvSupport
Failed: 0 test(s), Passed: 0 test(s), Total: 7 test(s)
Name: TestGdbRemoteExitCode
Failed: 0 test(s), Passed: 3 test(s), Total: 6 test(s)
Name: TestGdbRemoteExpeditedRegisters
Failed: 0 test(s), Passed: 5 test(s), Total: 10 test(s)
Name: TestGdbRemoteHostInfo
Failed: 0 test(s), Passed: 2 test(s), Total: 4 test(s)
Name: TestGdbRemoteKill
Failed: 0 test(s), Passed: 1 test(s), Total: 2 test(s)
Name: TestGdbRemoteModuleInfo
Failed: 0 test(s), Passed: 0 test(s), Total: 1 test(s)
Name: TestGdbRemoteProcessInfo
Failed: 0 test(s), Passed: 5 test(s), Total: 12 test(s)
Name: TestGdbRemoteRegisterState
Failed: 0 test(s), Passed: 2 test(s), Total: 4 test(s)
Name: TestGdbRemoteSegFault
Failed: 0 test(s), Passed: 1 test(s), Total: 2 test(s)
Name: TestGdbRemoteSingleStep
Failed: 0 test(s), Passed: 1 test(s), Total: 2 test(s)
Name: TestGdbRemoteThreadName
Failed: 0 test(s), Passed: 0 test(s), Total: 1 test(s)
Name: TestGdbRemoteThreadsInStopReply
Failed: 0 test(s), Passed: 5 test(s), Total: 10 test(s)
Name: TestGdbRemote_QPassSignals
Failed: 0 test(s), Passed: 0 test(s), Total: 4 test(s)
Name: TestGdbRemote_qThreadStopInfo
Failed: 0 test(s), Passed: 2 test(s), Total: 6 test(s)
Name: TestGdbRemote_vCont
Failed: 0 test(s), Passed: 6 test(s), Total: 12 test(s)
Name: TestGetVariables
Failed: 0 test(s), Passed: 3 test(s), Total: 3 test(s)
Name: TestGlobalObjects
Failed: 0 test(s), Passed: 3 test(s), Total: 3 test(s)
Name: TestGlobalVariables
Failed: 0 test(s), Passed: 3 test(s), Total: 3 test(s)
Name: TestGoASTContext
Failed: 0 test(s), Passed: 0 test(s), Total: 1 test(s)
Name: TestGoFormatters
Failed: 0 test(s), Passed: 0 test(s), Total: 1 test(s)
Name: TestGoroutines
Failed: 0 test(s), Passed: 0 test(s), Total: 1 test(s)
Name: TestGuessLanguage
Failed: 0 test(s), Passed: 1 test(s), Total: 1 test(s)
Name: TestHWBreakMultiThread
Failed: 0 test(s), Passed: 0 test(s), Total: 2 test(s)
Name: TestHandleSegv
Failed: 0 test(s), Passed: 0 test(s), Total: 3 test(s)
Name: TestHelloWorld
Failed: 0 test(s), Passed: 9 test(s), Total: 9 test(s)
Name: TestHelp
Failed: 0 test(s), Passed: 18 test(s), Total: 18 test(s)
Name: TestHiddenIvars
Failed: 0 test(s), Passed: 11 test(s), Total: 15 test(s)
Name: TestHistoryRecall
Failed: 0 test(s), Passed: 1 test(s), Total: 1 test(s)
Name: TestIRInterpreter
Failed: 0 test(s), Passed: 3 test(s), Total: 3 test(s)
Name: TestIRInterpreterPHINodes
Failed: 0 test(s), Passed: 3 test(s), Total: 3 test(s)
Name: TestImageListMultiArchitecture
Failed: 0 test(s), Passed: 1 test(s), Total: 1 test(s)
Name: TestImport
Failed: 0 test(s), Passed: 1 test(s), Total: 1 test(s)
Name: TestInOutVariables
Failed: 0 test(s), Passed: 3 test(s), Total: 3 test(s)
Name: TestIncompleteModules
Failed: 0 test(s), Passed: 3 test(s), Total: 3 test(s)
Name: TestIndexVariable
Failed: 0 test(s), Passed: 3 test(s), Total: 3 test(s)
Name: TestIndirectEnumVariables
Failed: 0 test(s), Passed: 6 test(s), Total: 6 test(s)
Name: TestIndirectSymbols
Failed: 0 test(s), Passed: 3 test(s), Total: 3 test(s)
Name: TestInferiorAssert
Failed: 0 test(s), Passed: 18 test(s), Total: 18 test(s)
Name: TestInferiorChanged
Failed: 0 test(s), Passed: 1 test(s), Total: 1 test(s)
Name: TestInferiorCrashing
Failed: 0 test(s), Passed: 21 test(s), Total: 21 test(s)
Name: TestInitializerList
Failed: 0 test(s), Passed: 3 test(s), Total: 3 test(s)
Name: TestInlineStepping
Failed: 0 test(s), Passed: 9 test(s), Total: 9 test(s)
Name: TestInlinedBreakpoints
Failed: 0 test(s), Passed: 3 test(s), Total: 3 test(s)
Name: TestInlinedFrame
Failed: 0 test(s), Passed: 3 test(s), Total: 3 test(s)
Name: TestInlines
Failed: 0 test(s), Passed: 3 test(s), Total: 3 test(s)
Name: TestIntegerTypes
Failed: 0 test(s), Passed: 60 test(s), Total: 60 test(s)
Name: TestIntegerTypesExpr
Failed: 0 test(s), Passed: 60 test(s), Total: 60 test(s)
Name: TestInterruptThreadNames
Failed: 0 test(s), Passed: 3 test(s), Total: 3 test(s)
Name: TestJITLoaderGDB
Failed: 0 test(s), Passed: 0 test(s), Total: 3 test(s)
Name: TestLLDBIterator
Failed: 0 test(s), Passed: 9 test(s), Total: 9 test(s)
Name: TestLaunchWithShellExpand
Failed: 0 test(s), Passed: 3 test(s), Total: 3 test(s)
Name: TestLazyReverse
Failed: 0 test(s), Passed: 1 test(s), Total: 1 test(s)
Name: TestLibCxxAtomic
Failed: 0 test(s), Passed: 3 test(s), Total: 3 test(s)
Name: TestLibCxxFunction
Failed: 0 test(s), Passed: 3 test(s), Total: 3 test(s)
Name: TestLinuxCore
Failed: 0 test(s), Passed: 9 test(s), Total: 9 test(s)
Name: TestLinuxCoreThreads
Failed: 0 test(s), Passed: 2 test(s), Total: 2 test(s)
Name: TestListener
Failed: 0 test(s), Passed: 3 test(s), Total: 3 test(s)
Name: TestLldbGdbServer
Failed: 0 test(s), Passed: 32 test(s), Total: 65 test(s)
Name: TestLoadUnload
Failed: 0 test(s), Passed: 18 test(s), Total: 18 test(s)
Name: TestLocalVariable
Failed: 0 test(s), Passed: 0 test(s), Total: 3 test(s)
Name: TestLogging
Failed: 0 test(s), Passed: 5 test(s), Total: 5 test(s)
Name: TestLongjmp
Failed: 0 test(s), Passed: 0 test(s), Total: 9 test(s)
Name: TestMPXRegisters
Failed: 0 test(s), Passed: 0 test(s), Total: 3 test(s)
Name: TestMTCSimple
Failed: 0 test(s), Passed: 3 test(s), Total: 3 test(s)
Name: TestMTCSwift
Failed: 0 test(s), Passed: 3 test(s), Total: 3 test(s)
Name: TestMTCSwiftProperty
Failed: 0 test(s), Passed: 3 test(s), Total: 3 test(s)
Name: TestMacros
Failed: 0 test(s), Passed: 3 test(s), Total: 3 test(s)
Name: TestMembersAndLocalsWithSameName
Failed: 0 test(s), Passed: 6 test(s), Total: 6 test(s)
Name: TestMemoryCache
Failed: 0 test(s), Passed: 3 test(s), Total: 3 test(s)
Name: TestMemoryFind
Failed: 0 test(s), Passed: 3 test(s), Total: 3 test(s)
Name: TestMemoryHistory
Failed: 0 test(s), Passed: 3 test(s), Total: 3 test(s)
Name: TestMemoryRead
Failed: 0 test(s), Passed: 3 test(s), Total: 3 test(s)
Name: TestMiBreak
Failed: 0 test(s), Passed: 7 test(s), Total: 7 test(s)
Name: TestMiCliSupport
Failed: 0 test(s), Passed: 8 test(s), Total: 8 test(s)
Name: TestMiData
Failed: 0 test(s), Passed: 6 test(s), Total: 7 test(s)
Name: TestMiEnvironmentCd
Failed: 0 test(s), Passed: 0 test(s), Total: 1 test(s)
Name: TestMiExec
Failed: 0 test(s), Passed: 9 test(s), Total: 9 test(s)
Name: TestMiExit
Failed: 0 test(s), Passed: 3 test(s), Total: 3 test(s)
Name: TestMiFile
Failed: 0 test(s), Passed: 4 test(s), Total: 4 test(s)
Name: TestMiGdbSetShow
Failed: 0 test(s), Passed: 9 test(s), Total: 9 test(s)
Name: TestMiGdbSetShowPrint
Failed: 0 test(s), Passed: 3 test(s), Total: 3 test(s)
Name: TestMiInterpreterExec
Failed: 0 test(s), Passed: 8 test(s), Total: 8 test(s)
Name: TestMiLexicalScope
Failed: 0 test(s), Passed: 1 test(s), Total: 1 test(s)
Name: TestMiLibraryLoaded
Failed: 0 test(s), Passed: 1 test(s), Total: 1 test(s)
Name: TestMiPrompt
Failed: 0 test(s), Passed: 1 test(s), Total: 1 test(s)
Name: TestMiSignal
Failed: 0 test(s), Passed: 5 test(s), Total: 5 test(s)
Name: TestMiStack
Failed: 0 test(s), Passed: 7 test(s), Total: 7 test(s)
Name: TestMiStartupOptions
Failed: 0 test(s), Passed: 10 test(s), Total: 10 test(s)
Name: TestMiSymbol
Failed: 0 test(s), Passed: 1 test(s), Total: 1 test(s)
Name: TestMiSyntax
Failed: 0 test(s), Passed: 4 test(s), Total: 4 test(s)
Name: TestMiTarget
Failed: 0 test(s), Passed: 3 test(s), Total: 3 test(s)
Name: TestMiThreadInfo
Failed: 0 test(s), Passed: 1 test(s), Total: 1 test(s)
Name: TestMiVar
Failed: 0 test(s), Passed: 5 test(s), Total: 6 test(s)
Name: TestMiniDump
Failed: 0 test(s), Passed: 3 test(s), Total: 5 test(s)
Name: TestMiniDumpNew
Failed: 0 test(s), Passed: 8 test(s), Total: 8 test(s)
Name: TestMixedLanguages
Failed: 0 test(s), Passed: 3 test(s), Total: 3 test(s)
Name: TestModuleAndSection
Failed: 0 test(s), Passed: 9 test(s), Total: 9 test(s)
Name: TestModulesAutoImport
Failed: 0 test(s), Passed: 3 test(s), Total: 3 test(s)
Name: TestModulesInlineFunctions
Failed: 0 test(s), Passed: 3 test(s), Total: 3 test(s)
Name: TestMoveNearest
Failed: 0 test(s), Passed: 1 test(s), Total: 1 test(s)
Name: TestMultilangFormatterCategories
Failed: 0 test(s), Passed: 3 test(s), Total: 3 test(s)
Name: TestMultilevelArrays
Failed: 0 test(s), Passed: 1 test(s), Total: 1 test(s)
Name: TestMultilineExpressions
Failed: 0 test(s), Passed: 2 test(s), Total: 2 test(s)
Name: TestMultipleBreakpoints
Failed: 0 test(s), Passed: 3 test(s), Total: 3 test(s)
Name: TestMultipleDebuggers
Failed: 0 test(s), Passed: 3 test(s), Total: 3 test(s)
Name: TestMultipleDebuggersCommands
Failed: 0 test(s), Passed: 1 test(s), Total: 1 test(s)
Name: TestMultipleHits
Failed: 0 test(s), Passed: 1 test(s), Total: 1 test(s)
Name: TestMultipleTargets
Failed: 0 test(s), Passed: 1 test(s), Total: 1 test(s)
Name: TestMultithreaded
Failed: 0 test(s), Passed: 0 test(s), Total: 12 test(s)
Name: TestMyFirstWatchpoint
Failed: 0 test(s), Passed: 3 test(s), Total: 3 test(s)
Name: TestNSArraySynthetic
Failed: 0 test(s), Passed: 3 test(s), Total: 3 test(s)
Name: TestNSDictionarySynthetic
Failed: 0 test(s), Passed: 3 test(s), Total: 3 test(s)
Name: TestNSError
Failed: 0 test(s), Passed: 3 test(s), Total: 3 test(s)
Name: TestNSObjectSubclass
Failed: 0 test(s), Passed: 1 test(s), Total: 1 test(s)
Name: TestNSSetSynthetic
Failed: 0 test(s), Passed: 3 test(s), Total: 3 test(s)
Name: TestNameLookup
Failed: 0 test(s), Passed: 3 test(s), Total: 3 test(s)
Name: TestNamespace
Failed: 0 test(s), Passed: 12 test(s), Total: 12 test(s)
Name: TestNamespaceDefinitions
Failed: 0 test(s), Passed: 3 test(s), Total: 3 test(s)
Name: TestNamespaceLookup
Failed: 0 test(s), Passed: 24 test(s), Total: 24 test(s)
Name: TestNestedAlias
Failed: 0 test(s), Passed: 3 test(s), Total: 3 test(s)
Name: TestNestedPersistentTypes
Failed: 0 test(s), Passed: 3 test(s), Total: 3 test(s)
Name: TestNoReturnModuleEnd
Failed: 0 test(s), Passed: 1 test(s), Total: 1 test(s)
Name: TestNoSuchArch
Failed: 0 test(s), Passed: 3 test(s), Total: 3 test(s)
Name: TestNoreturnUnwind
Failed: 0 test(s), Passed: 3 test(s), Total: 3 test(s)
Name: TestNumThreads
Failed: 0 test(s), Passed: 0 test(s), Total: 6 test(s)
Name: TestObjCBaseClassSBType
Failed: 0 test(s), Passed: 3 test(s), Total: 3 test(s)
Name: TestObjCBreakpoints
Failed: 0 test(s), Passed: 3 test(s), Total: 3 test(s)
Name: TestObjCBuiltinTypes
Failed: 0 test(s), Passed: 3 test(s), Total: 3 test(s)
Name: TestObjCCheckers
Failed: 0 test(s), Passed: 3 test(s), Total: 3 test(s)
Name: TestObjCClassMethod
Failed: 0 test(s), Passed: 3 test(s), Total: 3 test(s)
Name: TestObjCDynamicSBType
Failed: 0 test(s), Passed: 3 test(s), Total: 3 test(s)
Name: TestObjCDynamicValue
Failed: 0 test(s), Passed: 3 test(s), Total: 3 test(s)
Name: TestObjCImportedTypes
Failed: 0 test(s), Passed: 3 test(s), Total: 3 test(s)
Name: TestObjCIvarDiscovery
Failed: 0 test(s), Passed: 4 test(s), Total: 4 test(s)
Name: TestObjCIvarOffsets
Failed: 0 test(s), Passed: 3 test(s), Total: 3 test(s)
Name: TestObjCIvarStripped
Failed: 0 test(s), Passed: 1 test(s), Total: 3 test(s)
Name: TestObjCIvarsInBlocks
Failed: 0 test(s), Passed: 3 test(s), Total: 3 test(s)
Name: TestObjCMethodReturningBOOL
Failed: 0 test(s), Passed: 3 test(s), Total: 3 test(s)
Name: TestObjCMethods
Failed: 0 test(s), Passed: 12 test(s), Total: 12 test(s)
Name: TestObjCMethods2
Failed: 0 test(s), Passed: 18 test(s), Total: 18 test(s)
Name: TestObjCModules
Failed: 0 test(s), Passed: 3 test(s), Total: 3 test(s)
Name: TestObjCNewSyntax
Failed: 0 test(s), Passed: 30 test(s), Total: 30 test(s)
Name: TestObjCProperty
Failed: 0 test(s), Passed: 3 test(s), Total: 3 test(s)
Name: TestObjCSelf
Failed: 0 test(s), Passed: 3 test(s), Total: 3 test(s)
Name: TestObjCSingleEntryDictionary
Failed: 0 test(s), Passed: 3 test(s), Total: 3 test(s)
Name: TestObjCStaticMethod
Failed: 0 test(s), Passed: 3 test(s), Total: 3 test(s)
Name: TestObjCStaticMethodStripped
Failed: 0 test(s), Passed: 1 test(s), Total: 3 test(s)
Name: TestObjCStepping
Failed: 0 test(s), Passed: 3 test(s), Total: 3 test(s)
Name: TestObjCStructArgument
Failed: 0 test(s), Passed: 3 test(s), Total: 3 test(s)
Name: TestObjCStructReturn
Failed: 0 test(s), Passed: 3 test(s), Total: 3 test(s)
Name: TestObjCSuper
Failed: 0 test(s), Passed: 3 test(s), Total: 3 test(s)
Name: TestObjCType
Failed: 0 test(s), Passed: 3 test(s), Total: 3 test(s)
Name: TestObjCTypeQueryFromOtherCompileUnit
Failed: 0 test(s), Passed: 3 test(s), Total: 3 test(s)
Name: TestObjCXX
Failed: 0 test(s), Passed: 3 test(s), Total: 3 test(s)
Name: TestObjCiVarIMP
Failed: 0 test(s), Passed: 1 test(s), Total: 1 test(s)
Name: TestObjcInference
Failed: 0 test(s), Passed: 3 test(s), Total: 3 test(s)
Name: TestObjcOptimized
Failed: 0 test(s), Passed: 3 test(s), Total: 3 test(s)
Name: TestObjectDescriptionAPI
Failed: 0 test(s), Passed: 3 test(s), Total: 3 test(s)
Name: TestOrderFile
Failed: 0 test(s), Passed: 3 test(s), Total: 3 test(s)
Name: TestOverloadedFunctions
Failed: 0 test(s), Passed: 3 test(s), Total: 3 test(s)
Name: TestPOUnwrapping
Failed: 0 test(s), Passed: 1 test(s), Total: 1 test(s)
Name: TestPaths
Failed: 0 test(s), Passed: 2 test(s), Total: 3 test(s)
Name: TestPersistObjCPointeeType
Failed: 0 test(s), Passed: 3 test(s), Total: 3 test(s)
Name: TestPersistentPtrUpdate
Failed: 0 test(s), Passed: 3 test(s), Total: 3 test(s)
Name: TestPersistentTypes
Failed: 0 test(s), Passed: 3 test(s), Total: 3 test(s)
Name: TestPersistentVariables
Failed: 0 test(s), Passed: 3 test(s), Total: 3 test(s)
Name: TestPlatformCommand
Failed: 0 test(s), Passed: 7 test(s), Total: 8 test(s)
Name: TestPlatformProcessConnect
Failed: 0 test(s), Passed: 0 test(s), Total: 1 test(s)
Name: TestPlaygrounds
Failed: 0 test(s), Passed: 1 test(s), Total: 3 test(s)
Name: TestPluginCommands
Failed: 0 test(s), Passed: 1 test(s), Total: 1 test(s)
Name: TestPoVerbosity
Failed: 0 test(s), Passed: 3 test(s), Total: 3 test(s)
Name: TestPreRunDylibs
Failed: 0 test(s), Passed: 1 test(s), Total: 1 test(s)
Name: TestPrintArray
Failed: 0 test(s), Passed: 3 test(s), Total: 3 test(s)
Name: TestPrintObj
Failed: 0 test(s), Passed: 3 test(s), Total: 3 test(s)
Name: TestPrintObjectArray
Failed: 0 test(s), Passed: 3 test(s), Total: 3 test(s)
Name: TestPrintStackTraces
Failed: 0 test(s), Passed: 3 test(s), Total: 3 test(s)
Name: TestPrintfAfterUp
Failed: 0 test(s), Passed: 3 test(s), Total: 3 test(s)
Name: TestProcessAPI
Failed: 0 test(s), Passed: 15 test(s), Total: 15 test(s)
Name: TestProcessAttach
Failed: 0 test(s), Passed: 3 test(s), Total: 3 test(s)
Name: TestProcessIO
Failed: 0 test(s), Passed: 15 test(s), Total: 15 test(s)
Name: TestProcessLaunch
Failed: 0 test(s), Passed: 9 test(s), Total: 9 test(s)
Name: TestProcessSaveCore
Failed: 0 test(s), Passed: 0 test(s), Total: 6 test(s)
Name: TestPtrRef2Typedef
Failed: 0 test(s), Passed: 3 test(s), Total: 3 test(s)
Name: TestPtrRefs
Failed: 0 test(s), Passed: 3 test(s), Total: 3 test(s)
Name: TestPtrRefsObjC
Failed: 0 test(s), Passed: 3 test(s), Total: 3 test(s)
Name: TestPtrToArrayFormatting
Failed: 0 test(s), Passed: 3 test(s), Total: 3 test(s)
Name: TestPublicAPIHeaders
Failed: 0 test(s), Passed: 3 test(s), Total: 3 test(s)
Name: TestPyObjSynthProvider
Failed: 0 test(s), Passed: 1 test(s), Total: 1 test(s)
Name: TestPythonOSPlugin
Failed: 0 test(s), Passed: 3 test(s), Total: 3 test(s)
Name: TestQueues
Failed: 0 test(s), Passed: 3 test(s), Total: 3 test(s)
Name: TestQuoting
Failed: 0 test(s), Passed: 11 test(s), Total: 11 test(s)
Name: TestREPLBreakpoints
Failed: 0 test(s), Passed: 1 test(s), Total: 1 test(s)
Name: TestREPLClasses
Failed: 0 test(s), Passed: 1 test(s), Total: 1 test(s)
Name: TestREPLClosure
Failed: 0 test(s), Passed: 1 test(s), Total: 1 test(s)
Name: TestREPLDictionary
Failed: 0 test(s), Passed: 1 test(s), Total: 1 test(s)
Name: TestREPLDynamicType
Failed: 0 test(s), Passed: 1 test(s), Total: 1 test(s)
Name: TestREPLFunctionDefinition
Failed: 0 test(s), Passed: 1 test(s), Total: 1 test(s)
Name: TestREPLIntVars
Failed: 0 test(s), Passed: 1 test(s), Total: 1 test(s)
Name: TestREPLNSString
Failed: 0 test(s), Passed: 1 test(s), Total: 1 test(s)
Name: TestREPLQuickLookObject
Failed: 0 test(s), Passed: 1 test(s), Total: 1 test(s)
Name: TestREPLRecursiveClass
Failed: 0 test(s), Passed: 1 test(s), Total: 1 test(s)
Name: TestREPLStructs
Failed: 0 test(s), Passed: 1 test(s), Total: 1 test(s)
Name: TestREPLTypeLookup
Failed: 0 test(s), Passed: 1 test(s), Total: 1 test(s)
Name: TestRaise
Failed: 0 test(s), Passed: 3 test(s), Total: 4 test(s)
Name: TestRdar10967107
Failed: 0 test(s), Passed: 3 test(s), Total: 3 test(s)
Name: TestRdar11355592
Failed: 0 test(s), Passed: 3 test(s), Total: 3 test(s)
Name: TestRdar12408181
Failed: 0 test(s), Passed: 0 test(s), Total: 3 test(s)
Name: TestRdar12586188
Failed: 0 test(s), Passed: 1 test(s), Total: 1 test(s)
Name: TestRealDefinition
Failed: 0 test(s), Passed: 6 test(s), Total: 6 test(s)
Name: TestRecursiveInferior
Failed: 0 test(s), Passed: 21 test(s), Total: 21 test(s)
Name: TestRecursiveTypes
Failed: 0 test(s), Passed: 6 test(s), Total: 6 test(s)
Name: TestRegexpBreakCommand
Failed: 0 test(s), Passed: 3 test(s), Total: 3 test(s)
Name: TestRegisterVariables
Failed: 0 test(s), Passed: 3 test(s), Total: 3 test(s)
Name: TestRegisters
Failed: 0 test(s), Passed: 7 test(s), Total: 7 test(s)
Name: TestRegistersIterator
Failed: 0 test(s), Passed: 3 test(s), Total: 3 test(s)
Name: TestRepeatedExprs
Failed: 0 test(s), Passed: 0 test(s), Total: 3 test(s)
Name: TestReportData
Failed: 0 test(s), Passed: 3 test(s), Total: 3 test(s)
Name: TestRerun
Failed: 0 test(s), Passed: 3 test(s), Total: 3 test(s)
Name: TestResilience
Failed: 0 test(s), Passed: 3 test(s), Total: 3 test(s)
Name: TestReturnValue
Failed: 0 test(s), Passed: 6 test(s), Total: 6 test(s)
Name: TestRuntimeTypes
Failed: 0 test(s), Passed: 3 test(s), Total: 3 test(s)
Name: TestRvalueReferences
Failed: 0 test(s), Passed: 3 test(s), Total: 3 test(s)
Name: TestSBData
Failed: 0 test(s), Passed: 6 test(s), Total: 6 test(s)
Name: TestSBFrameFindValue
Failed: 0 test(s), Passed: 3 test(s), Total: 3 test(s)
Name: TestSBTypeClassMembers
Failed: 0 test(s), Passed: 3 test(s), Total: 3 test(s)
Name: TestSBValuePersist
Failed: 0 test(s), Passed: 3 test(s), Total: 3 test(s)
Name: TestSBValueUpdates
Failed: 0 test(s), Passed: 3 test(s), Total: 3 test(s)
Name: TestSTL
Failed: 0 test(s), Passed: 6 test(s), Total: 6 test(s)
Name: TestSTTYBeforeAndAfter
Failed: 0 test(s), Passed: 1 test(s), Total: 1 test(s)
Name: TestSafeFuncCalls
Failed: 0 test(s), Passed: 3 test(s), Total: 3 test(s)
Name: TestSampleTest
Failed: 0 test(s), Passed: 1 test(s), Total: 1 test(s)
Name: TestSaveJITObjects
Failed: 0 test(s), Passed: 3 test(s), Total: 3 test(s)
Name: TestSectionAPI
Failed: 0 test(s), Passed: 3 test(s), Total: 3 test(s)
Name: TestSendSignal
Failed: 0 test(s), Passed: 3 test(s), Total: 3 test(s)
Name: TestSequenceFunctions
Failed: 0 test(s), Passed: 3 test(s), Total: 3 test(s)
Name: TestSetData
Failed: 0 test(s), Passed: 3 test(s), Total: 3 test(s)
Name: TestSetValues
Failed: 0 test(s), Passed: 3 test(s), Total: 3 test(s)
Name: TestSetWatchlocation
Failed: 0 test(s), Passed: 3 test(s), Total: 3 test(s)
Name: TestSetWatchpoint
Failed: 0 test(s), Passed: 3 test(s), Total: 3 test(s)
Name: TestSettings
Failed: 0 test(s), Passed: 29 test(s), Total: 29 test(s)
Name: TestSharedLib
Failed: 0 test(s), Passed: 9 test(s), Total: 9 test(s)
Name: TestSharedLibStrippedSymbols
Failed: 0 test(s), Passed: 6 test(s), Total: 6 test(s)
Name: TestSignalsAPI
Failed: 0 test(s), Passed: 3 test(s), Total: 3 test(s)
Name: TestSignedTypes
Failed: 0 test(s), Passed: 3 test(s), Total: 3 test(s)
Name: TestSigtrampUnwind
Failed: 0 test(s), Passed: 3 test(s), Total: 3 test(s)
Name: TestSimpleExpressions
Failed: 0 test(s), Passed: 3 test(s), Total: 3 test(s)
Name: TestSingleQuoteInFilename
Failed: 0 test(s), Passed: 1 test(s), Total: 1 test(s)
Name: TestSourceManager
Failed: 0 test(s), Passed: 5 test(s), Total: 5 test(s)
Name: TestSourceRegexBreakpoints
Failed: 0 test(s), Passed: 6 test(s), Total: 6 test(s)
Name: TestStandardUnwind
Failed: 0 test(s), Passed: 0 test(s), Total: 3 test(s)
Name: TestStartupDelays
Failed: 0 test(s), Passed: 0 test(s), Total: 1 test(s)
Name: TestStaticVariables
Failed: 0 test(s), Passed: 6 test(s), Total: 6 test(s)
Name: TestStdCXXDisassembly
Failed: 0 test(s), Passed: 0 test(s), Total: 3 test(s)
Name: TestStepAndBreakpoints
Failed: 0 test(s), Passed: 3 test(s), Total: 3 test(s)
Name: TestStepNoDebug
Failed: 0 test(s), Passed: 9 test(s), Total: 9 test(s)
Name: TestStepOverBreakpoint
Failed: 0 test(s), Passed: 6 test(s), Total: 6 test(s)
Name: TestStepOverWatchpoint
Failed: 0 test(s), Passed: 3 test(s), Total: 3 test(s)
Name: TestStepTarget
Failed: 0 test(s), Passed: 15 test(s), Total: 15 test(s)
Name: TestStepUntil
Failed: 0 test(s), Passed: 12 test(s), Total: 12 test(s)
Name: TestSteppingSpeed
Failed: 0 test(s), Passed: 0 test(s), Total: 1 test(s)
Name: TestStopHookCmd
Failed: 0 test(s), Passed: 4 test(s), Total: 4 test(s)
Name: TestStopHookMechanism
Failed: 0 test(s), Passed: 3 test(s), Total: 3 test(s)
Name: TestStopHookMultipleThreads
Failed: 0 test(s), Passed: 3 test(s), Total: 3 test(s)
Name: TestStructuredDataAPI
Failed: 0 test(s), Passed: 1 test(s), Total: 1 test(s)
Name: TestStubReverseConnect
Failed: 0 test(s), Passed: 1 test(s), Total: 2 test(s)
Name: TestStubSetSID
Failed: 0 test(s), Passed: 3 test(s), Total: 6 test(s)
Name: TestSubmoduleImport
Failed: 0 test(s), Passed: 3 test(s), Total: 3 test(s)
Name: TestSwiftAddressOf
Failed: 0 test(s), Passed: 1 test(s), Total: 1 test(s)
Name: TestSwiftAnyObjectType
Failed: 0 test(s), Passed: 3 test(s), Total: 3 test(s)
Name: TestSwiftAnyType
Failed: 0 test(s), Passed: 3 test(s), Total: 3 test(s)
Name: TestSwiftArchetypeResolution
Failed: 0 test(s), Passed: 3 test(s), Total: 3 test(s)
Name: TestSwiftArrayType
Failed: 0 test(s), Passed: 3 test(s), Total: 3 test(s)
Name: TestSwiftAssociatedTypeResolution
Failed: 0 test(s), Passed: 3 test(s), Total: 3 test(s)
Name: TestSwiftAtObjCIvars
Failed: 0 test(s), Passed: 3 test(s), Total: 3 test(s)
Name: TestSwiftBacktracePrinting
Failed: 0 test(s), Passed: 3 test(s), Total: 3 test(s)
Name: TestSwiftBool
Failed: 0 test(s), Passed: 3 test(s), Total: 3 test(s)
Name: TestSwiftBreakByPartialName
Failed: 0 test(s), Passed: 3 test(s), Total: 3 test(s)
Name: TestSwiftBridgedArray
Failed: 0 test(s), Passed: 3 test(s), Total: 3 test(s)
Name: TestSwiftBridgedMetatype
Failed: 0 test(s), Passed: 3 test(s), Total: 3 test(s)
Name: TestSwiftBridgedStringVariables
Failed: 0 test(s), Passed: 3 test(s), Total: 3 test(s)
Name: TestSwiftClassTypes
Failed: 0 test(s), Passed: 3 test(s), Total: 3 test(s)
Name: TestSwiftClosures
Failed: 0 test(s), Passed: 4 test(s), Total: 4 test(s)
Name: TestSwiftConditionalBreakpoint
Failed: 0 test(s), Passed: 3 test(s), Total: 3 test(s)
Name: TestSwiftCrossModuleExtension
Failed: 0 test(s), Passed: 3 test(s), Total: 3 test(s)
Name: TestSwiftDictionaryNSObjectAnyObject
Failed: 0 test(s), Passed: 3 test(s), Total: 3 test(s)
Name: TestSwiftDifferentClangFlags
Failed: 0 test(s), Passed: 1 test(s), Total: 3 test(s)
Name: TestSwiftDynamicValue
Failed: 0 test(s), Passed: 3 test(s), Total: 3 test(s)
Name: TestSwiftExpressionsInClassFunctions
Failed: 0 test(s), Passed: 3 test(s), Total: 3 test(s)
Name: TestSwiftExpressionsInMethodsFromObjc
Failed: 0 test(s), Passed: 3 test(s), Total: 3 test(s)
Name: TestSwiftExpressionsInMethodsPureSwift
Failed: 0 test(s), Passed: 3 test(s), Total: 3 test(s)
Name: TestSwiftFixIts
Failed: 0 test(s), Passed: 3 test(s), Total: 3 test(s)
Name: TestSwiftGenericEnums
Failed: 0 test(s), Passed: 3 test(s), Total: 3 test(s)
Name: TestSwiftGenericExpressions
Failed: 0 test(s), Passed: 6 test(s), Total: 6 test(s)
Name: TestSwiftGenericTupleLabels
Failed: 0 test(s), Passed: 3 test(s), Total: 3 test(s)
Name: TestSwiftGenericTypes
Failed: 0 test(s), Passed: 3 test(s), Total: 3 test(s)
Name: TestSwiftGenericsResolution
Failed: 0 test(s), Passed: 3 test(s), Total: 3 test(s)
Name: TestSwiftGetValueAsUnsigned
Failed: 0 test(s), Passed: 3 test(s), Total: 3 test(s)
Name: TestSwiftGlobals
Failed: 0 test(s), Passed: 3 test(s), Total: 3 test(s)
Name: TestSwiftHideRuntimeSupport
Failed: 0 test(s), Passed: 3 test(s), Total: 3 test(s)
Name: TestSwiftInstancePointerSetSP
Failed: 0 test(s), Passed: 3 test(s), Total: 3 test(s)
Name: TestSwiftLetInt
Failed: 0 test(s), Passed: 3 test(s), Total: 3 test(s)
Name: TestSwiftMetadataSymbols
Failed: 0 test(s), Passed: 3 test(s), Total: 3 test(s)
Name: TestSwiftMetatype
Failed: 0 test(s), Passed: 3 test(s), Total: 3 test(s)
Name: TestSwiftMixAnyObjectType
Failed: 0 test(s), Passed: 3 test(s), Total: 3 test(s)
Name: TestSwiftModuleSearchPaths
Failed: 0 test(s), Passed: 3 test(s), Total: 3 test(s)
Name: TestSwiftMultipayloadEnum
Failed: 0 test(s), Passed: 3 test(s), Total: 3 test(s)
Name: TestSwiftNestedArray
Failed: 0 test(s), Passed: 3 test(s), Total: 3 test(s)
Name: TestSwiftNoProcess
Failed: 0 test(s), Passed: 6 test(s), Total: 6 test(s)
Name: TestSwiftObjCOptionals
Failed: 0 test(s), Passed: 3 test(s), Total: 3 test(s)
Name: TestSwiftOneCaseEnum
Failed: 0 test(s), Passed: 3 test(s), Total: 3 test(s)
Name: TestSwiftOptionals
Failed: 0 test(s), Passed: 3 test(s), Total: 3 test(s)
Name: TestSwiftPathWithColons
Failed: 0 test(s), Passed: 3 test(s), Total: 3 test(s)
Name: TestSwiftPrivateDeclName
Failed: 0 test(s), Passed: 3 test(s), Total: 3 test(s)
Name: TestSwiftPrivateTypeAlias
Failed: 0 test(s), Passed: 3 test(s), Total: 3 test(s)
Name: TestSwiftProtocolTypes
Failed: 0 test(s), Passed: 3 test(s), Total: 3 test(s)
Name: TestSwiftRangeTypes
Failed: 0 test(s), Passed: 3 test(s), Total: 3 test(s)
Name: TestSwiftReferenceStorageTypes
Failed: 0 test(s), Passed: 3 test(s), Total: 3 test(s)
Name: TestSwiftReturns
Failed: 0 test(s), Passed: 1 test(s), Total: 1 test(s)
Name: TestSwiftStaticLinkingMacOS
Failed: 0 test(s), Passed: 0 test(s), Total: 1 test(s)
Name: TestSwiftStaticStringVariables
Failed: 0 test(s), Passed: 3 test(s), Total: 3 test(s)
Name: TestSwiftStdlibDictionary
Failed: 0 test(s), Passed: 3 test(s), Total: 3 test(s)
Name: TestSwiftStdlibSet
Failed: 0 test(s), Passed: 3 test(s), Total: 3 test(s)
Name: TestSwiftStepping
Failed: 3 test(s), Passed: 0 test(s), Total: 3 test(s)
Failed: TestSwiftStepping.TestSwiftStepping.test_swift_stepping_dsym <https://ci.swift.org/job/oss-lldb-incremental-osx/383/testReport/junit/TestSwiftStepping/TestSwiftStepping/test_swift_stepping_dsym>
Failed: TestSwiftStepping.TestSwiftStepping.test_swift_stepping_dwarf <https://ci.swift.org/job/oss-lldb-incremental-osx/383/testReport/junit/TestSwiftStepping/TestSwiftStepping/test_swift_stepping_dwarf>
Failed: TestSwiftStepping.TestSwiftStepping.test_swift_stepping_gmodules <https://ci.swift.org/job/oss-lldb-incremental-osx/383/testReport/junit/TestSwiftStepping/TestSwiftStepping/test_swift_stepping_gmodules>
Name: TestSwiftStringVariables
Failed: 0 test(s), Passed: 3 test(s), Total: 3 test(s)
Name: TestSwiftStructChangeRerun
Failed: 0 test(s), Passed: 1 test(s), Total: 3 test(s)
Name: TestSwiftStructInit
Failed: 0 test(s), Passed: 3 test(s), Total: 3 test(s)
Name: TestSwiftTuple
Failed: 0 test(s), Passed: 3 test(s), Total: 3 test(s)
Name: TestSwiftTupleTypes
Failed: 0 test(s), Passed: 3 test(s), Total: 3 test(s)
Name: TestSwiftTypeAliasFormatters
Failed: 0 test(s), Passed: 3 test(s), Total: 3 test(s)
Name: TestSwiftTypeLookup
Failed: 0 test(s), Passed: 3 test(s), Total: 3 test(s)
Name: TestSwiftTypeMetadata
Failed: 0 test(s), Passed: 3 test(s), Total: 3 test(s)
Name: TestSwiftTypes
Failed: 0 test(s), Passed: 3 test(s), Total: 3 test(s)
Name: TestSwiftValueOfOptionals
Failed: 0 test(s), Passed: 3 test(s), Total: 3 test(s)
Name: TestSwiftVersion
Failed: 0 test(s), Passed: 3 test(s), Total: 3 test(s)
Name: TestSwiftieFormatting
Failed: 0 test(s), Passed: 3 test(s), Total: 3 test(s)
Name: TestSymbolAPI
Failed: 0 test(s), Passed: 3 test(s), Total: 3 test(s)
Name: TestSymbolContext
Failed: 0 test(s), Passed: 3 test(s), Total: 3 test(s)
Name: TestSymbolContextTwoFiles
Failed: 0 test(s), Passed: 6 test(s), Total: 6 test(s)
Name: TestSymbolTable
Failed: 0 test(s), Passed: 3 test(s), Total: 3 test(s)
Name: TestSyntheticCapping
Failed: 0 test(s), Passed: 3 test(s), Total: 3 test(s)
Name: TestSyntheticFilterRecompute
Failed: 0 test(s), Passed: 3 test(s), Total: 3 test(s)
Name: TestTargetAPI
Failed: 0 test(s), Passed: 30 test(s), Total: 30 test(s)
Name: TestTargetCommand
Failed: 0 test(s), Passed: 9 test(s), Total: 9 test(s)
Name: TestTargetWatchAddress
Failed: 0 test(s), Passed: 6 test(s), Total: 6 test(s)
Name: TestTemplateArgs
Failed: 0 test(s), Passed: 6 test(s), Total: 6 test(s)
Name: TestTerminal
Failed: 0 test(s), Passed: 0 test(s), Total: 1 test(s)
Name: TestTestId
Failed: 0 test(s), Passed: 1 test(s), Total: 1 test(s)
Name: TestThreadAPI
Failed: 0 test(s), Passed: 15 test(s), Total: 15 test(s)
Name: TestThreadExit
Failed: 0 test(s), Passed: 3 test(s), Total: 3 test(s)
Name: TestThreadJump
Failed: 0 test(s), Passed: 3 test(s), Total: 3 test(s)
Name: TestThreadSpecificBpPlusCondition
Failed: 0 test(s), Passed: 3 test(s), Total: 3 test(s)
Name: TestThreadSpecificBreakpoint
Failed: 0 test(s), Passed: 3 test(s), Total: 3 test(s)
Name: TestThreadStates
Failed: 0 test(s), Passed: 9 test(s), Total: 15 test(s)
Name: TestThreadStepOut
Failed: 0 test(s), Passed: 9 test(s), Total: 9 test(s)
Name: TestThreadStepping
Failed: 0 test(s), Passed: 3 test(s), Total: 3 test(s)
Name: TestTlsGlobals
Failed: 0 test(s), Passed: 3 test(s), Total: 3 test(s)
Name: TestTopLevelExprs
Failed: 0 test(s), Passed: 2 test(s), Total: 3 test(s)
Name: TestTsanBasic
Failed: 0 test(s), Passed: 3 test(s), Total: 3 test(s)
Name: TestTsanCPPGlobalLocation
Failed: 0 test(s), Passed: 3 test(s), Total: 3 test(s)
Name: TestTsanGlobalLocation
Failed: 0 test(s), Passed: 3 test(s), Total: 3 test(s)
Name: TestTsanMultiple
Failed: 0 test(s), Passed: 3 test(s), Total: 3 test(s)
Name: TestTsanSwift
Failed: 0 test(s), Passed: 3 test(s), Total: 3 test(s)
Name: TestTsanThreadLeak
Failed: 0 test(s), Passed: 3 test(s), Total: 3 test(s)
Name: TestTsanThreadNumbers
Failed: 0 test(s), Passed: 3 test(s), Total: 3 test(s)
Name: TestTypeCompletion
Failed: 0 test(s), Passed: 3 test(s), Total: 3 test(s)
Name: TestTypeList
Failed: 0 test(s), Passed: 3 test(s), Total: 3 test(s)
Name: TestTypeLookup
Failed: 0 test(s), Passed: 3 test(s), Total: 3 test(s)
Name: TestTypeSummaryListArg
Failed: 0 test(s), Passed: 1 test(s), Total: 1 test(s)
Name: TestTypeSummaryListScript
Failed: 0 test(s), Passed: 3 test(s), Total: 3 test(s)
Name: TestUbsanBasic
Failed: 0 test(s), Passed: 0 test(s), Total: 3 test(s)
Name: TestUbsanUserExpression
Failed: 0 test(s), Passed: 0 test(s), Total: 3 test(s)
Name: TestUnicodeLiterals
Failed: 0 test(s), Passed: 9 test(s), Total: 9 test(s)
Name: TestUnionMembers
Failed: 0 test(s), Passed: 3 test(s), Total: 3 test(s)
Name: TestUniqueTypes
Failed: 0 test(s), Passed: 3 test(s), Total: 3 test(s)
Name: TestUnitTests
Failed: 0 test(s), Passed: 1 test(s), Total: 3 test(s)
Name: TestUniversal
Failed: 0 test(s), Passed: 9 test(s), Total: 9 test(s)
Name: TestUnsignedTypes
Failed: 0 test(s), Passed: 3 test(s), Total: 3 test(s)
Name: TestUnwindExpression
Failed: 0 test(s), Passed: 4 test(s), Total: 4 test(s)
Name: TestUserFormatVsSummary
Failed: 0 test(s), Passed: 3 test(s), Total: 3 test(s)
Name: TestValueAPI
Failed: 0 test(s), Passed: 3 test(s), Total: 3 test(s)
Name: TestValueAPIEmptyClass
Failed: 0 test(s), Passed: 3 test(s), Total: 3 test(s)
Name: TestValueAPILinkedList
Failed: 0 test(s), Passed: 3 test(s), Total: 3 test(s)
Name: TestValueMD5Crash
Failed: 0 test(s), Passed: 3 test(s), Total: 3 test(s)
Name: TestValueObjectRecursion
Failed: 0 test(s), Passed: 3 test(s), Total: 3 test(s)
Name: TestValueOfVectorVariable
Failed: 0 test(s), Passed: 3 test(s), Total: 3 test(s)
Name: TestValueVarUpdate
Failed: 0 test(s), Passed: 3 test(s), Total: 3 test(s)
Name: TestVarInAggregateMisuse
Failed: 0 test(s), Passed: 3 test(s), Total: 3 test(s)
Name: TestVectorTypesFormatting
Failed: 0 test(s), Passed: 3 test(s), Total: 3 test(s)
Name: TestVirtual
Failed: 0 test(s), Passed: 3 test(s), Total: 3 test(s)
Name: TestWatchLocation
Failed: 0 test(s), Passed: 0 test(s), Total: 3 test(s)
Name: TestWatchLocationWithWatchSet
Failed: 0 test(s), Passed: 3 test(s), Total: 3 test(s)
Name: TestWatchedVarHitWhenInScope
Failed: 0 test(s), Passed: 3 test(s), Total: 3 test(s)
Name: TestWatchpointCommandLLDB
Failed: 0 test(s), Passed: 6 test(s), Total: 6 test(s)
Name: TestWatchpointCommandPython
Failed: 0 test(s), Passed: 6 test(s), Total: 6 test(s)
Name: TestWatchpointCommands
Failed: 0 test(s), Passed: 15 test(s), Total: 15 test(s)
Name: TestWatchpointConditionAPI
Failed: 0 test(s), Passed: 3 test(s), Total: 3 test(s)
Name: TestWatchpointConditionCmd
Failed: 0 test(s), Passed: 3 test(s), Total: 3 test(s)
Name: TestWatchpointDisable
Failed: 0 test(s), Passed: 6 test(s), Total: 6 test(s)
Name: TestWatchpointEvents
Failed: 0 test(s), Passed: 3 test(s), Total: 3 test(s)
Name: TestWatchpointIgnoreCount
Failed: 0 test(s), Passed: 3 test(s), Total: 3 test(s)
Name: TestWatchpointIter
Failed: 0 test(s), Passed: 3 test(s), Total: 3 test(s)
Name: TestWatchpointMultipleSlots
Failed: 0 test(s), Passed: 0 test(s), Total: 1 test(s)
Name: TestWatchpointMultipleThreads
Failed: 0 test(s), Passed: 6 test(s), Total: 6 test(s)
Name: TestWatchpointSetErrorCases
Failed: 0 test(s), Passed: 3 test(s), Total: 3 test(s)
Name: TestWatchpointSizes
Failed: 0 test(s), Passed: 3 test(s), Total: 3 test(s)
Name: TestWithLimitDebugInfo
Failed: 0 test(s), Passed: 1 test(s), Total: 3 test(s)
Name: TestWithModuleDebugging
Failed: 0 test(s), Passed: 1 test(s), Total: 1 test(s)
Name: TestWow64MiniDump
Failed: 0 test(s), Passed: 3 test(s), Total: 3 test(s)
Name: TestXcode41Vs42GDBDisassembly
Failed: 0 test(s), Passed: 0 test(s), Total: 2 test(s)
Name: TestYMMRegister
Failed: 0 test(s), Passed: 1 test(s), Total: 1 test(s)
Name: Testtypedef
Failed: 0 test(s), Passed: 3 test(s), Total: 3 test(s)
Name: lldbsuite.test.lldbtest
Failed: 0 test(s), Passed: 229 test(s), Total: 232 test(s)

Changes

Commit c01d68c5ccb135465e5c3b81515f1e65ec80aeda by arphaman:
Clarify the error message for unsupported aliases on Darwin

edit: include/clang/Basic/DiagnosticSemaKinds.td
edit: test/Sema/attr-alias.c

Commit a031d276503e8d0a6ff54c2fde97ba0e6db5ba22 by arphaman:
[ObjC++] Don't warn about pessimizing move for __block variables

edit: lib/Sema/SemaInit.cpp
add: test/SemaObjCXX/block-variable-move.mm

Commit bb1e23e23a8a04da7a0895e9db25b8f867d8065f by arphaman:
[ObjC] Boxed strings should use the nullability from

add: test/SemaObjC/transfer-boxed-string-nullability.m
edit: lib/Sema/SemaExprObjC.cpp

Commit c532fbe2e505f69d711feaf7fedfe045d7ed3b90 by arphaman:
[ObjC] Fix function signature handling for blocks literals with

add: test/SemaObjC/block-literal-with-attribute.m
edit: lib/Sema/SemaExpr.cpp

Commit 9b10de6a1212eaaa7b47fba77f4ab18ca078600a by arphaman:
Remove redundant copy-pasted comment in test file from r317736

edit: test/SemaObjC/block-literal-with-attribute.m

Commit 0e747a4dee6381c875134ee2a473ce5469daafd3 by ahmed.bougacha:
[CodeGen] Fix some Clang-tidy modernize-use-using and Include What You

edit: include/llvm/CodeGen/GlobalISel/InstructionSelector.h
edit: lib/CodeGen/GlobalISel/InstructionSelector.cpp

Commit e560a153f86950508820af385ee2b1ca5eafcb1f by ahmed.bougacha:
[Legalizer] Add support for G_OR NarrowScalar.

edit: lib/CodeGen/GlobalISel/LegalizerHelper.cpp
edit: test/CodeGen/AArch64/GlobalISel/legalize-or.mir
edit: lib/CodeGen/GlobalISel/LegalizerInfo.cpp

Commit 5a56b39a6303d0e46578a6b1573ebba4b17aab2e by ahmed.bougacha:
[X86] Fix some Clang-tidy modernize-use-using and Include What You Use

edit: lib/Target/X86/X86CallLowering.cpp
edit: include/llvm/CodeGen/GlobalISel/InstructionSelectorImpl.h
edit: lib/Target/X86/X86InstructionSelector.cpp
edit: lib/Target/X86/X86CallLowering.h

Commit a89b5e8184fbb90369fcd53704d79b0aeb01f51e by ahmed.bougacha:
[ARM] GlobalISel: Mark shifts as legal for s32

edit: lib/Target/ARM/ARMLegalizerInfo.cpp
edit: test/CodeGen/ARM/GlobalISel/arm-legalizer.mir

Commit a9916751b9142f6e6259b97e4c7345c6cfa08954 by ahmed.bougacha:
[ARM] GlobalISel: Map shift operands to GPRs

edit: test/CodeGen/ARM/GlobalISel/arm-regbankselect.mir
edit: lib/Target/ARM/ARMRegisterBankInfo.cpp

Commit d12cabeb6caffac13a60dd19f398ed1c6120ea58 by ahmed.bougacha:
[ARM] GlobalISel: Select shifts

edit: lib/Target/ARM/ARMInstructionSelector.cpp
edit: test/CodeGen/ARM/GlobalISel/arm-instruction-select.mir

Commit ae0ef4c252e1811077df45f6cf5d0b94bc206213 by ahmed.bougacha:
[ARM] GlobalISel: Make tests less strict

edit: test/CodeGen/ARM/GlobalISel/arm-isel-divmod.ll
edit: test/CodeGen/ARM/GlobalISel/arm-isel.ll

Commit fbb9aa5acaea3d45ea724bcdb489c51f060e5dd5 by ahmed.bougacha:
[GlobalISel] Fix legalizer trying to process a deleted instruction.

edit: include/llvm/CodeGen/GlobalISel/LegalizerCombiner.h
add: test/CodeGen/AArch64/GlobalISel/combine-anyext-crash.mir

Commit 3b3706e1e0d8d968ef14ff8f1c280b35c265e1e7 by ahmed.bougacha:
[AArch64][GlobalISel] Make G_PHI of p0 types legal.

edit: lib/Target/AArch64/AArch64LegalizerInfo.cpp
edit: test/CodeGen/AArch64/GlobalISel/legalize-phi.mir

Commit aeed584ba8b3852b9698c4e61c696f66a47c9687 by ahmed.bougacha:
[AArch64][GlobalISel] Add a test case for G_PHI of p0 regbank selection.

edit: test/CodeGen/AArch64/GlobalISel/regbankselect-default.mir

Commit b4911649c27b963567619e151e9542352c55abed by ahmed.bougacha:
[AArch64][GlobalISel] Add a test case for G_PHI of p0 instruction

edit: test/CodeGen/AArch64/GlobalISel/select-phi.mir

Commit dbc8bd8a9f1f36b0e1095642b77b2ec2a2b61e8d by ahmed.bougacha:
[globalisel] Add support for ValueType operands in patterns.

edit: test/TableGen/GlobalISelEmitter.td
edit: utils/TableGen/GlobalISelEmitter.cpp

Commit f5b476958dcf4b0f194eedb45912ca7a2b779e9e by ahmed.bougacha:
Add a helper to build Copy instructions in MachineIRBuilder

edit: include/llvm/CodeGen/GlobalISel/MachineIRBuilder.h

Commit ddb0525ab61769cabeb32666f1b544e37aee768c by ahmed.bougacha:
[GISel]: Fix generation of illegal COPYs during CallLowering

edit: lib/Target/AArch64/AArch64CallLowering.cpp
edit: test/CodeGen/AArch64/GlobalISel/arm64-irtranslator.ll
edit: test/CodeGen/AArch64/GlobalISel/arm64-fallback.ll
edit: test/CodeGen/AArch64/GlobalISel/arm64-callingconv.ll
edit: test/CodeGen/X86/GlobalISel/irtranslator-callingconv.ll
edit: lib/Target/X86/X86CallLowering.cpp
edit: test/CodeGen/AArch64/GlobalISel/call-translator.ll
edit: test/CodeGen/ARM/GlobalISel/arm-irtranslator.ll
edit: lib/CodeGen/GlobalISel/CallLowering.cpp
edit: test/CodeGen/X86/GlobalISel/callingconv.ll
edit: lib/Target/ARM/ARMCallLowering.cpp
edit: test/CodeGen/X86/GlobalISel/ext-x86-64.ll
edit: test/CodeGen/X86/GlobalISel/add-scalar.ll

Commit 853d5efa2e125ba910438f27c2fa97c238720e9e by ahmed.bougacha:
CodeGen: Add MachineInstr::getMF(). NFC

edit: include/llvm/CodeGen/MachineInstr.h
edit: lib/CodeGen/MachineInstr.cpp

Commit 1148b33b4e59810953d8e58962162cb494fe4a69 by ahmed.bougacha:
CodeGen: Minor cleanups to use MachineInstr::getMF. NFC

edit: include/llvm/CodeGen/GlobalISel/InstructionSelectorImpl.h
edit: lib/CodeGen/GlobalISel/RegisterBankInfo.cpp
edit: include/llvm/CodeGen/GlobalISel/MachineIRBuilder.h

Commit c5786348860c07f84a04a40b691efae256b71b43 by ahmed.bougacha:
[aarch64] Support APInt and APFloat in ImmLeaf subclasses and make

edit: include/llvm/Target/TargetSelectionDAG.td
edit: utils/TableGen/GlobalISelEmitter.cpp
edit: utils/TableGen/CodeGenDAGPatterns.cpp
edit: include/llvm/CodeGen/SelectionDAGNodes.h
edit: lib/Target/AArch64/AArch64InstrFormats.td
edit: include/llvm/ADT/APFloat.h
edit: utils/TableGen/CodeGenDAGPatterns.h

Commit 38375b298ed118b1a45bd9acf69d3193a5f583d1 by ahmed.bougacha:
[Legalizer] Only allocate the SetVectors once per function.

edit: lib/CodeGen/GlobalISel/Legalizer.cpp

Commit 60e0f66f494829b5bdaaad6bdfbc2d2451f28578 by ahmed.bougacha:
[LegalizerInfo] Don't evaluate end boundary every time through the loop

edit: lib/CodeGen/GlobalISel/LegalizerInfo.cpp

Commit 7af7dc243d68656258e0fa2412e877e4a269e639 by ahmed.bougacha:
[Legalizer] Use SmallSetVector instead of SetVector.

edit: lib/CodeGen/GlobalISel/Legalizer.cpp

Commit e0ad7ab774f944e3beab17a5f7340b17f349fb3c by ahmed.bougacha:
[RegisterBankInfo] Cache the getMinimalPhysRegClass information

edit: include/llvm/CodeGen/GlobalISel/RegisterBankInfo.h
edit: lib/CodeGen/GlobalISel/RegisterBankInfo.cpp
edit: lib/CodeGen/GlobalISel/RegBankSelect.cpp

Commit 76705509e758f65c8699077103daf3faf02d2ab5 by ahmed.bougacha:
[globalisel][tablegen] Add support for fpimm and import of APInt/APFloat

edit: test/CodeGen/AArch64/GlobalISel/select-constant.mir
edit: utils/TableGen/CodeGenDAGPatterns.cpp
edit: include/llvm/CodeGen/GlobalISel/InstructionSelector.h
edit: utils/TableGen/CodeGenDAGPatterns.h
edit: include/llvm/CodeGen/GlobalISel/InstructionSelectorImpl.h
edit: include/llvm/Target/GlobalISel/SelectionDAGCompat.td
edit: test/TableGen/GlobalISelEmitter.td
edit: utils/TableGen/GlobalISelEmitter.cpp
edit: lib/Target/AArch64/AArch64InstructionSelector.cpp
edit: lib/Target/X86/X86InstrFPStack.td

Commit 59bd87658a9769fcbe2ce1f9fbdbf5b58ce6f972 by ahmed.bougacha:
[globalisel][tablegen] Fix a use-after free bug that manifests on

edit: utils/TableGen/GlobalISelEmitter.cpp

Commit ced81ed42eed364593df249b9356c2ed66b43e56 by ahmed.bougacha:
[globalisel][tablegen] Simplify named operand/operator lookups and fix a

edit: utils/TableGen/GlobalISelEmitter.cpp
edit: test/TableGen/GlobalISelEmitter.td
edit: include/llvm/CodeGen/GlobalISel/InstructionSelectorImpl.h
edit: include/llvm/CodeGen/GlobalISel/InstructionSelector.h
add: test/CodeGen/X86/GlobalISel/select-blsr.mir

Commit 020ec21c77ca81f02f79e8e9738bc7e39f63ace5 by ahmed.bougacha:
[globalisel][tablegen] Fix undefined references to dump()

edit: include/llvm/CodeGen/GlobalISel/InstructionSelectorImpl.h

Commit 4aeaa403cedb9f3a4913015f14083c36648aa735 by ahmed.bougacha:
[globalisel][tablegen] Fix an unused variable warning caused by a typo

edit: include/llvm/CodeGen/GlobalISel/InstructionSelectorImpl.h

Commit 5094a41c3d625a7aecdd9332cbf163ca1109587d by ahmed.bougacha:
[TableGen] Avoid unnecessary std::string creations

edit: utils/TableGen/CodeGenDAGPatterns.h
edit: utils/TableGen/GlobalISelEmitter.cpp
edit: utils/TableGen/CodeGenDAGPatterns.cpp

Commit 6367eb72a6cf2ffead9f26e411457ab85528bb6d by ahmed.bougacha:
[tablegen] Handle common load/store predicates inside tablegen. NFC.

edit: utils/TableGen/CodeGenDAGPatterns.h
edit: utils/TableGen/GlobalISelEmitter.cpp
edit: utils/TableGen/CodeGenDAGPatterns.cpp
edit: include/llvm/Target/TargetSelectionDAG.td

Commit cfc40f95ec168a3894f14caf97700b9a612cd9a9 by ahmed.bougacha:
[GlobalISel] Update tablegen tests to account for missing r313271.

edit: test/TableGen/GlobalISelEmitter.td

Commit b6505f158283ca5d1ed0409243132b0667d79b7e by ahmed.bougacha:
[X86] Update gisel phi test for copy size changes. NFC.

edit: test/CodeGen/X86/GlobalISel/phi.ll

Commit 99c4cddfcadf6eb13b5024ae81a35ac77f3d0bd1 by huon:
[SILGen] Store conditional conformances in SILWitnessTables.

edit: lib/Serialization/DeserializeSIL.cpp
edit: lib/Serialization/SerializeSIL.cpp
edit: lib/Serialization/Serialization.cpp
edit: include/swift/Serialization/ModuleFormat.h
edit: lib/SILGen/SILGenPoly.cpp
edit: lib/ParseSIL/ParseSIL.cpp
edit: lib/SILOptimizer/IPO/DeadFunctionElimination.cpp
edit: lib/Serialization/SILFormat.h
add: test/SILGen/conditional_conformance.swift
edit: include/swift/SIL/SILWitnessTable.h
edit: lib/SIL/SILPrinter.cpp
edit: lib/SIL/SILWitnessTable.cpp
edit: lib/SILGen/SILGenType.cpp

Commit 51bea6b575e8ce54c96f4a429355b8a2771b8e14 by huon:
[IRGen] Reserve witness table private data space for conditional

edit: lib/IRGen/GenProto.cpp

Commit 4f53475dd96322e4143be6c63afe9a9e88e0668a by huon:
[IRGen] Support fulfilling conformances from conditional requirements.

edit: lib/IRGen/Fulfillment.cpp
edit: lib/IRGen/WitnessIndex.h
edit: lib/IRGen/Fulfillment.h
edit: lib/IRGen/GenProto.cpp
edit: lib/IRGen/MetadataPath.h

Commit b9336c7389371cde3f3da0090442110d7e001472 by huon:
[IRGen] Dynamically fill in conditional conformance wtables.

edit: lib/IRGen/GenDecl.cpp
edit: lib/IRGen/GenProto.cpp
edit: test/IRGen/associated_type_witness.swift
edit: unittests/runtime/Metadata.cpp
edit: include/swift/Runtime/Metadata.h
edit: test/IRGen/partial_apply_forwarder.sil
edit: test/IRGen/witness_method.sil
edit: lib/IRGen/IRGenModule.h
edit: stdlib/public/runtime/ProtocolConformance.cpp
edit: lib/IRGen/IRGenModule.cpp

Commit 306c0dafdddb9c8821804edfb5e184224c64d4df by huon:
fixup! [IRGen] Dynamically fill in conditional conformance wtables.

edit: test/IRGen/partial_apply_forwarder.sil
edit: test/IRGen/witness_method.sil
edit: test/IRGen/associated_type_witness.swift

Commit bdff7aa3f4dcaf783900253758724a64eda13d59 by huon:
[IRGen] Polymorphic convention needs to consider conditional

edit: lib/IRGen/GenProto.cpp

Commit 4743b8ae5c9e8b140ab24c7a59cc02ee587f9c2e by huon:
[IRGen] Pull witness tables out of self witness table in witness_method

edit: lib/IRGen/GenProto.cpp

Commit ae54ac04442aa0fa054573d50e778fb9b1de452f by huon:
[AST] Allow retrieving substitutions from an arbitrary

edit: lib/AST/ProtocolConformance.cpp
edit: include/swift/AST/ProtocolConformance.h
edit: lib/SILOptimizer/Utils/Devirtualize.cpp

Commit 901bd35e5a86f963346a8e88c7ebbb6214c3e2c2 by huon:
[IRGen] Pass witness tables for conditional conformances to witness

edit: lib/AST/ProtocolConformance.cpp
edit: test/IRGen/protocol_resilience.sil
edit: lib/IRGen/GenProto.cpp
add: test/IRGen/conditional_conformance_with_assoc.swift
edit: test/IRGen/associated_type_witness.swift
add: test/IRGen/conditional_conformance_basic_conformances.swift

Commit b3088e2d84c17163b90d1646e83cc70b10fc6489 by aprantl:
Un-XFAIL and update test.

edit: test/DebugInfo/basic.swift

Commit 1372202cfa9b8dcc44a5cb314af968c9370e37ee by huon:
[test] More for conditional conformances; subclasses, devirtualization,

add: test/Inputs/conditional_conformance_subclass.swift
add: test/Interpreter/conditional_conformances_smoke.swift
add: test/Interpreter/conditional_conformances.swift
edit: test/SILGen/conditional_conformance.swift
delete: test/IRGen/conditional_conformance_basic_conformances.swift
add: test/IRGen/conditional_conformances.swift
add: test/Inputs/conditional_conformance_with_assoc.swift
edit: test/Generics/conditional_conformances.swift
add: test/SILOptimizer/devirt_conditional_conformance.swift
add: test/Interpreter/conditional_conformances_modules.swift
delete: test/IRGen/conditional_conformance_with_assoc.swift
add: test/Inputs/conditional_conformance_basic_conformances.swift

Commit 6dd8bec47e4c3e09c01db79e7b86a33b6477dc28 by huon:
[AST] Unify computation of 'has arguments?' for witness table accessors.

edit: lib/IRGen/GenDecl.cpp
edit: lib/IRGen/GenProto.cpp
edit: include/swift/AST/ProtocolConformance.h
edit: lib/AST/ProtocolConformance.cpp

Commit a94df16b629650c008ee9ccb735032ed42ae4cd5 by huon:
[test] Add more tests for inheriting conformances etc from SE0143

add: test/Generics/conditional_conformances_execute_smoke.swift
edit: test/Generics/conditional_conformances.swift

Commit 67c9fa3daeb4c24fba388b8119f6668be014f5fd by huon:
[test] Add test for parsing @convention(witness_method: ) in

add: test/SIL/Parser/witness_method.sil

Commit b993c113e58a77985959437632f91b1e13d9eb06 by anemet:
Test debug output of Generic Specializer pass

add: test/SILOptimizer/partial_specialization_debug.sil

Commit e74367f2b377ed7ef09861c256287639ecc94aba by gottesmm:
[pred-memopt] Only promote destroy_addr if we know that otherwise the

edit: test/DebugInfo/linetable-cleanups.swift
edit: test/SILOptimizer/definite_init_failable_initializers_objc.swift
edit: test/SILOptimizer/predictable_memopt.sil
edit: test/IRGen/superclass_constraint.swift
edit: lib/SILOptimizer/Mandatory/PredictableMemOpt.cpp
edit: test/SILOptimizer/definite_init_failable_initializers.swift
edit: test/DebugInfo/return.swift
edit: test/SILOptimizer/definite_init_protocol_init.swift

Commit 578fca1ee3fd21592f34613d662c351e60323ebd by aprantl:
Move the logic for ignoring the debug locations for closure setup code

edit: lib/SIL/SILLocation.cpp
edit: test/SILGen/objc_thunks.swift
edit: lib/SILGen/SILGenExpr.cpp
edit: lib/IRGen/IRGenDebugInfo.cpp

Commit b998c103fc224f47a743f889712d0e8fcea5d9e6 by aprantl:
Debug Info: Associate a function call with the beginning of the

edit: test/DebugInfo/patternmatching.swift
edit: test/DebugInfo/inlinedAt.swift
edit: lib/SIL/SILLocation.cpp
edit: lib/SILGen/SILGenApply.cpp
edit: test/DebugInfo/linetable.swift
edit: test/DebugInfo/callexpr.swift

Commit a71a03986eb81e07968e79171ef44673f5333640 by github:
libSyntax: Start parsing simple identifier expression. (#12862)

edit: test/Syntax/Outputs/round_trip_parse_gen.swift.withkinds
edit: utils/gyb_syntax_support/ExprNodes.py
edit: lib/Parse/ParseExpr.cpp
edit: lib/Syntax/SyntaxParsingContext.cpp

Commit f552f559697a3b520ba18fced8ee7d322d8bcb7f by xi_ge:
Update SwiftSyntax's expectations now that -emit-syntax is emitting a

edit: tools/SwiftSyntax/SwiftSyntax.swift

Commit dcef91680c4f4a2b84d869f38c647065640b859c by eeckstein:
cmpcodesize: replace the Ounchecked with the Osize benchmark shortcut.

edit: utils/cmpcodesize/cmpcodesize/main.py

Commit 773e6bff56efcd96881f411c8312c6dc49ef68b6 by spestov:
SIL: Add SILFunction::getResilienceExpansion()

edit: include/swift/SIL/SILFunction.h

Commit 0b895bbf44f271ff432df374372b78e7000f50d5 by spestov:
SILGen: Use resilience expansion when deciding if we need to use

edit: test/SILGen/struct_resilience.swift
edit: lib/SILGen/SILGenLValue.cpp

Commit 9de7a21e8e26b3bc0c90ea189e0966e4b08f28f5 by spestov:
SILGen: Use SILFunction's resilience expansion when evaluating enum

edit: test/SILGen/enum_resilience.swift
edit: lib/SILGen/SILGenPattern.cpp

Commit 697b19570b2a91480e926706034f5e6dfadb79d4 by github:
Update Xcode version to Xcode 9.1 GM

edit: README.md