[Swift CI] Build Failure: 0. OSS - LLDB Incremental - OS X (master) #3439


(Daniel Dunbar) #1

I don't see how my change (to build-script support infrastructure) could be related to this failure.

- Daniel

···

On Jun 1, 2016, at 10:14 PM, no-reply@swift.org wrote:

[FAILURE] oss-lldb-incremental-osx [#3439]

Build URL: https://ci.swift.org/job/oss-lldb-incremental-osx/3439/
Project: oss-lldb-incremental-osx
Date of build: Wed, 01 Jun 2016 21:29:16 -0700
Build duration: 45 min

Changes

Commit 01a1559895b0952474378bb028402fe41b6c2088 by daniel_dunbar:
[utils] Improve swift_build_support.shell failure messages.

edit: utils/swift_build_support/tests/test_tar.py
edit: utils/swift_build_support/swift_build_support/shell.py


(Daniel Dunbar) #2

It passed on the next run, I filed:
  <rdar://problem/26594863> Non-deterministic test failures

- Daniel

···

On Jun 1, 2016, at 10:16 PM, Daniel Dunbar <daniel_dunbar@apple.com> wrote:

I don't see how my change (to build-script support infrastructure) could be related to this failure.

- Daniel

On Jun 1, 2016, at 10:14 PM, no-reply@swift.org <mailto:no-reply@swift.org> wrote:

[FAILURE] oss-lldb-incremental-osx [#3439]

Build URL: https://ci.swift.org/job/oss-lldb-incremental-osx/3439/
Project: oss-lldb-incremental-osx
Date of build: Wed, 01 Jun 2016 21:29:16 -0700
Build duration: 45 min

Changes

Commit 01a1559895b0952474378bb028402fe41b6c2088 by daniel_dunbar:
[utils] Improve swift_build_support.shell failure messages.

edit: utils/swift_build_support/tests/test_tar.py
edit: utils/swift_build_support/swift_build_support/shell.py


(Todd Fiala) #3

Yep, looks like it cleared after that.

The test failed twice during that run. It would be good for us to track down what happened there.

···

On 1 Jun 2016, at 22:16, Daniel Dunbar via swift-lldb-dev wrote:

I don't see how my change (to build-script support infrastructure) could be related to this failure.

- Daniel

On Jun 1, 2016, at 10:14 PM, no-reply@swift.org wrote:

[FAILURE] oss-lldb-incremental-osx [#3439]

Build URL: https://ci.swift.org/job/oss-lldb-incremental-osx/3439/
Project: oss-lldb-incremental-osx
Date of build: Wed, 01 Jun 2016 21:29:16 -0700
Build duration: 45 min

Changes

Commit 01a1559895b0952474378bb028402fe41b6c2088 by daniel_dunbar:
[utils] Improve swift_build_support.shell failure messages.

edit: utils/swift_build_support/tests/test_tar.py
edit: utils/swift_build_support/swift_build_support/shell.py

_______________________________________________
swift-lldb-dev mailing list
swift-lldb-dev@swift.org
https://lists.swift.org/mailman/listinfo/swift-lldb-dev