[Swift CI] Build Failure: 0. OSS - LLDB Incremental - OS X (master) #2335


(Michael Ilseman) #1

This is an lldb failure, but I am the only one in the blame list. Is this non-deterministic?

[TestFloatTypesExpr.py FAILED]
Command invoked: /usr/bin/python /Users/buildnode/jenkins/workspace/oss-lldb-incremental-osx/lldb/test/dotest.py --executable /Users/buildnode/jenkins/workspace/oss-lldb-incremental-osx/Ninja-DebugAssert/lldb-macosx-x86_64/CustomSwift-Debug/lldb --rerun-all-issues -C

···

On Apr 2, 2016, at 2:54 PM, no-reply@swift.org wrote:

[FAILURE] oss-lldb-incremental-osx [#2335]

Build URL: https://ci.swift.org/job/oss-lldb-incremental-osx/2335/
Project: oss-lldb-incremental-osx
Date of build: Sat, 02 Apr 2016 14:00:22 -0700
Build duration: 53 min
Identified problems:

Timeout: This build was marked as FAIL because it timed out.
Indication 1 <https://ci.swift.org//job/oss-lldb-incremental-osx/2335/consoleFull#48404671756633f0f-8823-4f82-9a4a-0c0d97ce7760>
Regression test failed: This build failed because a regression test in the test suite FAILed. Below is a list of all errors:
Indication 1 <https://ci.swift.org//job/oss-lldb-incremental-osx/2335/consoleFull#-1953079816fca400bf-2f4a-462e-b517-e058d770b2d7>
Changes

Commit 612703ed08f9546d2947eadef280a717bd067818 by milseman:
[Import as member] Default initialize new attribute to false

edit: lib/Basic/Module.cpp


(Todd Fiala) #2

I'm not near a computer so this is just speculation: I see two failures listed. One seems to be a timeout. It is conceivable this boils down to a intermittent issue. Can you kick off a new build? We can wait for that result.

-Todd

···

On Apr 2, 2016, at 2:57 PM, Michael Ilseman <milseman@apple.com> wrote:

This is an lldb failure, but I am the only one in the blame list. Is this non-deterministic?

[TestFloatTypesExpr.py FAILED]
Command invoked: /usr/bin/python /Users/buildnode/jenkins/workspace/oss-lldb-incremental-osx/lldb/test/dotest.py --executable /Users/buildnode/jenkins/workspace/oss-lldb-incremental-osx/Ninja-DebugAssert/lldb-macosx-x86_64/CustomSwift-Debug/lldb --rerun-all-issues -C

On Apr 2, 2016, at 2:54 PM, no-reply@swift.org wrote:

[FAILURE] oss-lldb-incremental-osx [#2335]

Build URL: https://ci.swift.org/job/oss-lldb-incremental-osx/2335/
Project: oss-lldb-incremental-osx
Date of build: Sat, 02 Apr 2016 14:00:22 -0700
Build duration: 53 min
Identified problems:

Timeout: This build was marked as FAIL because it timed out.
Indication 1
Regression test failed: This build failed because a regression test in the test suite FAILed. Below is a list of all errors:
Indication 1

Changes

Commit 612703ed08f9546d2947eadef280a717bd067818 by milseman:
[Import as member] Default initialize new attribute to false

edit: lib/Basic/Module.cpp