[Swift CI] Build Failure: 0. OSS - LLDB Incremental - OS X (master) #1791


(Ben Langmuir) #1

This doesn’t look like me.
ERROR: testREPL (TestREPLBreakpoints.REPLBreakpointsTestCase)

Looking over the history, this seems to fail randomly. Could someone from lldb please fix or disable this test?

Ben

···

On Feb 24, 2016, at 2:54 PM, no-reply@swift.org wrote:

[FAILURE] oss-lldb-incremental-osx [#1791]

Build URL: https://ci.swift.org/job/oss-lldb-incremental-osx/1791/
Project: oss-lldb-incremental-osx
Date of build: Wed, 24 Feb 2016 15:16:07 -0600
Build duration: 1 hr 38 min
Identified problems:

Regression test failed: This build failed because a regression test in the test suite FAILed. Below is a list of all errors:
Indication 1 <https://ci.swift.org//job/oss-lldb-incremental-osx/1791/consoleFull#52861713fca400bf-2f4a-462e-b517-e058d770b2d7>
Changes

Commit 184efb5e1cf42b56bfde838da3e34a7a1e911a1f by blangmuir:
[SourceKit] Differentiate decl.var.local from decl.var.parameter

edit: tools/SourceKit/lib/SwiftLang/SwiftLangSupport.cpp
edit: test/SourceKit/SourceDocInfo/cursor_info.swift

Commit 3e9bfa137d6bc883f8770dd71df9564a37eb3da4 by blangmuir:
[SourceKit] Add decl.var.parameters entries to the fully annotated decl

edit: lib/AST/ASTPrinter.cpp
edit: test/SourceKit/SourceDocInfo/cursor_info.swift
edit: tools/SourceKit/lib/SwiftLang/SwiftDocSupport.cpp
edit: test/IDE/Inputs/mock-sdk/Foo.annotated.txt
edit: lib/IDE/ModuleInterfacePrinting.cpp
edit: test/IDE/print_synthesized_extensions.swift


(Todd Fiala) #2

This test is flapping. Not likely you but we (on LLDB) need to figure out why it is failing. We have a rerun in there, so it is failing twice.

-Todd

···

On Feb 24, 2016, at 3:02 PM, Ben Langmuir via swift-lldb-dev <swift-lldb-dev@swift.org> wrote:

This doesn’t look like me.
ERROR: testREPL (TestREPLBreakpoints.REPLBreakpointsTestCase)

Looking over the history, this seems to fail randomly. Could someone from lldb please fix or disable this test?

Ben

On Feb 24, 2016, at 2:54 PM, no-reply@swift.org wrote:

[FAILURE] oss-lldb-incremental-osx [#1791]

Build URL: https://ci.swift.org/job/oss-lldb-incremental-osx/1791/
Project: oss-lldb-incremental-osx
Date of build: Wed, 24 Feb 2016 15:16:07 -0600
Build duration: 1 hr 38 min
Identified problems:

Regression test failed: This build failed because a regression test in the test suite FAILed. Below is a list of all errors:
Indication 1

Changes

Commit 184efb5e1cf42b56bfde838da3e34a7a1e911a1f by blangmuir:
[SourceKit] Differentiate decl.var.local from decl.var.parameter

edit: tools/SourceKit/lib/SwiftLang/SwiftLangSupport.cpp
edit: test/SourceKit/SourceDocInfo/cursor_info.swift

Commit 3e9bfa137d6bc883f8770dd71df9564a37eb3da4 by blangmuir:
[SourceKit] Add decl.var.parameters entries to the fully annotated decl

edit: lib/AST/ASTPrinter.cpp
edit: test/SourceKit/SourceDocInfo/cursor_info.swift
edit: tools/SourceKit/lib/SwiftLang/SwiftDocSupport.cpp
edit: test/IDE/Inputs/mock-sdk/Foo.annotated.txt
edit: lib/IDE/ModuleInterfacePrinting.cpp
edit: test/IDE/print_synthesized_extensions.swift

_______________________________________________
swift-lldb-dev mailing list
swift-lldb-dev@swift.org
https://lists.swift.org/mailman/listinfo/swift-lldb-dev


(Todd Fiala) #3

I’m going to mark this one as XFAIL and file a radar on it.

-Todd

···

On Feb 24, 2016, at 6:01 PM, Todd Fiala via swift-lldb-dev <swift-lldb-dev@swift.org> wrote:

This test is flapping. Not likely you but we (on LLDB) need to figure out why it is failing. We have a rerun in there, so it is failing twice.

-Todd

On Feb 24, 2016, at 3:02 PM, Ben Langmuir via swift-lldb-dev <swift-lldb-dev@swift.org <mailto:swift-lldb-dev@swift.org>> wrote:

This doesn’t look like me.
ERROR: testREPL (TestREPLBreakpoints.REPLBreakpointsTestCase)

Looking over the history, this seems to fail randomly. Could someone from lldb please fix or disable this test?

Ben

On Feb 24, 2016, at 2:54 PM, no-reply@swift.org <mailto:no-reply@swift.org> wrote:

[FAILURE] oss-lldb-incremental-osx [#1791]

Build URL: https://ci.swift.org/job/oss-lldb-incremental-osx/1791/
Project: oss-lldb-incremental-osx
Date of build: Wed, 24 Feb 2016 15:16:07 -0600
Build duration: 1 hr 38 min
Identified problems:

Regression test failed: This build failed because a regression test in the test suite FAILed. Below is a list of all errors:
Indication 1 <https://ci.swift.org//job/oss-lldb-incremental-osx/1791/consoleFull#52861713fca400bf-2f4a-462e-b517-e058d770b2d7>
Changes

Commit 184efb5e1cf42b56bfde838da3e34a7a1e911a1f by blangmuir:
[SourceKit] Differentiate decl.var.local from decl.var.parameter

edit: tools/SourceKit/lib/SwiftLang/SwiftLangSupport.cpp
edit: test/SourceKit/SourceDocInfo/cursor_info.swift

Commit 3e9bfa137d6bc883f8770dd71df9564a37eb3da4 by blangmuir:
[SourceKit] Add decl.var.parameters entries to the fully annotated decl

edit: lib/AST/ASTPrinter.cpp
edit: test/SourceKit/SourceDocInfo/cursor_info.swift
edit: tools/SourceKit/lib/SwiftLang/SwiftDocSupport.cpp
edit: test/IDE/Inputs/mock-sdk/Foo.annotated.txt
edit: lib/IDE/ModuleInterfacePrinting.cpp
edit: test/IDE/print_synthesized_extensions.swift

_______________________________________________
swift-lldb-dev mailing list
swift-lldb-dev@swift.org <mailto:swift-lldb-dev@swift.org>
https://lists.swift.org/mailman/listinfo/swift-lldb-dev

_______________________________________________
swift-lldb-dev mailing list
swift-lldb-dev@swift.org
https://lists.swift.org/mailman/listinfo/swift-lldb-dev


(Todd Fiala) #4

We already had a radar on this for Ubuntu. I’ve added OS X to it:
<rdar://problem/23091701> [test] [linux] repl/breakpoints fails

It’s now marked XFAIL on OS X.

-Todd

···

On Feb 25, 2016, at 9:51 AM, Todd Fiala via swift-lldb-dev <swift-lldb-dev@swift.org> wrote:

I’m going to mark this one as XFAIL and file a radar on it.

-Todd

On Feb 24, 2016, at 6:01 PM, Todd Fiala via swift-lldb-dev <swift-lldb-dev@swift.org <mailto:swift-lldb-dev@swift.org>> wrote:

This test is flapping. Not likely you but we (on LLDB) need to figure out why it is failing. We have a rerun in there, so it is failing twice.

-Todd

On Feb 24, 2016, at 3:02 PM, Ben Langmuir via swift-lldb-dev <swift-lldb-dev@swift.org <mailto:swift-lldb-dev@swift.org>> wrote:

This doesn’t look like me.
ERROR: testREPL (TestREPLBreakpoints.REPLBreakpointsTestCase)

Looking over the history, this seems to fail randomly. Could someone from lldb please fix or disable this test?

Ben

On Feb 24, 2016, at 2:54 PM, no-reply@swift.org <mailto:no-reply@swift.org> wrote:

[FAILURE] oss-lldb-incremental-osx [#1791]

Build URL: https://ci.swift.org/job/oss-lldb-incremental-osx/1791/
Project: oss-lldb-incremental-osx
Date of build: Wed, 24 Feb 2016 15:16:07 -0600
Build duration: 1 hr 38 min
Identified problems:

Regression test failed: This build failed because a regression test in the test suite FAILed. Below is a list of all errors:
Indication 1 <https://ci.swift.org//job/oss-lldb-incremental-osx/1791/consoleFull#52861713fca400bf-2f4a-462e-b517-e058d770b2d7>
Changes

Commit 184efb5e1cf42b56bfde838da3e34a7a1e911a1f by blangmuir:
[SourceKit] Differentiate decl.var.local from decl.var.parameter

edit: tools/SourceKit/lib/SwiftLang/SwiftLangSupport.cpp
edit: test/SourceKit/SourceDocInfo/cursor_info.swift

Commit 3e9bfa137d6bc883f8770dd71df9564a37eb3da4 by blangmuir:
[SourceKit] Add decl.var.parameters entries to the fully annotated decl

edit: lib/AST/ASTPrinter.cpp
edit: test/SourceKit/SourceDocInfo/cursor_info.swift
edit: tools/SourceKit/lib/SwiftLang/SwiftDocSupport.cpp
edit: test/IDE/Inputs/mock-sdk/Foo.annotated.txt
edit: lib/IDE/ModuleInterfacePrinting.cpp
edit: test/IDE/print_synthesized_extensions.swift

_______________________________________________
swift-lldb-dev mailing list
swift-lldb-dev@swift.org <mailto:swift-lldb-dev@swift.org>
https://lists.swift.org/mailman/listinfo/swift-lldb-dev

_______________________________________________
swift-lldb-dev mailing list
swift-lldb-dev@swift.org <mailto:swift-lldb-dev@swift.org>
https://lists.swift.org/mailman/listinfo/swift-lldb-dev

_______________________________________________
swift-lldb-dev mailing list
swift-lldb-dev@swift.org
https://lists.swift.org/mailman/listinfo/swift-lldb-dev