Re: [Swift CI] Build Still Failing: 0. OSS - Swift Incremental RA - Ubuntu 16.04 (master) #2813

clang-5.0: error: unable to execute command: Bus error (core dumped)
clang-5.0: error: linker command failed due to signal (use -v to see invocation)
<unknown>:0: error: link command failed with exit code 254 (use -v to see invocation)

Looks like a problem with clang or bot itself?

Took the node offline