Re: [Swift CI] Build Failure: 0. OSS - Swift Incremental RA - Ubuntu 16.04 (master) #8253

00:42:36.205 Test Case 'MiscellaneousTestCase.testPackageManagerDefineAndXArgs' started at 2019-04-17 07:28:27.060

00:42:36.205 Building Debug

00:42:36.205

/home/buildnode/jenkins/workspace/oss-swift-incremental-RA-linux-ubuntu-16_04/swiftpm/Tests/FunctionalTests/MiscellaneousTests.swift:111: error: MiscellaneousTestCase.testPackageManagerDefineAndXArgs : failed - `swift build -c Debug' failed:

00:42:36.205

00:42:36.205 executionFailure(error: terminated(1): /home/buildnode/jenkins/workspace/oss-swift-incremental-RA-linux-ubuntu-16_04/buildbot_incremental/swiftpm-linux-x86_64/x86_64-unknown-linux/release/swift-build --package-path /tmp/Miscellaneous_-DSWIFT_PACKAGE.k4FMX2/Miscellaneous_-DSWIFT_PACKAGE --configuration debug -Xcc -DEXTRA_C_DEFINE=2 -Xswiftc -DEXTRA_SWIFTC_DEFINE output:

00:42:36.205 [1/2] Compiling CLib foo.c

00:42:36.205 [2/3] Compiling SwiftExec main.swift

00:42:36.205 :0: warning: missing submodule 'CLib'

00:42:36.205

/tmp/Miscellaneous_-DSWIFT_PACKAGE.k4FMX2/Miscellaneous_-DSWIFT_PACKAGE/Sources/SwiftExec/main.swift:1:8: error: no such module 'CLib'

00:42:36.205 import CLib

00:42:36.205 ^

00:42:36.205 , output: "[1/2] Compiling CLib foo.c\n[2/3] Compiling SwiftExec main.swift\n:0: warning: missing submodule 'CLib'\n/tmp/Miscellaneous_-DSWIFT_PACKAGE.k4FMX2/Miscellaneous_-DSWIFT_PACKAGE/Sources/SwiftExec/main.swift:1:8: error: no such module 'CLib'\nimport CLib\n ^\n", stderr: "")

00:42:36.205

00:42:36.205 Building Release

00:42:36.205 /home/buildnode/jenkins/workspace/oss-swift-incremental-RA-linux-ubuntu-16_04/swiftpm/Tests/FunctionalTests/MiscellaneousTests.swift:111: error: MiscellaneousTestCase.testPackageManagerDefineAndXArgs : failed - `swift build -c Release' failed:

00:42:36.205

00:42:36.205 executionFailure(error: terminated(1): /home/buildnode/jenkins/workspace/oss-swift-incremental-RA-linux-ubuntu-16_04/buildbot_incremental/swiftpm-linux-x86_64/x86_64-unknown-linux/release/swift-build --package-path /tmp/Miscellaneous_-DSWIFT_PACKAGE.k4FMX2/Miscellaneous_-DSWIFT_PACKAGE --configuration release -Xcc -DEXTRA_C_DEFINE=2 -Xswiftc -DEXTRA_SWIFTC_DEFINE output:

00:42:36.205 [1/2] Compiling CLib foo.c

00:42:36.205 [2/3] Compiling SwiftExec main.swift

00:42:36.205 :0: warning: missing submodule 'CLib'

00:42:36.205

/tmp/Miscellaneous_-DSWIFT_PACKAGE.k4FMX2/Miscellaneous_-DSWIFT_PACKAGE/Sources/SwiftExec/main.swift:1:8: error: no such module 'CLib'

00:42:36.205 import CLib

00:42:36.205 ^

00:42:36.205 , output: "[1/2] Compiling CLib foo.c\n[2/3] Compiling SwiftExec main.swift\n:0: warning: missing submodule 'CLib'\n/tmp/Miscellaneous_-DSWIFT_PACKAGE.k4FMX2/Miscellaneous_-DSWIFT_PACKAGE/Sources/SwiftExec/main.swift:1:8: error: no such module 'CLib'\nimport CLib\n ^\n", stderr: "")

00:42:36.205

00:42:36.205 Test Case 'MiscellaneousTestCase.testPackageManagerDefineAndXArgs' failed (5.588 seconds)

Thanks,

Mishal Shah

Terms of Service

Privacy Policy

Cookie Policy